{"text_format":"1","workbook":"xlsx","n_sheets":22,"sheets":["COVER PAGE","General Instructions","CB30ASCL","CB30ASCL2","CBTT VALIDATION","PAGE1","PAGE2","PAGE3","PAGE4","PAGE5","PAGE6","PAGE7","PAGE8","PAGE9","PAGE10","PAGE11","PAGE12","PAGE13","PAGE14","PAGE15","PAGE16","Controls"],"not_rendered":{"charts":0,"images":1,"macros":1,"external_links":6,"defined_names":273,"comments":3,"pivot_tables":0},"unopened":[],"bounds":{"document_bytes":16777216,"sheet_cells":100000,"rows_first":2000,"rows_last":500,"rows_between":2000,"halvings":0,"cell_chars":16384,"cell_head_chars":4096},"cells_cut":0,"cells_raw":0,"read":"whole","date_system":"1900"}

{"sheet":"COVER PAGE","index":0,"n_rows":13,"n_cols":6,"rows_kept":13,"cut":false,"hidden":false,"merged":[[12,5,12,6],[7,2,7,9],[8,2,8,4],[8,7,8,9],[10,2,10,9],[11,4,11,7],[8,5,8,6],[9,5,9,6],[6,2,6,9],[1,2,1,9],[2,2,2,9],[3,2,3,9],[4,2,4,9],[5,2,5,9]]}
[]
[null,null,"CENTRAL BANK OF TRINIDAD AND TOBAGO "]
[null,null,"V1.2"]
[null,null,"CB30 RETURN"]
[]
[null,null,"FOR "]
[null,null,"SELECT INSTITUTION"]
[null,null,"For the Quarter Ended:"]
[null,null,"Month ",null,null,"September"]
[null,null,null,null,"Year","2024-01-01"]
[null,null,"Date Submitted:"]
[null,null,null,null,"10/28/2024"]
[null,null,null,null,null,"Type mm/dd/yyyy"]

{"sheet":"General Instructions","index":1,"n_rows":29,"n_cols":2,"rows_kept":29,"cut":false,"hidden":false,"merged":[]}
[null,"CB30 RETURN"]
[null,"Please use the CB30 instructions to complete the return using the link below. "]
[null,"CB30 INSTRUCTIONS"]
[]
[null,"GENERAL INSTRUCTIONS"]
[1,"Do not amend the structure/format."]
[2,"Do not remove the password protection."]
[3,"Do not manipulate the formulas."]
[4,"Complete Cover Page before submission. \nInstitution, reporting quarter and date submitted must be populated. "]
[5,"No blank cells.  All cells must be populated with zero where there is no data."]
[6,"N/A, N/D, NA/ND, NA and ND cannot be used in the return."]
[7,"Do not use text except for details required for data cells (Page 6 - (Column B) - Other, Page 16 - Other (Specify)  (Column B)."]
[8,"Reported rates should be recorded as a number only and not words for Pages 11,12,14 and 15 - Maximum Rate (Column A).  For example, if the rate is 10%, it should be entered as “10” (not as 0.10, ten per cent or 10%)."]
[9,"Reported years should be recorded as a number only and not words for Page 13 - Maximum Period (Column A).  For example, if the period is 24 years, it should be entered as \"24\" (not as 24 years)."]
[10,"Do not use symbols in cells (<, >, commas, full stops, apostrophe, tilde etc.)."]
{"$rows_left_out":15}
{"sheet":"CB30ASCL","index":2,"n_rows":548,"n_cols":7,"rows_kept":548,"cut":false,"hidden":true,"merged":[]}
["hdr","cb30",{"$f":"VLOOKUP('COVER PAGE'!C7,Controls!$B$4:$C$27,2,FALSE)","v":{"$error":"#N/A"}},{"$f":"PAGE1!$J$11","v":"3n"}]
[{"$f":"VLOOKUP('COVER PAGE'!F9,Controls!$D$4:$E$7,2,FALSE)","v":9}]
[{"$f":"'COVER PAGE'!$F$10","v":"2024-01-01"}]
["sect1","NUM","VAL"]
[{"$f":"C1&\".E30.REM.PBSEC.APPR.LT300\"","v":{"$error":"#N/A"}},{"$f":"ROUND(PAGE1!$G$27,5)","v":0},{"$f":"ROUND(PAGE1!$I$27,5)","v":0}]
[{"$f":"C1&\".E30.REM.PBSEC.DISB.LT300\"","v":{"$error":"#N/A"}},{"$f":"ROUND(PAGE1!$K$27,5)","v":0},{"$f":"ROUND(PAGE1!$M$27,5)","v":0}]
[{"$f":"C1&\".E30.REM.PBSEC.OS.LT300\"","v":{"$error":"#N/A"}},{"$f":"ROUND(PAGE1!$O$27,5)","v":0},{"$f":"ROUND(PAGE1!$Q$27,5)","v":0}]
[{"$f":"C1&\".E30.REM.PBSEC.APPR.300TO450\"","v":{"$error":"#N/A"}},{"$f":"ROUND(PAGE1!$G$28,5)","v":0},{"$f":"ROUND(PAGE1!$I$28,5)","v":0}]
[{"$f":"C1&\".E30.REM.PBSEC.DISB.300TO450\"","v":{"$error":"#N/A"}},{"$f":"ROUND(PAGE1!$K$28,5)","v":0},{"$f":"ROUND(PAGE1!$M$28,5)","v":0}]
[{"$f":"C1&\".E30.REM.PBSEC.OS.300TO450\"","v":{"$error":"#N/A"}},{"$f":"ROUND(PAGE1!$O$28,5)","v":0},{"$f":"ROUND(PAGE1!$Q$28,5)","v":0}]
[{"$f":"C1&\".E30.REM.PBSEC.APPR.OVR450\"","v":{"$error":"#N/A"}},{"$f":"ROUND(PAGE1!$G$29,5)","v":0},{"$f":"ROUND(PAGE1!$I$29,5)","v":0}]
[{"$f":"C1&\".E30.REM.PBSEC.DISB.OVR450\"","v":{"$error":"#N/A"}},{"$f":"ROUND(PAGE1!$K$29,5)","v":0},{"$f":"ROUND(PAGE1!$M$29,5)","v":0}]
[{"$f":"C1&\".E30.REM.PBSEC.OS.OVR450\"","v":{"$error":"#N/A"}},{"$f":"ROUND(PAGE1!$O$29,5)","v":0},{"$f":"ROUND(PAGE1!$Q$29,5)","v":0}]
[{"$f":"C1&\".E30.REM.PBSEC.APPR.TTL\"","v":{"$error":"#N/A"}},{"$f":"ROUND(PAGE1!$G$26,5)","v":0},{"$f":"ROUND(PAGE1!$I$26,5)","v":0}]
[{"$f":"C1&\".E30.REM.PBSEC.DISB.TTL\"","v":{"$error":"#N/A"}},{"$f":"ROUND(PAGE1!$K$26,5)","v":0},{"$f":"ROUND(PAGE1!$M$26,5)","v":0}]
{"$rows_left_out":534}
{"sheet":"CB30ASCL2","index":3,"n_rows":581,"n_cols":7,"rows_kept":581,"cut":false,"hidden":true,"merged":[]}
["hdr","cb30",{"$f":"VLOOKUP('COVER PAGE'!C7,Controls!$B$4:$C$27,2,FALSE)","v":{"$error":"#N/A"}},{"$f":"PAGE1!$J$11","v":"3n"}]
[{"$f":"VLOOKUP('COVER PAGE'!F9,Controls!$D$4:$E$7,2,FALSE)","v":9}]
[{"$f":"'COVER PAGE'!$F$10","v":"2024-01-01"}]
["sect1","NUM","VAL"]
[{"$f":"C1&\".E30.REM.PBSEC.APPR.LT300\"","v":{"$error":"#N/A"}},{"$f":"ROUND(PAGE1!$G$27,5)","v":0},{"$f":"ROUND(PAGE1!$I$27,5)","v":0}]
[{"$f":"C1&\".E30.REM.PBSEC.DISB.LT300\"","v":{"$error":"#N/A"}},{"$f":"ROUND(PAGE1!$K$27,5)","v":0},{"$f":"ROUND(PAGE1!$M$27,5)","v":0}]
[{"$f":"C1&\".E30.REM.PBSEC.OS.LT300\"","v":{"$error":"#N/A"}},{"$f":"ROUND(PAGE1!$O$27,5)","v":0},{"$f":"ROUND(PAGE1!$Q$27,5)","v":0}]
[{"$f":"C1&\".E30.REM.PBSEC.APPR.300TO450\"","v":{"$error":"#N/A"}},{"$f":"ROUND(PAGE1!$G$28,5)","v":0},{"$f":"ROUND(PAGE1!$I$28,5)","v":0}]
[{"$f":"C1&\".E30.REM.PBSEC.DISB.300TO450\"","v":{"$error":"#N/A"}},{"$f":"ROUND(PAGE1!$K$28,5)","v":0},{"$f":"ROUND(PAGE1!$M$28,5)","v":0}]
[{"$f":"C1&\".E30.REM.PBSEC.OS.300TO450\"","v":{"$error":"#N/A"}},{"$f":"ROUND(PAGE1!$O$28,5)","v":0},{"$f":"ROUND(PAGE1!$Q$28,5)","v":0}]
[{"$f":"C1&\".E30.REM.PBSEC.APPR.OVR450\"","v":{"$error":"#N/A"}},{"$f":"ROUND(PAGE1!$G$29,5)","v":0},{"$f":"ROUND(PAGE1!$I$29,5)","v":0}]
[{"$f":"C1&\".E30.REM.PBSEC.DISB.OVR450\"","v":{"$error":"#N/A"}},{"$f":"ROUND(PAGE1!$K$29,5)","v":0},{"$f":"ROUND(PAGE1!$M$29,5)","v":0}]
[{"$f":"C1&\".E30.REM.PBSEC.OS.OVR450\"","v":{"$error":"#N/A"}},{"$f":"ROUND(PAGE1!$O$29,5)","v":0},{"$f":"ROUND(PAGE1!$Q$29,5)","v":0}]
[{"$f":"C1&\".E30.REM.PBSEC.APPR.TTL\"","v":{"$error":"#N/A"}},{"$f":"ROUND(PAGE1!$G$26,5)","v":0},{"$f":"ROUND(PAGE1!$I$26,5)","v":0}]
[{"$f":"C1&\".E30.REM.PBSEC.DISB.TTL\"","v":{"$error":"#N/A"}},{"$f":"ROUND(PAGE1!$K$26,5)","v":0},{"$f":"ROUND(PAGE1!$M$26,5)","v":0}]
{"$rows_left_out":567}
{"sheet":"CBTT VALIDATION","index":4,"n_rows":233,"n_cols":3,"rows_kept":233,"cut":false,"hidden":false,"merged":[[1,1,2,1]]}
["DATE CHECK",{"$f":"(TEXT(MID(RIGHT(MID(CELL(\"filename\",'COVER PAGE'!A1),FIND(\"[\",CELL(\"filename\",'COVER PAGE'!A1))+1,FIND(\"]\", CELL(\"filename\",'COVER PAGE'!A1))-FIND(\"[\",CELL(\"filename\",'COVER PAGE'!A1))-1),LEN(MID(CELL(\"filename\",'COVER PAGE'!A1),FIND(\"[\",CELL(\"filename\",'COVER PAGE'!A1))+1,FIND(\"]\", CELL(\"filename\",'COVER PAGE'!A1))-FIND(\"[\",CELL(\"filename\",'COVER PAGE'!A1))-1))-FIND(\"~\",SUBSTITUTE(MID(CELL(\"filename\",'COVER PAGE'!A1),FIND(\"[\",CELL(\"filename\",'COVER PAGE'!A1))+1,FIND(\"]\", CELL(\"filename\",'COVER PAGE'!A1))-FIND(\"[\",CELL(\"filename\",'COVER PAGE'!A1))-1),\"_\",\"~\",3))),1,7),\"yyyy-MM-dd\"))=(TEXT(TEXT(DATE(YEAR('COVER PAGE'!F10),MONTH(DATEVALUE('COVER PAGE'!F9 & 1)),\"1\"),\"MMM-YYYY\"),\"yyyy-MM-dd\"))","v":{"$error":"#VALUE!"}},{"$f":"IF(B1=TRUE,0,1)","v":{"$error":"#VALUE!"}}]
["INSTITUTION","ZERO-SUM CHECK","TOTAL FAILED VALIDATIONS"]
[{"$f":"VLOOKUP('COVER PAGE'!C7,Controls!B4:C27,1,FALSE)","v":{"$error":"#N/A"}},null,{"$f":"SUM(COUNTIF(B7:B234,{\">0.00001\",\"<-0.00001\"}))+C1","v":{"$error":"#VALUE!"}}]
[]
["PAGE 1"]
[]
["Public Sector Approvals During Quarter: Total Number = Under $300,000 + $300,000-$450,000 + Over $450,000",{"$f":"ROUND(CB30ASCL2!B14-CB30ASCL2!B5-CB30ASCL2!B8-CB30ASCL2!B11,5)","v":0}]
["Public Sector Approvals During Quarter: Total Value = Under $300,000 + $300,000-$450,000 + Over $450,000",{"$f":"ROUND(CB30ASCL2!C14-CB30ASCL2!C5-CB30ASCL2!C8-CB30ASCL2!C11,5)","v":0}]
["Public Sector Disbursements During Quarter: Total Number = Under $300,000 + $300,000-$450,000 + Over $450,000",{"$f":"ROUND(CB30ASCL2!B15-CB30ASCL2!B6-CB30ASCL2!B9-CB30ASCL2!B12,5)","v":0}]
["Public Sector Disbursements During Quarter: Total Value = Under $300,000 + $300,000-$450,000 + Over $450,000",{"$f":"ROUND(CB30ASCL2!C15-CB30ASCL2!C6-CB30ASCL2!C9-CB30ASCL2!C12,5)","v":0}]
["Public Sector Outstanding Balance as at Quarter End: Total Number = Under $300,000 + $300,000-$450,000 + Over $450,000",{"$f":"ROUND(CB30ASCL2!B16-CB30ASCL2!B7-CB30ASCL2!B10-CB30ASCL2!B13,5)","v":0}]
["Public Sector Outstanding Balance as at Quarter End: Total Value = Under $300,000 + $300,000-$450,000 + Over $450,000",{"$f":"ROUND(CB30ASCL2!C16-CB30ASCL2!C7-CB30ASCL2!C10-CB30ASCL2!C13,5)","v":0}]
[]
["Private Financial Institutions Approvals During Quarter: Total Number = Under $300,000 + $300,000-$450,000 + Over $450,000",{"$f":"ROUND(CB30ASCL2!B26-CB30ASCL2!B17-CB30ASCL2!B20-CB30ASCL2!B23,5)","v":0}]
["Private Financial Institutions Approvals During Quarter: Total Value = Under $300,000 + $300,000-$450,000 + Over $450,000",{"$f":"ROUND(CB30ASCL2!C26-CB30ASCL2!C17-CB30ASCL2!C20-CB30ASCL2!C23,5)","v":0}]
{"$rows_left_out":219}
{"sheet":"PAGE1","index":5,"n_rows":56,"n_cols":24,"rows_kept":56,"cut":false,"hidden":false,"merged":[]}
[]
[null,null,null,null,null,null,null,null,null,null,null,null,null,null,null,null,"CB 30/1"]
[]
["CENTRAL BANK OF TRINIDAD AND TOBAGO"]
[]
["REAL ESTATE MORTGAGE LOANS - QUARTERLY"]
[]
["A.  CHANGES - SECTOR AND SIZE"]
[]
[]
["INSTITUTION",null,{"$f":"'COVER PAGE'!C7","v":"SELECT INSTITUTION"},null,null,null,null,null,"VERSION:","3n"]
[]
[]
[]
[]
{"$rows_left_out":42}
{"sheet":"PAGE2","index":6,"n_rows":48,"n_cols":17,"rows_kept":48,"cut":false,"hidden":false,"merged":[]}
[]
[null,null,null,null,null,null,null,null,null,null,null,null,null,null,null,null,"CB 30/2"]
[]
["CENTRAL BANK OF TRINIDAD AND TOBAGO"]
[]
["REAL ESTATE MORTGAGE LOANS - QUARTERLY"]
[]
["B.  PURPOSE"]
[]
[]
["INSTITUTION ",null,{"$f":"'COVER PAGE'!C7","v":"SELECT INSTITUTION"},null,null,null,null,null,null,null,null,null,"FOR THE QUARTER ",null,null,{"$f":"'COVER PAGE'!$F$9","v":"September"},{"$f":"'COVER PAGE'!$F$10","v":"2024-01-01"}]
[]
[]
[null,null,"OUTSTANDING ",null,null,"APPROVALS",null,null,null,null,"DISBURSEMENTS",null,null,null,"OUSTANDING"]
["A.","PURPOSE","BALANCE AS OF",null,null,"DURING",null,null,null,null,"DURING",null,null,null,"BALANCE AS AT"]
{"$rows_left_out":34}
{"sheet":"PAGE3","index":7,"n_rows":55,"n_cols":16,"rows_kept":55,"cut":false,"hidden":false,"merged":[]}
[null,null,null,null,null,null,null,null,null,null,null,null,null,null,null,"CB 30/3"]
[]
["CENTRAL BANK OF TRINIDAD AND TOBAGO"]
[]
["REAL ESTATE MORTGAGE LOANS ADMINISTERED"]
[]
["ON BEHALF OF THE HOME MORTGAGE BANK"]
[]
["INSTITUTION ",{"$f":"'COVER PAGE'!C7","v":"SELECT INSTITUTION"},null,null,null,null,null,null,null,null,"FOR THE QUARTER",null,null,{"$f":"'COVER PAGE'!$F$9","v":"September"},{"$f":"'COVER PAGE'!$F$10","v":"2024-01-01"}]
[]
[null,null,null,null,"SALES"]
["TYPE","BEGINNING",null,null,"FOR THE",null,null,null,null,"PRINCIPAL",null,null,null,"ENDING"]
[null,"BALANCE",null,null,"QUARTER",null,null,null,null,"REPAYMENTS",null,null,null,"BALANCE"]
[]
[null,"NO.",null,"VALUE","NO.",null,null,"VALUE",null,"NO.",null,"VALUE",null,"NO.",null,"VALUE"]
{"$rows_left_out":41}
{"sheet":"PAGE4","index":8,"n_rows":77,"n_cols":18,"rows_kept":77,"cut":false,"hidden":false,"merged":[]}
[null,null,null,null,null,null,null,null,null,null,null,null,null,null,null,null,"CB 30/4"]
[]
["CENTRAL BANK OF TRINIDAD AND TOBAGO"]
[]
["AGENTS OF NATIONAL INSURANCE BOARD"]
[]
["REAL ESTATE MORTGAGE LOANS - QUARTERLY"]
[]
["CHANGES AND PURPOSE"]
[]
["INSTITUTION",null,{"$f":"'COVER PAGE'!C7","v":"SELECT INSTITUTION"},null,null,null,null,null,null,null,null,null,"FOR THE QUARTER ",null,null,null,{"$f":"'COVER PAGE'!$F$9","v":"September"},{"$f":"'COVER PAGE'!$F$10","v":"2024-01-01"}]
[]
[null,null,"OUTSTANDING ",null,null,null,"APPROVALS",null,null,null,"DISBURSEMENTS",null,null,null,"OUSTANDING"]
["A.","SECTOR AND SIZE","BALANCE AS OF",null,null,null,"DURING",null,null,null,"DURING",null,null,null,"BALANCE AS AT"]
[null,null,"PRIOR QUARTER",null,null,null,"QUARTER",null,null,null,"QUARTER",null,null,null,"QUARTER END"]
{"$rows_left_out":63}
{"sheet":"PAGE5","index":9,"n_rows":66,"n_cols":18,"rows_kept":66,"cut":false,"hidden":false,"merged":[]}
[]
[null,null,null,null,null,null,null,null,null,null,null,null,null,null,null,null,"CB 30/5"]
[]
["CENTRAL BANK OF TRINIDAD AND TOBAGO"]
[]
["AGENTS OF NATIONAL HOUSING AUTHORITY"]
[]
["REAL ESTATE MORTGAGE LOANS - QUARTERLY"]
[]
["CHANGES AND PURPOSE"]
[]
["INSTITUTION",null,{"$f":"'COVER PAGE'!C7","v":"SELECT INSTITUTION"},null,null,null,null,null,null,null,null,null,"FOR THE QUARTER ",null,null,null,{"$f":"'COVER PAGE'!$F$9","v":"September"},{"$f":"'COVER PAGE'!$F$10","v":"2024-01-01"}]
[]
[null,null,"OUTSTANDING ",null,null,null,"APPROVALS",null,null,null,"DISBURSEMENTS",null,null,null,"OUSTANDING"]
["A.","SECTOR AND SIZE","BALANCE AS OF",null,null,null,"DURING",null,null,null,"DURING",null,null,null,"BALANCE AS AT"]
{"$rows_left_out":52}
{"sheet":"PAGE6","index":10,"n_rows":55,"n_cols":18,"rows_kept":55,"cut":false,"hidden":false,"merged":[[16,15,16,17]]}
[]
[null,null,null,null,null,null,null,null,null,null,null,null,null,null,null,null,null,"CB 30/6"]
[]
[null,"CENTRAL BANK OF TRINIDAD AND TOBAGO"]
[]
[null,"Lease Financing By Purpose"]
[]
[null,null,null,null,null,"                                                                                                                                                                                                                                     "]
[]
[null,"CHANGES AND PURPOSE"]
[]
[null,"INSTITUTION",{"$f":"'COVER PAGE'!C7","v":"SELECT INSTITUTION"},null,null,null,null,null,null,null,null,"FOR THE QUARTER",null,null,null,{"$f":"'COVER PAGE'!$F$9","v":"September"},{"$f":"'COVER PAGE'!$F$10","v":"2024-01-01"}]
[]
[null,null,null,"OUTSTANDING ",null,null,null,"AGREEMENTS",null,null,null,"REPAYMENTS",null,null,null,"OUSTANDING"]
[null,"PURPOSE",null,"BALANCE AS OF",null,null,null,"MADE IN THE",null,null,null,"IN CURRENT",null,null,null,"BALANCE AS AT"]
{"$rows_left_out":41}
{"sheet":"PAGE7","index":11,"n_rows":62,"n_cols":13,"rows_kept":62,"cut":false,"hidden":false,"merged":[[14,5,14,7],[14,9,14,11]]}
[]
[null,null,null,null,null,null,null,null,null,null,null,"CB 30/7"]
[]
["CENTRAL BANK OF TRINIDAD AND TOBAGO"]
["OUTSTANDING LOANS TO BUSINESSES BY ACTIVITY SECTORS"]
["(Excluding Real Estate Mortgage Loans and Lease Financing)"]
[]
[]
[]
[]
[]
["INSTITUTION",null,{"$f":"'COVER PAGE'!C7","v":"SELECT INSTITUTION"},null,null,null,null,null,"FOR THE QUARTER",null,null,{"$f":"'COVER PAGE'!$F$9","v":"September"},{"$f":"'COVER PAGE'!$F$10","v":"2024-01-01"}]
[]
[]
[null,null,"FULL",null,null,"PUBLIC SECTOR",null,null,null,"PRIVATE SECTOR"]
{"$rows_left_out":48}
{"sheet":"PAGE8","index":12,"n_rows":61,"n_cols":11,"rows_kept":61,"cut":false,"hidden":false,"merged":[[3,4,3,6],[3,8,3,10]]}
[]
[null,null,null,null,null,null,null,null,null,null,"CB 30/8"]
[]
[null,null,"FULL",null,"PUBLIC SECTOR",null,null,null,"PRIVATE SECTOR"]
[null,"BUSINESS","T'DAD",null,"NO.",null,"VALUE",null,"NO.",null,"VALUE"]
[null,"PURPOSE","S.I.C.",null,null,null,"( $000 )",null,null,null,"( $000 )"]
[]
["(16)","Industrial Gases and"]
[null,"Paints","08 - 01"]
[]
["(17)","Pharmaceuticals and"]
[null,"Other Chemicals","08 - 02"]
[]
["(18)","Clay Bricks and Blocks"]
[null,"and Tiles","08 - 02"]
{"$rows_left_out":47}
{"sheet":"PAGE9","index":13,"n_rows":54,"n_cols":11,"rows_kept":54,"cut":false,"hidden":false,"merged":[[3,4,3,6],[3,8,3,10]]}
[]
[null,null,null,null,null,null,null,null,null,null,"CB 30/9"]
[]
[null,null,"FULL",null,"PUBLIC SECTOR",null,null,null,"PRIVATE SECTOR"]
[null,"BUSINESS","T'DAD",null,"NO.",null,"VALUE",null,"NO.",null,"VALUE"]
[null,"PURPOSE","S.I.C.",null,null,null,"( $000 )",null,null,null,"( $000 )"]
[]
["(34)","Restaurants, Bars,"]
[null,"Snackettes, Parlour etc.","13 -03"]
[]
["(35)","Hotels and Guest"]
[null,"Houses","14"]
[]
["(36)","Taxi Service and "]
[null,"Car Rentals","15 - 02"]
{"$rows_left_out":40}
{"sheet":"PAGE10","index":14,"n_rows":76,"n_cols":9,"rows_kept":76,"cut":false,"hidden":false,"merged":[[75,1,75,2],[76,1,76,2],[77,1,77,2],[78,1,78,2],[79,1,79,2],[80,1,80,2],[81,1,81,2],[82,1,82,2],[83,1,83,2],[84,1,84,2],[85,1,85,2],[86,1,86,2],[87,1,87,2],[88,1,88,2],[89,1,89,2],[90,1,90,2],[91,1,91,2],[92,1,92,2],[93,1,93,2],[94,1,94,2],[95,1,95,2],[96,1,96,2],[76,4,76,5],[77,4,77,5],[78,4,78,5],[79,4,79,5],[80,4,80,5],[81,4,81,5],[82,4,82,5],[83,4,83,5],[84,4,84,5],[85,4,85,5],[86,4,86,5],[87,4,87,5],[88,4,88,5],[89,4,89,5],[95,4,95,5],[96,4,96,5],[90,4,90,5],[91,4,91,5],[92,4,92,5],[93,4,93,5],[94,4,94,5]]}
[]
[null,null,null,null,null,null,null,null,"CB 30/10"]
[]
["CENTRAL BANK OF TRINIDAD AND TOBAGO"]
[]
["OUTSTANDING LOANS TO CONSUMER BY PURPOSE"]
[]
["(Excluding Real Estate Mortgage Loans and Lease Financing)"]
[]
[]
["INSTITUTION ",{"$f":"'COVER PAGE'!C7","v":"SELECT INSTITUTION"},null,null," FOR THE QUARTER ",null,{"$f":"'COVER PAGE'!$F$9","v":"September"},{"$f":"'COVER PAGE'!$F$10","v":"2024-01-01"}]
[]
[]
[null,"CONSUMER PURPOSES",null,"NO.",null,null,"V A L U E"]
[null,null,null,null,null,null,"( $000 )"]
{"$rows_left_out":62}
{"sheet":"PAGE11","index":15,"n_rows":72,"n_cols":12,"rows_kept":72,"cut":false,"hidden":false,"merged":[]}
[]
[]
[null,null,null,null,null,null,null,null,null,"CB 30/11"]
["CENTRAL BANK OF TRINIDAD AND TOBAGO"]
[]
["TOTAL LOANS BY INTEREST RATES CHARGED"]
[]
[]
["INSTITUTION ",null,{"$f":"'COVER PAGE'!C7","v":"SELECT INSTITUTION"},null,null,null,null,null,"  FOR THE QUARTER ",{"$f":"'COVER PAGE'!$F$9","v":"September"},{"$f":"'COVER PAGE'!$F$10","v":"2024-01-01"}]
[]
[]
["INTEREST RATE ",null,null,"NUMBER OF",null,null,null,"OUTSTANDING"]
["CHARGED ",null,null,"LOANS",null,null,null,"AGGREGATE BALANCE"]
["( % per annum )",null,null,"( # )",null,"LOCAL",null,"( $000 )"]
[]
{"$rows_left_out":58}
{"sheet":"PAGE12","index":16,"n_rows":73,"n_cols":12,"rows_kept":73,"cut":false,"hidden":false,"merged":[]}
[]
[]
[null,null,null,null,null,null,null,null,null,"CB 30/12"]
["CENTRAL BANK OF TRINIDAD AND TOBAGO"]
[]
["TOTAL FOREIGN CURRENCY LOANS BY INTEREST RATES CHARGED"]
[]
[]
[]
[null,null," "]
["INSTITUTION         ",null,{"$f":"'COVER PAGE'!C7","v":"SELECT INSTITUTION"},null,null,null,null,"   FOR THE QUARTER",null,null,{"$f":"'COVER PAGE'!$F$9","v":"September"},{"$f":"'COVER PAGE'!$F$10","v":"2024-01-01"}]
[]
[]
["INTEREST RATE ",null,null,null,"NUMBER OF",null,null,"OUTSTANDING"]
["CHARGED ",null,null,null,"LOANS",null,null,"AGGREGATE BALANCE"]
{"$rows_left_out":59}
{"sheet":"PAGE13","index":17,"n_rows":55,"n_cols":10,"rows_kept":55,"cut":false,"hidden":false,"merged":[]}
[]
[]
[null,null,null,null,null,null,null,null,null,"CB 30/13"]
["CENTRAL BANK OF TRINIDAD AND TOBAGO"]
[]
["NEW CREDIT ( INSTALMENT AND REAL ESTATE MORTGAGE LOANS )"]
[]
["BY AGREED PERIOD OF REPAYMENT"]
[]
[]
["INSTITUTION        ",{"$f":"'COVER PAGE'!C7","v":"SELECT INSTITUTION"},null,null,null,null,"  FOR THE QUARTER ",null,{"$f":"'COVER PAGE'!$F$9","v":"September"},{"$f":"'COVER PAGE'!$F$10","v":"2024-01-01"}]
[]
[]
["AGREED PERIOD OF",null,null,"NUMBER OF",null,null,null,"TOTAL VALUE OF"]
["REPAYMENT",null,null,"NEW LOANS",null,null,null,"NEW LOANS"]
{"$rows_left_out":41}
{"sheet":"PAGE14","index":18,"n_rows":51,"n_cols":10,"rows_kept":51,"cut":false,"hidden":false,"merged":[]}
[]
[]
[null,null,null,null,null,null,null,null,"CB 30/14"]
["CENTRAL BANK OF TRINIDAD AND TOBAGO"]
[]
["TOTAL DEPOSITS BY INTEREST RATES OFFERED"]
[]
[]
["INSTITUTION       ",{"$f":"'COVER PAGE'!C7","v":"SELECT INSTITUTION"},null,null,null,null," FOR THE QUARTER",null,{"$f":"'COVER PAGE'!$F$9","v":"September"},{"$f":"'COVER PAGE'!$F$10","v":"2024-01-01"}]
[]
[]
["INTEREST RATE ",null,null,null,"NUMBER OF",null,null,"OUTSTANDING"]
["OFFERED",null,null,null,"DEPOSITS",null,null,"AGGREGATE BALANCE"]
["( % per annum )",null,null,null,"( # )",null,null,"( $000 )"]
[]
{"$rows_left_out":37}
{"sheet":"PAGE15","index":19,"n_rows":53,"n_cols":11,"rows_kept":53,"cut":false,"hidden":false,"merged":[]}
[]
[]
[null,null,null,null,null,null,null,null,null,"CB 30/15"]
["CENTRAL BANK OF TRINIDAD AND TOBAGO"]
[]
["TOTAL FOREIGN CURRENCY DEPOSITS BY INTEREST RATES OFFERED"]
[]
[]
[]
[]
["INSTITUTION          ",{"$f":"'COVER PAGE'!C7","v":"SELECT INSTITUTION"},null,null,null,null,"FOR THE QUARTER",null,null,{"$f":"'COVER PAGE'!$F$9","v":"September"},{"$f":"'COVER PAGE'!$F$10","v":"2024-01-01"}]
[]
[]
["INTEREST RATE ",null,null,"NUMBER OF",null,null,null,"OUTSTANDING"]
["OFFERED",null,null,"DEPOSITS",null,null,null,"AGGREGATE BALANCE"]
{"$rows_left_out":39}
{"sheet":"PAGE16","index":20,"n_rows":90,"n_cols":11,"rows_kept":90,"cut":false,"hidden":false,"merged":[[63,0,63,3],[63,7,63,10],[69,7,69,10],[75,7,75,10],[82,0,82,3],[80,0,80,3],[89,0,89,3],[64,7,64,10],[70,7,70,10],[76,5,76,10],[71,0,71,3],[69,0,69,3],[76,0,76,3],[77,0,77,3],[75,0,75,3],[65,0,65,3],[64,0,64,3],[70,0,70,3],[85,0,85,3],[88,0,88,3],[83,0,83,3],[86,0,86,3]]}
[]
[null,null,null,null,null,null,null,null,null,null,"CB 30/16"]
[]
["CENTRAL BANK OF TRINIDAD AND TOBAGO"]
[]
["TRUSTEE FUNDS - INVESTMENT PORTFOLIO"]
[]
[]
["INSTITUTION      ",{"$f":"'COVER PAGE'!C7","v":"SELECT INSTITUTION"},null,null,null,null,null,"    FOR THE QUARTER",null,{"$f":"'COVER PAGE'!$F$9","v":"September"},{"$f":"'COVER PAGE'!$F$10","v":"2024-01-01"}]
[]
[]
["TOTAL FUNDS UNDER ADMINISTRATION",null,null,null,null,null,null,null,"( $ 000 )"]
[]
[]
["DEMAND DEPOSITS"]
{"$rows_left_out":76}
{"sheet":"Controls","index":21,"n_rows":39,"n_cols":6,"rows_kept":39,"cut":false,"hidden":true,"merged":[]}
[]
[]
[null,"SELECT INSTITUTION","CODES","QUARTER",null,"YEAR"]
[null,"ANSA Bank Limited ","BBDA","March",3,"2015-01-01"]
[null,"ANSA Merchant Bank Limited ","AMAL","June",6,"2016-01-01"]
[null,"Caribbean Finance Company Limited","CFC","September",9,"2017-01-01"]
[null,"CIBC Caribbean Bank Limited (Trinidad and Tobago)","FCIB","December",12,"2018-01-01"]
[null,"Citibank (Trinidad & Tobago) Limited","CITI",null,null,"2019-01-01"]
[null,"Citicorp Merchant Bank Limited","CMBL",null,null,"2020-01-01"]
[null,"Development Finance Limited ","DFL",null,null,"2021-01-01"]
[null,"Fidelity Finance and Leasing Company Limited ","FFL",null,null,"2022-01-01"]
[null,"First Citizens Bank Limited","FCB",null,null,"2023-01-01"]
[null,"First Citizens Depository Services Limited","FCMT",null,null,"2024-01-01"]
[null,"First Citizens Trustee Services Limited","FCTS",null,null,"2025-01-01"]
[null,"Guardian Group Trust Limited ","GAM",null,null,"2026-01-01"]
{"$rows_left_out":24}