{"text_format":"1","workbook":"xlsx","n_sheets":16,"sheets":["COVER PAGE","General Instructions","CBTT Validations","ASCII","ASCII2","PAGE1","PAGE2","PAGE3","PAGE4 ","PAGE5","PAGE6","PAGE7","PAGE8","PAGE9","PAGE10","Controls"],"not_rendered":{"charts":0,"images":1,"macros":1,"external_links":3,"defined_names":317,"comments":0,"pivot_tables":0},"unopened":[],"bounds":{"document_bytes":16777216,"sheet_cells":100000,"rows_first":2000,"rows_last":500,"rows_between":2000,"halvings":0,"cell_chars":16384,"cell_head_chars":4096},"cells_cut":0,"cells_raw":0,"read":"whole","date_system":"1900"}

{"sheet":"COVER PAGE","index":0,"n_rows":13,"n_cols":24,"rows_kept":13,"cut":false,"hidden":false,"merged":[[1,2,1,9],[2,2,2,9],[3,2,3,9],[4,2,4,9],[5,2,5,9],[10,2,10,9],[11,4,11,7],[12,5,12,6],[6,2,6,9],[7,2,7,9],[9,2,9,4],[9,5,9,6],[9,7,9,9],[8,5,8,6]]}
[null,null,null,null," "," "," "," "]
[null,null,"CENTRAL BANK OF TRINIDAD AND TOBAGO ",null,null,null,null,null,null,null,null,null,null,null,null,null,null,null,null,null," "," "," "," "]
[null,null,"V1.2"]
[null,null,"CB30A RETURN"]
[]
[null,null,"FOR "]
[null,null,"SELECT INSTITUTION"]
[null,null,"For the Quarter Ended:"]
[null,null,null,null,"Date","2024-09-30"]
[]
[null,null,"Date Submitted:"]
[null,null,null,null,"2024-10-28"]
[null,null,null,null,null,"Type mm/dd/yyyy"]

{"sheet":"General Instructions","index":1,"n_rows":27,"n_cols":2,"rows_kept":27,"cut":false,"hidden":false,"merged":[]}
[null,"CB30A RETURN"]
[null,"Please use the CB30A instructions to complete the return using the link below. "]
[null,"CB30A INSTRUCTIONS"]
[]
[null,"GENERAL INSTRUCTIONS"]
[1,"Do not amend the structure/format."]
[2,"Do not remove the password protection."]
[3,"Do not manipulate the formulas."]
[4,"Complete Cover Page before submission. \nInstitution, reporting quarter and date submitted must be populated. "]
[5,"No blank cells.  All cells must be populated with zero where there is no data."]
[6,"N/A, N/D, NA/ND, NA and ND cannot be used in the return."]
[7,"Do not use text."]
[8,"Do not use symbols in cells (<, >, commas, full stops, apostrophe, tilde etc.) with the exception of full stops to express decimal places in the interest rates."]
[9,"Ensure when links are broken the files are checked for text references which have to be deleted/amended (#Ref, FALSE! etc.) prior to submission. Refer to section “CONVERTING TO .XLSX AND SAVING FOR SUBMISSION”  for further details."]
[10,"Ensure all values are zero in the validation tab.\nIf values are not zeros, check formulas to determine where errors may have occurred."]
[11,"The file format should be Microsoft Excel with the extension \".xlsx\"."]
[]
[null,"FILE NAMING FOR SUBMISSION"]
[12,{"$f":"\"Use the file name structure \"\"Company Code_CB30A_\"&'COVER PAGE'!$C$3&\"_MMMYYYY\"\".\"","v":"Use the file name structure \"Company Code_CB30A_V1.2_MMMYYYY\"."}]
[13,"Resubmissions must have the same file name structure as listed in 12 above."]
[]
[null,"CONVERTING TO .XLSX AND SAVING FOR SUBMISSION"]
[14,"Select the \"Convert to (.xlsx) and Save\" button on the \"CBTT VALIDATION\" tab to save the final version for submission.  "]
[15,"Follow the prompts to break all external links and save the return as .xlsx."]
[16,"Please ensure there are no validation errors on the \"CBTT VALIDATION\" tab after links are broken."]
[17,{"$f":"\"Remember to save the file in the recommended naming convention \"\"Company Code_CB30A_\"&'COVER PAGE'!$C$3&\"_MMMYYYY\"\" as per instruction number 12.\"","v":"Remember to save the file in the recommended naming convention \"Company Code_CB30A_V1.2_MMMYYYY\" as per instruction number 12."}]
[18,"Once the steps above are completed the submission can be uploaded into GoAnywhere."]

{"sheet":"CBTT Validations","index":2,"n_rows":292,"n_cols":6,"rows_kept":292,"cut":false,"hidden":false,"merged":[[1,1,2,1],[1,2,2,2]]}
["DATE CHECK",{"$f":"(TEXT(MID(RIGHT(MID(CELL(\"filename\",'COVER PAGE'!A1),FIND(\"[\",CELL(\"filename\",'COVER PAGE'!A1))+1,FIND(\"]\", CELL(\"filename\",'COVER PAGE'!A1))-FIND(\"[\",CELL(\"filename\",'COVER PAGE'!A1))-1),LEN(MID(CELL(\"filename\",'COVER PAGE'!A1),FIND(\"[\",CELL(\"filename\",'COVER PAGE'!A1))+1,FIND(\"]\", CELL(\"filename\",'COVER PAGE'!A1))-FIND(\"[\",CELL(\"filename\",'COVER PAGE'!A1))-1))-FIND(\"~\",SUBSTITUTE(MID(CELL(\"filename\",'COVER PAGE'!A1),FIND(\"[\",CELL(\"filename\",'COVER PAGE'!A1))+1,FIND(\"]\", CELL(\"filename\",'COVER PAGE'!A1))-FIND(\"[\",CELL(\"filename\",'COVER PAGE'!A1))-1),\"_\",\"~\",3))),1,7),\"yyyy-MM-dd\"))=(TEXT(TEXT(DATE(YEAR('COVER PAGE'!F9),MONTH('COVER PAGE'!F9),DAY('COVER PAGE'!F9)),\"MMM-YYYY\"),\"yyyy-MM-dd\"))","v":{"$error":"#VALUE!"}},{"$f":"IF(B1=TRUE,0,1)","v":{"$error":"#VALUE!"}}]
["INSTITUTION","ZERO-SUM CHECK","TOTAL FAILED VALIDATIONS"]
[{"$f":"VLOOKUP('COVER PAGE'!C7,Controls!B4:C28,1,FALSE)","v":{"$error":"#N/A"}}]
[null,null,{"$f":"SUM(COUNTIF(B7:B293,{\">0.00001\",\"<-0.00001\",\"Error\"}))+C1","v":{"$error":"#VALUE!"}}]
["Page 1"]
[]
["Public Sector Approvals During Quarter: Total Number = Under $450,00 + $450,001 to $750,000 + $750,001 to $1,000,000 + $1,000,001 to $1,250,000 + $1,250,001 to $1,500,000 + $1,500,001 to $1,750,000 + $1,750,001 to $2,000,000 + $2,000,001 to $2,250,000 + $2,250,001 to $2,500,000 + $2,500,001 to $2,750,000 + $2,750,001 to $3,000,000 + Over $3,000,001",{"$f":"ROUND(ASCII2!B41-ASCII2!B5-ASCII2!B8-ASCII2!B11-ASCII2!B14-ASCII2!B17-ASCII2!B20-ASCII2!B23-ASCII2!B26-ASCII2!B29-ASCII2!B32-ASCII2!B35-ASCII2!B38,5)","v":0}]
["Public Sector Approvals During Quarter: Total Value = Under $450,00 + $450,001 to $750,000 + $750,001 to $1,000,000 + $1,000,001 to $1,250,000 + $1,250,001 to $1,500,000 + $1,500,001 to $1,750,000 + $1,750,001 to $2,000,000 + $2,000,001 to $2,250,000 + $2,250,001 to $2,500,000 + $2,500,001 to $2,750,000 + $2,750,001 to $3,000,000 + Over $3,000,001",{"$f":"ROUND(ASCII2!C41-ASCII2!C5-ASCII2!C8-ASCII2!C11-ASCII2!C14-ASCII2!C17-ASCII2!C20-ASCII2!C23-ASCII2!C26-ASCII2!C29-ASCII2!C32-ASCII2!C35-ASCII2!C38,5)","v":0},null,null,null,"$450,001  $750,000"]
["Public Sector Disbursements During Quarter: Total Number = Under $450,00 + $450,001 to $750,000 + $750,001 to $1,000,000 + $1,000,001 to $1,250,000 + $1,250,001 to $1,500,000 + $1,500,001 to $1,750,000 + $1,750,001 to $2,000,000 + $2,000,001 to $2,250,000 + $2,250,001 to $2,500,000 + $2,500,001 to $2,750,000 + $2,750,001 to $3,000,000 + Over $3,000,001",{"$f":"ROUND(ASCII2!B42-ASCII2!B6-ASCII2!B9-ASCII2!B12-ASCII2!B15-ASCII2!B18-ASCII2!B21-ASCII2!B24-ASCII2!B27-ASCII2!B30-ASCII2!B33-ASCII2!B36-ASCII2!B39,5)","v":0},null,null,null,"$750,001  $1,000,000"]
["Public Sector Disbursements During Quarter: Total Value = Under $450,00 + $450,001 to $750,000 + $750,001 to $1,000,000 + $1,000,001 to $1,250,000 + $1,250,001 to $1,500,000 + $1,500,001 to $1,750,000 + $1,750,001 to $2,000,000 + $2,000,001 to $2,250,000 + $2,250,001 to $2,500,000 + $2,500,001 to $2,750,000 + $2,750,001 to $3,000,000 + Over $3,000,001",{"$f":"ROUND(ASCII2!C42-ASCII2!C6-ASCII2!C9-ASCII2!C12-ASCII2!C15-ASCII2!C18-ASCII2!C21-ASCII2!C24-ASCII2!C27-ASCII2!C30-ASCII2!C33-ASCII2!C36-ASCII2!C39,5)","v":0},null,null,null,"$1,000,001  $1,250,000"]
["Public Sector Outstanding Balance as at Quarter End: Total Number = Under $450,00 + $450,001 to $750,000 + $750,001 to $1,000,000 + $1,000,001 to $1,250,000 + $1,250,001 to $1,500,000 + $1,500,001 to $1,750,000 + $1,750,001 to $2,000,000 + $2,000,001 to $2,250,000 + $2,250,001 to $2,500,000 + $2,500,001 to $2,750,000 + $2,750,001 to $3,000,000 + Over $3,000,001",{"$f":"ROUND(ASCII2!B43-ASCII2!B7-ASCII2!B10-ASCII2!B13-ASCII2!B16-ASCII2!B19-ASCII2!B22-ASCII2!B25-ASCII2!B28-ASCII2!B31-ASCII2!B34-ASCII2!B37-ASCII2!B40,5)","v":0},null,null,null,"$1,250,001  $1,500,000"]
["Public Sector Outstanding Balance as at Quarter End: Total Value = Under $450,00 + $450,001 to $750,000 + $750,001 to $1,000,000 + $1,000,001 to $1,250,000 + $1,250,001 to $1,500,000 + $1,500,001 to $1,750,000 + $1,750,001 to $2,000,000 + $2,000,001 to $2,250,000 + $2,250,001 to $2,500,000 + $2,500,001 to $2,750,000 + $2,750,001 to $3,000,000 + Over $3,000,001",{"$f":"ROUND(ASCII2!C43-ASCII2!C7-ASCII2!C10-ASCII2!C13-ASCII2!C16-ASCII2!C19-ASCII2!C22-ASCII2!C25-ASCII2!C28-ASCII2!C31-ASCII2!C34-ASCII2!C37-ASCII2!C40,5)","v":0},null,null,null,"$1,500,001  $1,750,000"]
[null,null,null,null,null,"$1,750,001  $2,000,000"]
["Private Financial Institutions Approvals During Quarter: Total Number = Under $450,00 + $450,001 to $750,000 + $750,001 to $1,000,000 + $1,000,001 to $1,250,000 + $1,250,001 to $1,500,000 + $1,500,001 to $1,750,000 + $1,750,001 to $2,000,000 + $2,000,001 to $2,250,000 + $2,250,001 to $2,500,000 + $2,500,001 to $2,750,000 + $2,750,001 to $3,000,000 + Over $3,000,001",{"$f":"ROUND(ASCII2!B80-ASCII2!B44-ASCII2!B47-ASCII2!B50-ASCII2!B53-ASCII2!B56-ASCII2!B59-ASCII2!B62-ASCII2!B65-ASCII2!B68-ASCII2!B71-ASCII2!B74-ASCII2!B77,5)","v":0},null,null,null,"$2,000,001  $2,250,000"]
["Private Financial Institutions Approvals During Quarter: Total Value = Under $450,00 + $450,001 to $750,000 + $750,001 to $1,000,000 + $1,000,001 to $1,250,000 + $1,250,001 to $1,500,000 + $1,500,001 to $1,750,000 + $1,750,001 to $2,000,000 + $2,000,001 to $2,250,000 + $2,250,001 to $2,500,000 + $2,500,001 to $2,750,000 + $2,750,001 to $3,000,000 + Over $3,000,001",{"$f":"ROUND(ASCII2!C80-ASCII2!C44-ASCII2!C47-ASCII2!C50-ASCII2!C53-ASCII2!C56-ASCII2!C59-ASCII2!C62-ASCII2!C65-ASCII2!C68-ASCII2!C71-ASCII2!C74-ASCII2!C77,5)","v":0},null,null,null,"$2,250,001  $2,500,000"]
["Private Financial Institutions Disbursements During Quarter: Total Number = Under $450,00 + $450,001 to $750,000 + $750,001 to $1,000,000 + $1,000,001 to $1,250,000 + $1,250,001 to $1,500,000 + $1,500,001 to $1,750,000 + $1,750,001 to $2,000,000 + $2,000,001 to $2,250,000 + $2,250,001 to $2,500,000 + $2,500,001 to $2,750,000 + $2,750,001 to $3,000,000 + Over $3,000,001",{"$f":"ROUND(ASCII2!B81-ASCII2!B45-ASCII2!B48-ASCII2!B51-ASCII2!B54-ASCII2!B57-ASCII2!B60-ASCII2!B63-ASCII2!B66-ASCII2!B69-ASCII2!B72-ASCII2!B75-ASCII2!B78,5)","v":0},null,null,null,"$2,500,001  $2,750,000"]
["Private Financial Institutions Disbursements During Quarter: Total Value = Under $450,00 + $450,001 to $750,000 + $750,001 to $1,000,000 + $1,000,001 to $1,250,000 + $1,250,001 to $1,500,000 + $1,500,001 to $1,750,000 + $1,750,001 to $2,000,000 + $2,000,001 to $2,250,000 + $2,250,001 to $2,500,000 + $2,500,001 to $2,750,000 + $2,750,001 to $3,000,000 + Over $3,000,001",{"$f":"ROUND(ASCII2!C81-ASCII2!C45-ASCII2!C48-ASCII2!C51-ASCII2!C54-ASCII2!C57-ASCII2!C60-ASCII2!C63-ASCII2!C66-ASCII2!C69-ASCII2!C72-ASCII2!C75-ASCII2!C78,5)","v":0},null,null,null,"$2,750,001  $3,000,000"]
["Private Financial Institutions Outstanding Balance as at Quarter End: Total Number = Under $450,00 + $450,001 to $750,000 + $750,001 to $1,000,000 + $1,000,001 to $1,250,000 + $1,250,001 to $1,500,000 + $1,500,001 to $1,750,000 + $1,750,001 to $2,000,000 + $2,000,001 to $2,250,000 + $2,250,001 to $2,500,000 + $2,500,001 to $2,750,000 + $2,750,001 to $3,000,000 + Over $3,000,001",{"$f":"ROUND(ASCII2!B82-ASCII2!B46-ASCII2!B49-ASCII2!B52-ASCII2!B55-ASCII2!B58-ASCII2!B61-ASCII2!B64-ASCII2!B67-ASCII2!B70-ASCII2!B73-ASCII2!B76-ASCII2!B79,5)","v":0},null,null,null,"Over $3,000,001"]
["Private Financial Institutions Outstanding Balance as at Quarter End: Total Value = Under $450,00 + $450,001 to $750,000 + $750,001 to $1,000,000 + $1,000,001 to $1,250,000 + $1,250,001 to $1,500,000 + $1,500,001 to $1,750,000 + $1,750,001 to $2,000,000 + $2,000,001 to $2,250,000 + $2,250,001 to $2,500,000 + $2,500,001 to $2,750,000 + $2,750,001 to $3,000,000 + Over $3,000,001",{"$f":"ROUND(ASCII2!C82-ASCII2!C46-ASCII2!C49-ASCII2!C52-ASCII2!C55-ASCII2!C58-ASCII2!C61-ASCII2!C64-ASCII2!C67-ASCII2!C70-ASCII2!C73-ASCII2!C76-ASCII2!C79,5)","v":0}]
[]
["Incorporated Businesses Approvals During Quarter: Total Number = Under $450,00 + $450,001 to $750,000 + $750,001 to $1,000,000 + $1,000,001 to $1,250,000 + $1,250,001 to $1,500,000 + $1,500,001 to $1,750,000 + $1,750,001 to $2,000,000 + $2,000,001 to $2,250,000 + $2,250,001 to $2,500,000 + $2,500,001 to $2,750,000 + $2,750,001 to $3,000,000 + Over $3,000,001",{"$f":"ROUND(ASCII2!B119-ASCII2!B83-ASCII2!B86-ASCII2!B89-ASCII2!B92-ASCII2!B95-ASCII2!B98-ASCII2!B101-ASCII2!B104-ASCII2!B107-ASCII2!B110-ASCII2!B113-ASCII2!B116,5)","v":0}]
["Incorporated Businesses Approvals During Quarter: Total Value = Under $450,00 + $450,001 to $750,000 + $750,001 to $1,000,000 + $1,000,001 to $1,250,000 + $1,250,001 to $1,500,000 + $1,500,001 to $1,750,000 + $1,750,001 to $2,000,000 + $2,000,001 to $2,250,000 + $2,250,001 to $2,500,000 + $2,500,001 to $2,750,000 + $2,750,001 to $3,000,000 + Over $3,000,001",{"$f":"ROUND(ASCII2!C119-ASCII2!C83-ASCII2!C86-ASCII2!C89-ASCII2!C92-ASCII2!C95-ASCII2!C98-ASCII2!C101-ASCII2!C104-ASCII2!C107-ASCII2!C110-ASCII2!C113-ASCII2!C116,5)","v":0}]
["Incorporated Businesses Disbursements During Quarter: Total Number = Under $450,00 + $450,001 to $750,000 + $750,001 to $1,000,000 + $1,000,001 to $1,250,000 + $1,250,001 to $1,500,000 + $1,500,001 to $1,750,000 + $1,750,001 to $2,000,000 + $2,000,001 to $2,250,000 + $2,250,001 to $2,500,000 + $2,500,001 to $2,750,000 + $2,750,001 to $3,000,000 + Over $3,000,001",{"$f":"ROUND(ASCII2!B120-ASCII2!B84-ASCII2!B87-ASCII2!B90-ASCII2!B93-ASCII2!B96-ASCII2!B99-ASCII2!B102-ASCII2!B105-ASCII2!B108-ASCII2!B111-ASCII2!B114-ASCII2!B117,5)","v":0}]
["Incorporated Businesses Disbursements During Quarter: Total Value = Under $450,00 + $450,001 to $750,000 + $750,001 to $1,000,000 + $1,000,001 to $1,250,000 + $1,250,001 to $1,500,000 + $1,500,001 to $1,750,000 + $1,750,001 to $2,000,000 + $2,000,001 to $2,250,000 + $2,250,001 to $2,500,000 + $2,500,001 to $2,750,000 + $2,750,001 to $3,000,000 + Over $3,000,001",{"$f":"ROUND(ASCII2!C120-ASCII2!C84-ASCII2!C87-ASCII2!C90-ASCII2!C93-ASCII2!C96-ASCII2!C99-ASCII2!C102-ASCII2!C105-ASCII2!C108-ASCII2!C111-ASCII2!C114-ASCII2!C117,5)","v":0}]
["Incorporated Businesses Outstanding Balance as at Quarter End: Total Number = Under $450,00 + $450,001 to $750,000 + $750,001 to $1,000,000 + $1,000,001 to $1,250,000 + $1,250,001 to $1,500,000 + $1,500,001 to $1,750,000 + $1,750,001 to $2,000,000 + $2,000,001 to $2,250,000 + $2,250,001 to $2,500,000 + $2,500,001 to $2,750,000 + $2,750,001 to $3,000,000 + Over $3,000,001",{"$f":"ROUND(ASCII2!B121-ASCII2!B85-ASCII2!B88-ASCII2!B91-ASCII2!B94-ASCII2!B97-ASCII2!B100-ASCII2!B103-ASCII2!B106-ASCII2!B109-ASCII2!B112-ASCII2!B115-ASCII2!B118,5)","v":0}]
["Incorporated Businesses Outstanding Balance as at Quarter End: Total Value = Under $450,00 + $450,001 to $750,000 + $750,001 to $1,000,000 + $1,000,001 to $1,250,000 + $1,250,001 to $1,500,000 + $1,500,001 to $1,750,000 + $1,750,001 to $2,000,000 + $2,000,001 to $2,250,000 + $2,250,001 to $2,500,000 + $2,500,001 to $2,750,000 + $2,750,001 to $3,000,000 + Over $3,000,001",{"$f":"ROUND(ASCII2!C121-ASCII2!C85-ASCII2!C88-ASCII2!C91-ASCII2!C94-ASCII2!C97-ASCII2!C100-ASCII2!C103-ASCII2!C106-ASCII2!C109-ASCII2!C112-ASCII2!C115-ASCII2!C118,5)","v":0}]
[]
["Unincorporated Businesses Approvals During Quarter: Total Number = Under $450,00 + $450,001 to $750,000 + $750,001 to $1,000,000 + $1,000,001 to $1,250,000 + $1,250,001 to $1,500,000 + $1,500,001 to $1,750,000 + $1,750,001 to $2,000,000 + $2,000,001 to $2,250,000 + $2,250,001 to $2,500,000 + $2,500,001 to $2,750,000 + $2,750,001 to $3,000,000 + Over $3,000,001",{"$f":"ROUND(ASCII2!B158-ASCII2!B122-ASCII2!B125-ASCII2!B128-ASCII2!B131-ASCII2!B134-ASCII2!B137-ASCII2!B140-ASCII2!B143-ASCII2!B146-ASCII2!B149-ASCII2!B152-ASCII2!B155,5)","v":0}]
["Unincorporated Businesses Approvals During Quarter: Total Value = Under $450,00 + $450,001 to $750,000 + $750,001 to $1,000,000 + $1,000,001 to $1,250,000 + $1,250,001 to $1,500,000 + $1,500,001 to $1,750,000 + $1,750,001 to $2,000,000 + $2,000,001 to $2,250,000 + $2,250,001 to $2,500,000 + $2,500,001 to $2,750,000 + $2,750,001 to $3,000,000 + Over $3,000,001",{"$f":"ROUND(ASCII2!C158-ASCII2!C122-ASCII2!C125-ASCII2!C128-ASCII2!C131-ASCII2!C134-ASCII2!C137-ASCII2!C140-ASCII2!C143-ASCII2!C146-ASCII2!C149-ASCII2!C152-ASCII2!C155,5)","v":0}]
["Unincorporated Businesses Disbursements During Quarter: Total Number = Under $450,00 + $450,001 to $750,000 + $750,001 to $1,000,000 + $1,000,001 to $1,250,000 + $1,250,001 to $1,500,000 + $1,500,001 to $1,750,000 + $1,750,001 to $2,000,000 + $2,000,001 to $2,250,000 + $2,250,001 to $2,500,000 + $2,500,001 to $2,750,000 + $2,750,001 to $3,000,000 + Over $3,000,001",{"$f":"ROUND(ASCII2!B159-ASCII2!B123-ASCII2!B126-ASCII2!B129-ASCII2!B132-ASCII2!B135-ASCII2!B138-ASCII2!B141-ASCII2!B144-ASCII2!B147-ASCII2!B150-ASCII2!B153-ASCII2!B156,5)","v":0}]
["Unincorporated Businesses Disbursements During Quarter: Total Value = Under $450,00 + $450,001 to $750,000 + $750,001 to $1,000,000 + $1,000,001 to $1,250,000 + $1,250,001 to $1,500,000 + $1,500,001 to $1,750,000 + $1,750,001 to $2,000,000 + $2,000,001 to $2,250,000 + $2,250,001 to $2,500,000 + $2,500,001 to $2,750,000 + $2,750,001 to $3,000,000 + Over $3,000,001",{"$f":"ROUND(ASCII2!C159-ASCII2!C123-ASCII2!C126-ASCII2!C129-ASCII2!C132-ASCII2!C135-ASCII2!C138-ASCII2!C141-ASCII2!C144-ASCII2!C147-ASCII2!C150-ASCII2!C153-ASCII2!C156,5)","v":0}]
["Unincorporated Businesses Outstanding Balance as at Quarter End: Total Number = Under $450,00 + $450,001 to $750,000 + $750,001 to $1,000,000 + $1,000,001 to $1,250,000 + $1,250,001 to $1,500,000 + $1,500,001 to $1,750,000 + $1,750,001 to $2,000,000 + $2,000,001 to $2,250,000 + $2,250,001 to $2,500,000 + $2,500,001 to $2,750,000 + $2,750,001 to $3,000,000 + Over $3,000,001",{"$f":"ROUND(ASCII2!B160-ASCII2!B124-ASCII2!B127-ASCII2!B130-ASCII2!B133-ASCII2!B136-ASCII2!B139-ASCII2!B142-ASCII2!B145-ASCII2!B148-ASCII2!B151-ASCII2!B154-ASCII2!B157,5)","v":0}]
["Unincorporated Businesses Outstanding Balance as at Quarter End: Total Value = Under $450,00 + $450,001 to $750,000 + $750,001 to $1,000,000 + $1,000,001 to $1,250,000 + $1,250,001 to $1,500,000 + $1,500,001 to $1,750,000 + $1,750,001 to $2,000,000 + $2,000,001 to $2,250,000 + $2,250,001 to $2,500,000 + $2,500,001 to $2,750,000 + $2,750,001 to $3,000,000 + Over $3,000,001",{"$f":"ROUND(ASCII2!C160-ASCII2!C124-ASCII2!C127-ASCII2!C130-ASCII2!C133-ASCII2!C136-ASCII2!C139-ASCII2!C142-ASCII2!C145-ASCII2!C148-ASCII2!C151-ASCII2!C154-ASCII2!C157,5)","v":0}]
[]
["Consumers Approvals During Quarter: Total Number = Under $450,00 + $450,001 to $750,000 + $750,001 to $1,000,000 + $1,000,001 to $1,250,000 + $1,250,001 to $1,500,000 + $1,500,001 to $1,750,000 + $1,750,001 to $2,000,000 + $2,000,001 to $2,250,000 + $2,250,001 to $2,500,000 + $2,500,001 to $2,750,000 + $2,750,001 to $3,000,000 + Over $3,000,001",{"$f":"ROUND(ASCII2!B197-ASCII2!B161-ASCII2!B164-ASCII2!B167-ASCII2!B170-ASCII2!B173-ASCII2!B176-ASCII2!B179-ASCII2!B182-ASCII2!B185-ASCII2!B188-ASCII2!B191-ASCII2!B194,5)","v":0}]
["Consumers Approvals During Quarter: Total Value = Under $450,00 + $450,001 to $750,000 + $750,001 to $1,000,000 + $1,000,001 to $1,250,000 + $1,250,001 to $1,500,000 + $1,500,001 to $1,750,000 + $1,750,001 to $2,000,000 + $2,000,001 to $2,250,000 + $2,250,001 to $2,500,000 + $2,500,001 to $2,750,000 + $2,750,001 to $3,000,000 + Over $3,000,001",{"$f":"ROUND(ASCII2!C197-ASCII2!C161-ASCII2!C164-ASCII2!C167-ASCII2!C170-ASCII2!C173-ASCII2!C176-ASCII2!C179-ASCII2!C182-ASCII2!C185-ASCII2!C188-ASCII2!C191-ASCII2!C194,5)","v":0}]
["Consumers Disbursements During Quarter: Total Number = Under $450,00 + $450,001 to $750,000 + $750,001 to $1,000,000 + $1,000,001 to $1,250,000 + $1,250,001 to $1,500,000 + $1,500,001 to $1,750,000 + $1,750,001 to $2,000,000 + $2,000,001 to $2,250,000 + $2,250,001 to $2,500,000 + $2,500,001 to $2,750,000 + $2,750,001 to $3,000,000 + Over $3,000,001",{"$f":"ROUND(ASCII2!B198-ASCII2!B162-ASCII2!B165-ASCII2!B168-ASCII2!B171-ASCII2!B174-ASCII2!B177-ASCII2!B180-ASCII2!B183-ASCII2!B186-ASCII2!B189-ASCII2!B192-ASCII2!B195,5)","v":0}]
["Consumers Disbursements During Quarter: Total Value = Under $450,00 + $450,001 to $750,000 + $750,001 to $1,000,000 + $1,000,001 to $1,250,000 + $1,250,001 to $1,500,000 + $1,500,001 to $1,750,000 + $1,750,001 to $2,000,000 + $2,000,001 to $2,250,000 + $2,250,001 to $2,500,000 + $2,500,001 to $2,750,000 + $2,750,001 to $3,000,000 + Over $3,000,001",{"$f":"ROUND(ASCII2!C198-ASCII2!C162-ASCII2!C165-ASCII2!C168-ASCII2!C171-ASCII2!C174-ASCII2!C177-ASCII2!C180-ASCII2!C183-ASCII2!C186-ASCII2!C189-ASCII2!C192-ASCII2!C195,5)","v":0}]
["Consumers Outstanding Balance as at Quarter End: Total Number = Under $450,00 + $450,001 to $750,000 + $750,001 to $1,000,000 + $1,000,001 to $1,250,000 + $1,250,001 to $1,500,000 + $1,500,001 to $1,750,000 + $1,750,001 to $2,000,000 + $2,000,001 to $2,250,000 + $2,250,001 to $2,500,000 + $2,500,001 to $2,750,000 + $2,750,001 to $3,000,000 + Over $3,000,001",{"$f":"ROUND(ASCII2!B199-ASCII2!B163-ASCII2!B166-ASCII2!B169-ASCII2!B172-ASCII2!B175-ASCII2!B178-ASCII2!B181-ASCII2!B184-ASCII2!B187-ASCII2!B190-ASCII2!B193-ASCII2!B196,5)","v":0}]
["Consumers Outstanding Balance as at Quarter End: Total Value = Under $450,00 + $450,001 to $750,000 + $750,001 to $1,000,000 + $1,000,001 to $1,250,000 + $1,250,001 to $1,500,000 + $1,500,001 to $1,750,000 + $1,750,001 to $2,000,000 + $2,000,001 to $2,250,000 + $2,250,001 to $2,500,000 + $2,500,001 to $2,750,000 + $2,750,001 to $3,000,000 + Over $3,000,001",{"$f":"ROUND(ASCII2!C199-ASCII2!C163-ASCII2!C166-ASCII2!C169-ASCII2!C172-ASCII2!C175-ASCII2!C178-ASCII2!C181-ASCII2!C184-ASCII2!C187-ASCII2!C190-ASCII2!C193-ASCII2!C196,5)","v":0}]
[]
["Approvals During Quarter: Total Number = Public Sector + Private Financial Institutions + Incorporated Businesses + Unincorporated Businesses + Consumers",{"$f":"ROUND(ASCII2!B200-ASCII2!B41-ASCII2!B80-ASCII2!B119-ASCII2!B158-ASCII2!B197,5)","v":0}]
["Approvals During Quarter: Total Value = Public Sector + Private Financial Institutions + Incorporated Businesses + Unincorporated Businesses + Consumers",{"$f":"ROUND(ASCII2!C200-ASCII2!C41-ASCII2!C80-ASCII2!C119-ASCII2!C158-ASCII2!C197,5)","v":0}]
["Disbursements During Quarter: Total Number = Public Sector + Private Financial Institutions + Incorporated Businesses + Unincorporated Businesses + Consumers",{"$f":"ROUND(ASCII2!B201-ASCII2!B42-ASCII2!B81-ASCII2!B120-ASCII2!B159-ASCII2!B198,5)","v":0}]
["Disbursements During Quarter: Total Value = Public Sector + Private Financial Institutions + Incorporated Businesses + Unincorporated Businesses + Consumers",{"$f":"ROUND(ASCII2!C201-ASCII2!C42-ASCII2!C81-ASCII2!C120-ASCII2!C159-ASCII2!C198,5)","v":0}]
["Outstanding Balance as at Quarter End: Total Number = Public Sector + Private Financial Institutions + Incorporated Businesses + Unincorporated Businesses + Consumers",{"$f":"ROUND(ASCII2!B202-ASCII2!B43-ASCII2!B82-ASCII2!B121-ASCII2!B160-ASCII2!B199,5)","v":0}]
["Outstanding Balance as at Quarter End: Total Value = Public Sector + Private Financial Institutions + Incorporated Businesses + Unincorporated Businesses + Consumers",{"$f":"ROUND(ASCII2!C202-ASCII2!C43-ASCII2!C82-ASCII2!C121-ASCII2!C160-ASCII2!C199,5)","v":0}]
[]
["Page 2"]
[]
["Public Sector Approvals During Quarter: Total Number = Under 3% + 3.1% to 4.0% + 4.1% to 5.0% + 5.1% to 6.0% + 6.1% to 7.0% + 7.1% to 8.0% + 8.1% to 9.0% + 9.1% to 10.0% + 10.1% to 11% + 11.1% to 12.0% + 12.1% to 13.0% + 13.1% to 14% + 14.1% to 15.0% + 15.1% and Over",{"$f":"ROUND(ASCII2!B232-ASCII2!B204-ASCII2!B206-ASCII2!B208-ASCII2!B210-ASCII2!B212-ASCII2!B214-ASCII2!B216-ASCII2!B218-ASCII2!B220-ASCII2!B222-ASCII2!B224-ASCII2!B226-ASCII2!B228-ASCII2!B230,5)","v":0}]
["Public Sector Approvals During Quarter: Total Value = Under 3% + 3.1% to 4.0% + 4.1% to 5.0% + 5.1% to 6.0% + 6.1% to 7.0% + 7.1% to 8.0% + 8.1% to 9.0% + 9.1% to 10.0% + 10.1% to 11% + 11.1% to 12.0% + 12.1% to 13.0% + 13.1% to 14% + 14.1% to 15.0% + 15.1% and Over",{"$f":"ROUND(ASCII2!C232-ASCII2!C204-ASCII2!C206-ASCII2!C208-ASCII2!C210-ASCII2!C212-ASCII2!C214-ASCII2!C216-ASCII2!C218-ASCII2!C220-ASCII2!C222-ASCII2!C224-ASCII2!C226-ASCII2!C228-ASCII2!C230,5)","v":0}]
["Public Sector Outstanding Balance as at Quarter End: Total Number = Under 3% + 3.1% to 4.0% + 4.1% to 5.0% + 5.1% to 6.0% + 6.1% to 7.0% + 7.1% to 8.0% + 8.1% to 9.0% + 9.1% to 10.0% + 10.1% to 11% + 11.1% to 12.0% + 12.1% to 13.0% + 13.1% to 14% + 14.1% to 15.0% + 15.1% and Over",{"$f":"ROUND(ASCII2!B233-ASCII2!B205-ASCII2!B207-ASCII2!B209-ASCII2!B211-ASCII2!B213-ASCII2!B215-ASCII2!B217-ASCII2!B219-ASCII2!B221-ASCII2!B223-ASCII2!B225-ASCII2!B227-ASCII2!B229-ASCII2!B231,5)","v":0}]
["Public Sector Outstanding Balance as at Quarter End: Total Value = Under 3% + 3.1% to 4.0% + 4.1% to 5.0% + 5.1% to 6.0% + 6.1% to 7.0% + 7.1% to 8.0% + 8.1% to 9.0% + 9.1% to 10.0% + 10.1% to 11% + 11.1% to 12.0% + 12.1% to 13.0% + 13.1% to 14% + 14.1% to 15.0% + 15.1% and Over",{"$f":"ROUND(ASCII2!C233-ASCII2!C205-ASCII2!C207-ASCII2!C209-ASCII2!C211-ASCII2!C213-ASCII2!C215-ASCII2!C217-ASCII2!C219-ASCII2!C221-ASCII2!C223-ASCII2!C225-ASCII2!C227-ASCII2!C229-ASCII2!C231,5)","v":0}]
[]
["Private Financial Institutions Approvals During Quarter: Total Number = Under 3% + 3.1% to 4.0% + 4.1% to 5.0% + 5.1% to 6.0% + 6.1% to 7.0% + 7.1% to 8.0% + 8.1% to 9.0% + 9.1% to 10.0% + 10.1% to 11% + 11.1% to 12.0% + 12.1% to 13.0% + 13.1% to 14% + 14.1% to 15.0% + 15.1% and Over",{"$f":"ROUND(ASCII2!B262-ASCII2!B234-ASCII2!B236-ASCII2!B238-ASCII2!B240-ASCII2!B242-ASCII2!B244-ASCII2!B246-ASCII2!B248-ASCII2!B250-ASCII2!B252-ASCII2!B254-ASCII2!B256-ASCII2!B258-ASCII2!B260,5)","v":0}]
["Private Financial Institutions Approvals During Quarter: Total Value = Under 3% + 3.1% to 4.0% + 4.1% to 5.0% + 5.1% to 6.0% + 6.1% to 7.0% + 7.1% to 8.0% + 8.1% to 9.0% + 9.1% to 10.0% + 10.1% to 11% + 11.1% to 12.0% + 12.1% to 13.0% + 13.1% to 14% + 14.1% to 15.0% + 15.1% and Over",{"$f":"ROUND(ASCII2!C262-ASCII2!C234-ASCII2!C236-ASCII2!C238-ASCII2!C240-ASCII2!C242-ASCII2!C244-ASCII2!C246-ASCII2!C248-ASCII2!C250-ASCII2!C252-ASCII2!C254-ASCII2!C256-ASCII2!C258-ASCII2!C260,5)","v":0}]
["Private Financial Institutions Outstanding Balance as at Quarter End: Total Number = Under 3% + 3.1% to 4.0% + 4.1% to 5.0% + 5.1% to 6.0% + 6.1% to 7.0% + 7.1% to 8.0% + 8.1% to 9.0% + 9.1% to 10.0% + 10.1% to 11% + 11.1% to 12.0% + 12.1% to 13.0% + 13.1% to 14% + 14.1% to 15.0% + 15.1% and Over",{"$f":"ROUND(ASCII2!B263-ASCII2!B235-ASCII2!B237-ASCII2!B239-ASCII2!B241-ASCII2!B243-ASCII2!B245-ASCII2!B247-ASCII2!B249-ASCII2!B251-ASCII2!B253-ASCII2!B255-ASCII2!B257-ASCII2!B259-ASCII2!B261,5)","v":0}]
["Private Financial Institutions Outstanding Balance as at Quarter End: Total Value = Under 3% + 3.1% to 4.0% + 4.1% to 5.0% + 5.1% to 6.0% + 6.1% to 7.0% + 7.1% to 8.0% + 8.1% to 9.0% + 9.1% to 10.0% + 10.1% to 11% + 11.1% to 12.0% + 12.1% to 13.0% + 13.1% to 14% + 14.1% to 15.0% + 15.1% and Over",{"$f":"ROUND(ASCII2!C263-ASCII2!C235-ASCII2!C237-ASCII2!C239-ASCII2!C241-ASCII2!C243-ASCII2!C245-ASCII2!C247-ASCII2!C249-ASCII2!C251-ASCII2!C253-ASCII2!C255-ASCII2!C257-ASCII2!C259-ASCII2!C261,5)","v":0}]
[]
["Incorporated Businesses Approvals During Quarter: Total Number = Under 3% + 3.1% to 4.0% + 4.1% to 5.0% + 5.1% to 6.0% + 6.1% to 7.0% + 7.1% to 8.0% + 8.1% to 9.0% + 9.1% to 10.0% + 10.1% to 11% + 11.1% to 12.0% + 12.1% to 13.0% + 13.1% to 14% + 14.1% to 15.0% + 15.1% and Over",{"$f":"ROUND(ASCII2!B292-ASCII2!B264-ASCII2!B266-ASCII2!B268-ASCII2!B270-ASCII2!B272-ASCII2!B274-ASCII2!B276-ASCII2!B278-ASCII2!B280-ASCII2!B282-ASCII2!B284-ASCII2!B286-ASCII2!B288-ASCII2!B290,5)","v":0}]
["Incorporated Businesses Approvals During Quarter: Total Value = Under 3% + 3.1% to 4.0% + 4.1% to 5.0% + 5.1% to 6.0% + 6.1% to 7.0% + 7.1% to 8.0% + 8.1% to 9.0% + 9.1% to 10.0% + 10.1% to 11% + 11.1% to 12.0% + 12.1% to 13.0% + 13.1% to 14% + 14.1% to 15.0% + 15.1% and Over",{"$f":"ROUND(ASCII2!C292-ASCII2!C264-ASCII2!C266-ASCII2!C268-ASCII2!C270-ASCII2!C272-ASCII2!C274-ASCII2!C276-ASCII2!C278-ASCII2!C280-ASCII2!C282-ASCII2!C284-ASCII2!C286-ASCII2!C288-ASCII2!C290,5)","v":0}]
["Incorporated Businesses Outstanding Balance as at Quarter End: Total Number = Under 3% + 3.1% to 4.0% + 4.1% to 5.0% + 5.1% to 6.0% + 6.1% to 7.0% + 7.1% to 8.0% + 8.1% to 9.0% + 9.1% to 10.0% + 10.1% to 11% + 11.1% to 12.0% + 12.1% to 13.0% + 13.1% to 14% + 14.1% to 15.0% + 15.1% and Over",{"$f":"ROUND(ASCII2!B293-ASCII2!B265-ASCII2!B267-ASCII2!B269-ASCII2!B271-ASCII2!B273-ASCII2!B275-ASCII2!B277-ASCII2!B279-ASCII2!B281-ASCII2!B283-ASCII2!B285-ASCII2!B287-ASCII2!B289-ASCII2!B291,5)","v":0}]
["Incorporated Businesses Outstanding Balance as at Quarter End: Total Value = Under 3% + 3.1% to 4.0% + 4.1% to 5.0% + 5.1% to 6.0% + 6.1% to 7.0% + 7.1% to 8.0% + 8.1% to 9.0% + 9.1% to 10.0% + 10.1% to 11% + 11.1% to 12.0% + 12.1% to 13.0% + 13.1% to 14% + 14.1% to 15.0% + 15.1% and Over",{"$f":"ROUND(ASCII2!C293-ASCII2!C265-ASCII2!C267-ASCII2!C269-ASCII2!C271-ASCII2!C273-ASCII2!C275-ASCII2!C277-ASCII2!C279-ASCII2!C281-ASCII2!C283-ASCII2!C285-ASCII2!C287-ASCII2!C289-ASCII2!C291,5)","v":0}]
[]
["Unincorporated Businesses Approvals During Quarter: Total Number = Under 3% + 3.1% to 4.0% + 4.1% to 5.0% + 5.1% to 6.0% + 6.1% to 7.0% + 7.1% to 8.0% + 8.1% to 9.0% + 9.1% to 10.0% + 10.1% to 11% + 11.1% to 12.0% + 12.1% to 13.0% + 13.1% to 14% + 14.1% to 15.0% + 15.1% and Over",{"$f":"ROUND(ASCII2!B322-ASCII2!B294-ASCII2!B296-ASCII2!B298-ASCII2!B300-ASCII2!B302-ASCII2!B304-ASCII2!B306-ASCII2!B308-ASCII2!B310-ASCII2!B312-ASCII2!B314-ASCII2!B316-ASCII2!B318-ASCII2!B320,5)","v":0}]
["Unincorporated Businesses Approvals During Quarter: Total Value = Under 3% + 3.1% to 4.0% + 4.1% to 5.0% + 5.1% to 6.0% + 6.1% to 7.0% + 7.1% to 8.0% + 8.1% to 9.0% + 9.1% to 10.0% + 10.1% to 11% + 11.1% to 12.0% + 12.1% to 13.0% + 13.1% to 14% + 14.1% to 15.0% + 15.1% and Over",{"$f":"ROUND(ASCII2!C322-ASCII2!C294-ASCII2!C296-ASCII2!C298-ASCII2!C300-ASCII2!C302-ASCII2!C304-ASCII2!C306-ASCII2!C308-ASCII2!C310-ASCII2!C312-ASCII2!C314-ASCII2!C316-ASCII2!C318-ASCII2!C320,5)","v":0}]
["Unincorporated Businesses Outstanding Balance as at Quarter End: Total Number = Under 3% + 3.1% to 4.0% + 4.1% to 5.0% + 5.1% to 6.0% + 6.1% to 7.0% + 7.1% to 8.0% + 8.1% to 9.0% + 9.1% to 10.0% + 10.1% to 11% + 11.1% to 12.0% + 12.1% to 13.0% + 13.1% to 14% + 14.1% to 15.0% + 15.1% and Over",{"$f":"ROUND(ASCII2!B323-ASCII2!B295-ASCII2!B297-ASCII2!B299-ASCII2!B301-ASCII2!B303-ASCII2!B305-ASCII2!B307-ASCII2!B309-ASCII2!B311-ASCII2!B313-ASCII2!B315-ASCII2!B317-ASCII2!B319-ASCII2!B321,5)","v":0}]
["Unincorporated Businesses Outstanding Balance as at Quarter End: Total Value = Under 3% + 3.1% to 4.0% + 4.1% to 5.0% + 5.1% to 6.0% + 6.1% to 7.0% + 7.1% to 8.0% + 8.1% to 9.0% + 9.1% to 10.0% + 10.1% to 11% + 11.1% to 12.0% + 12.1% to 13.0% + 13.1% to 14% + 14.1% to 15.0% + 15.1% and Over",{"$f":"ROUND(ASCII2!C323-ASCII2!C295-ASCII2!C297-ASCII2!C299-ASCII2!C301-ASCII2!C303-ASCII2!C305-ASCII2!C307-ASCII2!C309-ASCII2!C311-ASCII2!C313-ASCII2!C315-ASCII2!C317-ASCII2!C319-ASCII2!C321,5)","v":0}]
[]
["Consumers Approvals During Quarter: Total Number = Under 3% + 3.1% to 4.0% + 4.1% to 5.0% + 5.1% to 6.0% + 6.1% to 7.0% + 7.1% to 8.0% + 8.1% to 9.0% + 9.1% to 10.0% + 10.1% to 11% + 11.1% to 12.0% + 12.1% to 13.0% + 13.1% to 14% + 14.1% to 15.0% + 15.1% and Over",{"$f":"ROUND(ASCII2!B352-ASCII2!B324-ASCII2!B326-ASCII2!B328-ASCII2!B330-ASCII2!B332-ASCII2!B334-ASCII2!B336-ASCII2!B338-ASCII2!B340-ASCII2!B342-ASCII2!B344-ASCII2!B346-ASCII2!B348-ASCII2!B350,5)","v":0}]
["Consumers Approvals During Quarter: Total Value = Under 3% + 3.1% to 4.0% + 4.1% to 5.0% + 5.1% to 6.0% + 6.1% to 7.0% + 7.1% to 8.0% + 8.1% to 9.0% + 9.1% to 10.0% + 10.1% to 11% + 11.1% to 12.0% + 12.1% to 13.0% + 13.1% to 14% + 14.1% to 15.0% + 15.1% and Over",{"$f":"ROUND(ASCII2!C352-ASCII2!C324-ASCII2!C326-ASCII2!C328-ASCII2!C330-ASCII2!C332-ASCII2!C334-ASCII2!C336-ASCII2!C338-ASCII2!C340-ASCII2!C342-ASCII2!C344-ASCII2!C346-ASCII2!C348-ASCII2!C350,5)","v":0}]
["Consumers Outstanding Balance as at Quarter End: Total Number = Under 3% + 3.1% to 4.0% + 4.1% to 5.0% + 5.1% to 6.0% + 6.1% to 7.0% + 7.1% to 8.0% + 8.1% to 9.0% + 9.1% to 10.0% + 10.1% to 11% + 11.1% to 12.0% + 12.1% to 13.0% + 13.1% to 14% + 14.1% to 15.0% + 15.1% and Over",{"$f":"ROUND(ASCII2!B353-ASCII2!B325-ASCII2!B327-ASCII2!B329-ASCII2!B331-ASCII2!B333-ASCII2!B335-ASCII2!B337-ASCII2!B339-ASCII2!B341-ASCII2!B343-ASCII2!B345-ASCII2!B347-ASCII2!B349-ASCII2!B351,5)","v":0}]
["Consumers Outstanding Balance as at Quarter End: Total Value = Under 3% + 3.1% to 4.0% + 4.1% to 5.0% + 5.1% to 6.0% + 6.1% to 7.0% + 7.1% to 8.0% + 8.1% to 9.0% + 9.1% to 10.0% + 10.1% to 11% + 11.1% to 12.0% + 12.1% to 13.0% + 13.1% to 14% + 14.1% to 15.0% + 15.1% and Over",{"$f":"ROUND(ASCII2!C353-ASCII2!C325-ASCII2!C327-ASCII2!C329-ASCII2!C331-ASCII2!C333-ASCII2!C335-ASCII2!C337-ASCII2!C339-ASCII2!C341-ASCII2!C343-ASCII2!C345-ASCII2!C347-ASCII2!C349-ASCII2!C351,5)","v":0}]
[]
["Approvals During Quarter: Total Number = Public Sector + Private Financial Institutions + Incorporated Businesses + Unincorporated Businesses + Consumers",{"$f":"ROUND(ASCII2!B354-ASCII2!B232-ASCII2!B262-ASCII2!B292-ASCII2!B322-ASCII2!B352,5)","v":0}]
["Approvals During Quarter: Total Value = Public Sector + Private Financial Institutions + Incorporated Businesses + Unincorporated Businesses + Consumers",{"$f":"ROUND(ASCII2!C354-ASCII2!C232-ASCII2!C262-ASCII2!C292-ASCII2!C322-ASCII2!C352,5)","v":0}]
["Outstanding Balance as at Quarter End: Total Number = Public Sector + Private Financial Institutions + Incorporated Businesses + Unincorporated Businesses + Consumers",{"$f":"ROUND(ASCII2!B355-ASCII2!B233-ASCII2!B263-ASCII2!B293-ASCII2!B323-ASCII2!B353,5)","v":0}]
["Outstanding Balance as at Quarter End: Total Value = Public Sector + Private Financial Institutions + Incorporated Businesses + Unincorporated Businesses + Consumers",{"$f":"ROUND(ASCII2!C355-ASCII2!C233-ASCII2!C263-ASCII2!C293-ASCII2!C323-ASCII2!C353,5)","v":0}]
[]
[]
["Page 3"]
[]
["Residential Disbursements During Quarter: Total Number = Under 3% + 3.1% to 4.0% + 4.1% to 5.0% + 5.1% to 6.0% + 6.1% to 7.0% + 7.1% to 8.0% + 8.1% to 9.0% + 9.1% to 10.0% + 10.1% to 11% + 11.1% to 12.0% + 12.1% to 13.0% + 13.1% to 14% + 14.1% to 15.0% + 15.1% and Over ",{"$f":"ROUND(ASCII2!B413-ASCII2!B357-ASCII2!B359-ASCII2!B361-ASCII2!B363-ASCII2!B365-ASCII2!B367-ASCII2!B369-ASCII2!B371-ASCII2!B373-ASCII2!B375-ASCII2!B377-ASCII2!B379-ASCII2!B381-ASCII2!B383,5)","v":0}]
["Residential Disbursements During Quarter: Total Value = Under 3% + 3.1% to 4.0% + 4.1% to 5.0% + 5.1% to 6.0% + 6.1% to 7.0% + 7.1% to 8.0% + 8.1% to 9.0% + 9.1% to 10.0% + 10.1% to 11% + 11.1% to 12.0% + 12.1% to 13.0% + 13.1% to 14% + 14.1% to 15.0% + 15.1% and Over",{"$f":"ROUND(ASCII2!C413-ASCII2!C357-ASCII2!C359-ASCII2!C361-ASCII2!C363-ASCII2!C365-ASCII2!C367-ASCII2!C369-ASCII2!C371-ASCII2!C373-ASCII2!C375-ASCII2!C377-ASCII2!C379-ASCII2!C381-ASCII2!C383,5)","v":0}]
["Residential Outstanding Balance as at Quarter End: Total Number = Under 3% + 3.1% to 4.0% + 4.1% to 5.0% + 5.1% to 6.0% + 6.1% to 7.0% + 7.1% to 8.0% + 8.1% to 9.0% + 9.1% to 10.0% + 10.1% to 11% + 11.1% to 12.0% + 12.1% to 13.0% + 13.1% to 14% + 14.1% to 15.0% + 15.1% and Over",{"$f":"ROUND(ASCII2!B414-ASCII2!B358-ASCII2!B360-ASCII2!B362-ASCII2!B364-ASCII2!B366-ASCII2!B368-ASCII2!B370-ASCII2!B372-ASCII2!B374-ASCII2!B376-ASCII2!B378-ASCII2!B380-ASCII2!B382-ASCII2!B384,5)","v":0}]
["Residential Outstanding Balance as at Quarter End: Total Value = Under 3% + 3.1% to 4.0% + 4.1% to 5.0% + 5.1% to 6.0% + 6.1% to 7.0% + 7.1% to 8.0% + 8.1% to 9.0% + 9.1% to 10.0% + 10.1% to 11% + 11.1% to 12.0% + 12.1% to 13.0% + 13.1% to 14% + 14.1% to 15.0% + 15.1% and Over",{"$f":"ROUND(ASCII2!C414-ASCII2!C358-ASCII2!C360-ASCII2!C362-ASCII2!C364-ASCII2!C366-ASCII2!C368-ASCII2!C370-ASCII2!C372-ASCII2!C374-ASCII2!C376-ASCII2!C378-ASCII2!C380-ASCII2!C382-ASCII2!C384,5)","v":0}]
[]
["Commercial Disbursements During Quarter: Total Number = Under 3% + 3.1% to 4.0% + 4.1% to 5.0% + 5.1% to 6.0% + 6.1% to 7.0% + 7.1% to 8.0% + 8.1% to 9.0% + 9.1% to 10.0% + 10.1% to 11% + 11.1% to 12.0% + 12.1% to 13.0% + 13.1% to 14% + 14.1% to 15.0% + 15.1% and Over",{"$f":"ROUND(ASCII2!B415-ASCII2!B385-ASCII2!B387-ASCII2!B389-ASCII2!B391-ASCII2!B393-ASCII2!B395-ASCII2!B397-ASCII2!B399-ASCII2!B401-ASCII2!B403-ASCII2!B405-ASCII2!B407-ASCII2!B409-ASCII2!B411,5)","v":0}]
["Commercial Disbursements During Quarter: Total Value = Under 3% + 3.1% to 4.0% + 4.1% to 5.0% + 5.1% to 6.0% + 6.1% to 7.0% + 7.1% to 8.0% + 8.1% to 9.0% + 9.1% to 10.0% + 10.1% to 11% + 11.1% to 12.0% + 12.1% to 13.0% + 13.1% to 14% + 14.1% to 15.0% + 15.1% and Over",{"$f":"ROUND(ASCII2!C415-ASCII2!C385-ASCII2!C387-ASCII2!C389-ASCII2!C391-ASCII2!C393-ASCII2!C395-ASCII2!C397-ASCII2!C399-ASCII2!C401-ASCII2!C403-ASCII2!C405-ASCII2!C407-ASCII2!C409-ASCII2!C411,5)","v":0}]
["Commercial Outstanding Balance as at Quarter End: Total Number = Under 3% + 3.1% to 4.0% + 4.1% to 5.0% + 5.1% to 6.0% + 6.1% to 7.0% + 7.1% to 8.0% + 8.1% to 9.0% + 9.1% to 10.0% + 10.1% to 11% + 11.1% to 12.0% + 12.1% to 13.0% + 13.1% to 14% + 14.1% to 15.0% + 15.1% and Over",{"$f":"ROUND(ASCII2!B416-ASCII2!B386-ASCII2!B388-ASCII2!B390-ASCII2!B392-ASCII2!B394-ASCII2!B396-ASCII2!B398-ASCII2!B400-ASCII2!B402-ASCII2!B404-ASCII2!B406-ASCII2!B408-ASCII2!B410-ASCII2!B412,5)","v":0}]
["Commercial Outstanding Balance as at Quarter End: Total Value = Under 3% + 3.1% to 4.0% + 4.1% to 5.0% + 5.1% to 6.0% + 6.1% to 7.0% + 7.1% to 8.0% + 8.1% to 9.0% + 9.1% to 10.0% + 10.1% to 11% + 11.1% to 12.0% + 12.1% to 13.0% + 13.1% to 14% + 14.1% to 15.0% + 15.1% and Over",{"$f":"ROUND(ASCII2!C416-ASCII2!C386-ASCII2!C388-ASCII2!C390-ASCII2!C392-ASCII2!C394-ASCII2!C396-ASCII2!C398-ASCII2!C400-ASCII2!C402-ASCII2!C404-ASCII2!C406-ASCII2!C408-ASCII2!C410-ASCII2!C412,5)","v":0}]
[]
["Disbursements During Quarter: Total Number = Residential + Commercial",{"$f":"ROUND(ASCII2!B417-ASCII2!B413-ASCII2!B415,5)","v":0}]
["Disbursements During Quarter: Total Value = Residential + Commercial",{"$f":"ROUND(ASCII2!C417-ASCII2!C413-ASCII2!C415,5)","v":0}]
["Outstanding Balance as at Quarter End: Total Number = Residential + Commercial",{"$f":"ROUND(ASCII2!B418-ASCII2!B414-ASCII2!B416,5)","v":0}]
["Outstanding Balance as at Quarter End: Total Value = Residential + Commercial",{"$f":"ROUND(ASCII2!C418-ASCII2!C414-ASCII2!C416,5)","v":0}]
[]
[]
["Page 4"]
[]
["Approvals During Quarter: Total Number = Renovation + Acquisition of Newly Constructed Houses + Purchase of Existing Houses + Purchase of Land",{"$f":"ROUND(ASCII2!B433-ASCII2!B420-ASCII2!B423-ASCII2!B426-ASCII2!B429,5)","v":0}]
["Approvals During Quarter: Total Value = Renovation + Acquisition of Newly Constructed Houses + Purchase of Existing Houses + Purchase of Land",{"$f":"ROUND(ASCII2!C433-ASCII2!C420-ASCII2!C423-ASCII2!C426-ASCII2!C429,5)","v":0}]
[]
["Disbursements During Quarter: Total Number = Renovation + Acquisition of Newly Constructed Houses + Purchase of Existing Houses + Purchase of Land",{"$f":"ROUND(ASCII2!B434-ASCII2!B421-ASCII2!B424-ASCII2!B427-ASCII2!B430,5)","v":0}]
["Disbursements During Quarter: Total Value = Renovation + Acquisition of Newly Constructed Houses + Purchase of Existing Houses + Purchase of Land",{"$f":"ROUND(ASCII2!C434-ASCII2!C421-ASCII2!C424-ASCII2!C427-ASCII2!C430,5)","v":0}]
[]
["Outstanding Balance as at Quarter End: Total Number = Renovation + Acquisition of Newly Constructed Houses + Purchase of Existing Houses + Purchase of Land",{"$f":"ROUND(ASCII2!B435-ASCII2!B422-ASCII2!B425-ASCII2!B428-ASCII2!B431,5)","v":0}]
["Outstanding Balance as at Quarter End: Total Value = Renovation + Acquisition of Newly Constructed Houses + Purchase of Existing Houses + Purchase of Land",{"$f":"ROUND(ASCII2!C435-ASCII2!C422-ASCII2!C425-ASCII2!C428-ASCII2!C431,5)","v":0}]
[]
[]
["Page 5"]
[]
["Public Sector Disbursements During Quarter: Total Number = Under 3% + 3.1% to 4.0% + 4.1% to 5.0% + 5.1% to 6.0% + 6.1% to 7.0% + 7.1% to 8.0% + 8.1% to 9.0% + 9.1% to 10.0% + 10.1% to 11% + 11.1% to 12.0% + 12.1% to 13.0% + 13.1% to 14% + 14.1% to 15.0% + 15.1% and Over",{"$f":"ROUND(ASCII2!B504-ASCII2!B451-ASCII2!B455-ASCII2!B459-ASCII2!B463-ASCII2!B467-ASCII2!B471-ASCII2!B475-ASCII2!B479-ASCII2!B483-ASCII2!B487-ASCII2!B491-ASCII2!B495-ASCII2!B499-ASCII2!B503,5)","v":0}]
["Public Sector Disbursements During Quarter: Total Value = Under 3% + 3.1% to 4.0% + 4.1% to 5.0% + 5.1% to 6.0% + 6.1% to 7.0% + 7.1% to 8.0% + 8.1% to 9.0% + 9.1% to 10.0% + 10.1% to 11% + 11.1% to 12.0% + 12.1% to 13.0% + 13.1% to 14% + 14.1% to 15.0% + 15.1% and Over",{"$f":"ROUND(ASCII2!C504-ASCII2!C451-ASCII2!C455-ASCII2!C459-ASCII2!C463-ASCII2!C467-ASCII2!C471-ASCII2!C475-ASCII2!C479-ASCII2!C483-ASCII2!C487-ASCII2!C491-ASCII2!C495-ASCII2!C499-ASCII2!C503,5)","v":0}]
[]
["Private Financial Institutions Disbursements During Quarter: Total Number = Under 3% + 3.1% to 4.0% + 4.1% to 5.0% + 5.1% to 6.0% + 6.1% to 7.0% + 7.1% to 8.0% + 8.1% to 9.0% + 9.1% to 10.0% + 10.1% to 11% + 11.1% to 12.0% + 12.1% to 13.0% + 13.1% to 14% + 14.1% to 15.0% + 15.1% and Over",{"$f":"ROUND(ASCII2!B561-ASCII2!B508-ASCII2!B512-ASCII2!B516-ASCII2!B520-ASCII2!B524-ASCII2!B528-ASCII2!B532-ASCII2!B536-ASCII2!B540-ASCII2!B544-ASCII2!B548-ASCII2!B552-ASCII2!B556-ASCII2!B560,5)","v":0}]
["Private Financial Institutions Disbursements During Quarter: Total Value = Under 3% + 3.1% to 4.0% + 4.1% to 5.0% + 5.1% to 6.0% + 6.1% to 7.0% + 7.1% to 8.0% + 8.1% to 9.0% + 9.1% to 10.0% + 10.1% to 11% + 11.1% to 12.0% + 12.1% to 13.0% + 13.1% to 14% + 14.1% to 15.0% + 15.1% and Over",{"$f":"ROUND(ASCII2!C561-ASCII2!C508-ASCII2!C512-ASCII2!C516-ASCII2!C520-ASCII2!C524-ASCII2!C528-ASCII2!C532-ASCII2!C536-ASCII2!C540-ASCII2!C544-ASCII2!C548-ASCII2!C552-ASCII2!C556-ASCII2!C560,5)","v":0}]
[]
["Incorporated Businesses Disbursements During Quarter: Total Number = Under 3% + 3.1% to 4.0% + 4.1% to 5.0% + 5.1% to 6.0% + 6.1% to 7.0% + 7.1% to 8.0% + 8.1% to 9.0% + 9.1% to 10.0% + 10.1% to 11% + 11.1% to 12.0% + 12.1% to 13.0% + 13.1% to 14% + 14.1% to 15.0% + 15.1% and Over",{"$f":"ROUND(ASCII2!B618-ASCII2!B565-ASCII2!B569-ASCII2!B573-ASCII2!B577-ASCII2!B581-ASCII2!B585-ASCII2!B589-ASCII2!B593-ASCII2!B597-ASCII2!B601-ASCII2!B605-ASCII2!B609-ASCII2!B613-ASCII2!B617,5)","v":0}]
["Incorporated Businesses Disbursements During Quarter: Total Value = Under 3% + 3.1% to 4.0% + 4.1% to 5.0% + 5.1% to 6.0% + 6.1% to 7.0% + 7.1% to 8.0% + 8.1% to 9.0% + 9.1% to 10.0% + 10.1% to 11% + 11.1% to 12.0% + 12.1% to 13.0% + 13.1% to 14% + 14.1% to 15.0% + 15.1% and Over",{"$f":"ROUND(ASCII2!C618-ASCII2!C565-ASCII2!C569-ASCII2!C573-ASCII2!C577-ASCII2!C581-ASCII2!C585-ASCII2!C589-ASCII2!C593-ASCII2!C597-ASCII2!C601-ASCII2!C605-ASCII2!C609-ASCII2!C613-ASCII2!C617,5)","v":0}]
[]
["Unincorporated Businesses Disbursements During Quarter: Total Number = Under 3% + 3.1% to 4.0% + 4.1% to 5.0% + 5.1% to 6.0% + 6.1% to 7.0% + 7.1% to 8.0% + 8.1% to 9.0% + 9.1% to 10.0% + 10.1% to 11% + 11.1% to 12.0% + 12.1% to 13.0% + 13.1% to 14% + 14.1% to 15.0% + 15.1% and Over",{"$f":"ROUND(ASCII2!B675-ASCII2!B622-ASCII2!B626-ASCII2!B630-ASCII2!B634-ASCII2!B638-ASCII2!B642-ASCII2!B646-ASCII2!B650-ASCII2!B654-ASCII2!B658-ASCII2!B662-ASCII2!B666-ASCII2!B670-ASCII2!B674,5)","v":0}]
["Unincorporated Businesses Disbursements During Quarter: Total Value = Under 3% + 3.1% to 4.0% + 4.1% to 5.0% + 5.1% to 6.0% + 6.1% to 7.0% + 7.1% to 8.0% + 8.1% to 9.0% + 9.1% to 10.0% + 10.1% to 11% + 11.1% to 12.0% + 12.1% to 13.0% + 13.1% to 14% + 14.1% to 15.0% + 15.1% and Over",{"$f":"ROUND(ASCII2!C675-ASCII2!C622-ASCII2!C626-ASCII2!C630-ASCII2!C634-ASCII2!C638-ASCII2!C642-ASCII2!C646-ASCII2!C650-ASCII2!C654-ASCII2!C658-ASCII2!C662-ASCII2!C666-ASCII2!C670-ASCII2!C674,5)","v":0}]
[]
["Consumers Disbursements During Quarter: Total Number = Under 3% + 3.1% to 4.0% + 4.1% to 5.0% + 5.1% to 6.0% + 6.1% to 7.0% + 7.1% to 8.0% + 8.1% to 9.0% + 9.1% to 10.0% + 10.1% to 11% + 11.1% to 12.0% + 12.1% to 13.0% + 13.1% to 14% + 14.1% to 15.0% + 15.1% and Over",{"$f":"ROUND(ASCII2!B732-ASCII2!B679-ASCII2!B683-ASCII2!B687-ASCII2!B691-ASCII2!B695-ASCII2!B699-ASCII2!B703-ASCII2!B707-ASCII2!B711-ASCII2!B715-ASCII2!B719-ASCII2!B723-ASCII2!B727-ASCII2!B731,5)","v":0}]
["Consumers Disbursements During Quarter: Total Value = Under 3% + 3.1% to 4.0% + 4.1% to 5.0% + 5.1% to 6.0% + 6.1% to 7.0% + 7.1% to 8.0% + 8.1% to 9.0% + 9.1% to 10.0% + 10.1% to 11% + 11.1% to 12.0% + 12.1% to 13.0% + 13.1% to 14% + 14.1% to 15.0% + 15.1% and Over",{"$f":"ROUND(ASCII2!C732-ASCII2!C679-ASCII2!C683-ASCII2!C687-ASCII2!C691-ASCII2!C695-ASCII2!C699-ASCII2!C703-ASCII2!C707-ASCII2!C711-ASCII2!C715-ASCII2!C719-ASCII2!C723-ASCII2!C727-ASCII2!C731,5)","v":0}]
[]
["Disbursements During Quarter: Total Number = Public Sector + Private Financial Institutions + Incorporated Businesses + Unincorporated Businesses + Consumers",{"$f":"ROUND(ASCII2!B736-ASCII2!B733-ASCII2!B734-ASCII2!B735,5)","v":0}]
["Disbursements During Quarter: Total Value = Public Sector + Private Financial Institutions + Incorporated Businesses + Unincorporated Businesses + Consumers",{"$f":"ROUND(ASCII2!C736-ASCII2!C733-ASCII2!C734-ASCII2!C735,5)","v":0}]
[]
[]
["Page 6"]
[]
["Public Sector Outstanding Balance as at Quarter End: Total Number = Under 3% + 3.1% to 4.0% + 4.1% to 5.0% + 5.1% to 6.0% + 6.1% to 7.0% + 7.1% to 8.0% + 8.1% to 9.0% + 9.1% to 10.0% + 10.1% to 11% + 11.1% to 12.0% + 12.1% to 13.0% + 13.1% to 14% + 14.1% to 15.0% + 15.1% and Over",{"$f":"ROUND(ASCII2!B794-ASCII2!B741-ASCII2!B745-ASCII2!B749-ASCII2!B753-ASCII2!B757-ASCII2!B761-ASCII2!B765-ASCII2!B769-ASCII2!B773-ASCII2!B777-ASCII2!B781-ASCII2!B785-ASCII2!B789-ASCII2!B793,5)","v":0}]
["Public Sector Outstanding Balance as at Quarter End: Total Value = Under 3% + 3.1% to 4.0% + 4.1% to 5.0% + 5.1% to 6.0% + 6.1% to 7.0% + 7.1% to 8.0% + 8.1% to 9.0% + 9.1% to 10.0% + 10.1% to 11% + 11.1% to 12.0% + 12.1% to 13.0% + 13.1% to 14% + 14.1% to 15.0% + 15.1% and Over",{"$f":"ROUND(ASCII2!C794-ASCII2!C741-ASCII2!C745-ASCII2!C749-ASCII2!C753-ASCII2!C757-ASCII2!C761-ASCII2!C765-ASCII2!C769-ASCII2!C773-ASCII2!C777-ASCII2!C781-ASCII2!C785-ASCII2!C789-ASCII2!C793,5)","v":0}]
[]
["Private Financial Institutions Outstanding Balance as at Quarter End During Quarter: Total Number = Under 3% + 3.1% to 4.0% + 4.1% to 5.0% + 5.1% to 6.0% + 6.1% to 7.0% + 7.1% to 8.0% + 8.1% to 9.0% + 9.1% to 10.0% + 10.1% to 11% + 11.1% to 12.0% + 12.1% to 13.0% + 13.1% to 14% + 14.1% to 15.0% + 15.1% and Over",{"$f":"ROUND(ASCII2!B851-ASCII2!B798-ASCII2!B802-ASCII2!B806-ASCII2!B810-ASCII2!B814-ASCII2!B818-ASCII2!B822-ASCII2!B826-ASCII2!B830-ASCII2!B834-ASCII2!B838-ASCII2!B842-ASCII2!B846-ASCII2!B850,5)","v":0}]
["Private Financial Institutions Outstanding Balance as at Quarter End During Quarter: Total Value = Under 3% + 3.1% to 4.0% + 4.1% to 5.0% + 5.1% to 6.0% + 6.1% to 7.0% + 7.1% to 8.0% + 8.1% to 9.0% + 9.1% to 10.0% + 10.1% to 11% + 11.1% to 12.0% + 12.1% to 13.0% + 13.1% to 14% + 14.1% to 15.0% + 15.1% and Over",{"$f":"ROUND(ASCII2!C851-ASCII2!C798-ASCII2!C802-ASCII2!C806-ASCII2!C810-ASCII2!C814-ASCII2!C818-ASCII2!C822-ASCII2!C826-ASCII2!C830-ASCII2!C834-ASCII2!C838-ASCII2!C842-ASCII2!C846-ASCII2!C850,5)","v":0}]
[]
["Incorporated Businesses Outstanding Balance as at Quarter End During Quarter: Total Number = Under 3% + 3.1% to 4.0% + 4.1% to 5.0% + 5.1% to 6.0% + 6.1% to 7.0% + 7.1% to 8.0% + 8.1% to 9.0% + 9.1% to 10.0% + 10.1% to 11% + 11.1% to 12.0% + 12.1% to 13.0% + 13.1% to 14% + 14.1% to 15.0% + 15.1% and Over",{"$f":"ROUND(ASCII2!B908-ASCII2!B855-ASCII2!B859-ASCII2!B863-ASCII2!B867-ASCII2!B871-ASCII2!B875-ASCII2!B879-ASCII2!B883-ASCII2!B887-ASCII2!B891-ASCII2!B895-ASCII2!B899-ASCII2!B903-ASCII2!B907,5)","v":0}]
["Incorporated Businesses Outstanding Balance as at Quarter End During Quarter: Total Value = Under 3% + 3.1% to 4.0% + 4.1% to 5.0% + 5.1% to 6.0% + 6.1% to 7.0% + 7.1% to 8.0% + 8.1% to 9.0% + 9.1% to 10.0% + 10.1% to 11% + 11.1% to 12.0% + 12.1% to 13.0% + 13.1% to 14% + 14.1% to 15.0% + 15.1% and Over",{"$f":"ROUND(ASCII2!C908-ASCII2!C855-ASCII2!C859-ASCII2!C863-ASCII2!C867-ASCII2!C871-ASCII2!C875-ASCII2!C879-ASCII2!C883-ASCII2!C887-ASCII2!C891-ASCII2!C895-ASCII2!C899-ASCII2!C903-ASCII2!C907,5)","v":0}]
[]
["Unincorporated Businesses Outstanding Balance as at Quarter End: Total Number = Under 3% + 3.1% to 4.0% + 4.1% to 5.0% + 5.1% to 6.0% + 6.1% to 7.0% + 7.1% to 8.0% + 8.1% to 9.0% + 9.1% to 10.0% + 10.1% to 11% + 11.1% to 12.0% + 12.1% to 13.0% + 13.1% to 14% + 14.1% to 15.0% + 15.1% and Over",{"$f":"ROUND(ASCII2!B965-ASCII2!B912-ASCII2!B916-ASCII2!B920-ASCII2!B924-ASCII2!B928-ASCII2!B932-ASCII2!B936-ASCII2!B940-ASCII2!B944-ASCII2!B948-ASCII2!B952-ASCII2!B956-ASCII2!B960-ASCII2!B964,5)","v":0}]
["Unincorporated Businesses Outstanding Balance as at Quarter End: Total Value = Under 3% + 3.1% to 4.0% + 4.1% to 5.0% + 5.1% to 6.0% + 6.1% to 7.0% + 7.1% to 8.0% + 8.1% to 9.0% + 9.1% to 10.0% + 10.1% to 11% + 11.1% to 12.0% + 12.1% to 13.0% + 13.1% to 14% + 14.1% to 15.0% + 15.1% and Over",{"$f":"ROUND(ASCII2!C965-ASCII2!C912-ASCII2!C916-ASCII2!C920-ASCII2!C924-ASCII2!C928-ASCII2!C932-ASCII2!C936-ASCII2!C940-ASCII2!C944-ASCII2!C948-ASCII2!C952-ASCII2!C956-ASCII2!C960-ASCII2!C964,5)","v":0}]
[]
["Consumers Outstanding Balance as at Quarter End: Total Number = Under 3% + 3.1% to 4.0% + 4.1% to 5.0% + 5.1% to 6.0% + 6.1% to 7.0% + 7.1% to 8.0% + 8.1% to 9.0% + 9.1% to 10.0% + 10.1% to 11% + 11.1% to 12.0% + 12.1% to 13.0% + 13.1% to 14% + 14.1% to 15.0% + 15.1% and Over",{"$f":"ROUND(ASCII2!B1022-ASCII2!B969-ASCII2!B973-ASCII2!B977-ASCII2!B981-ASCII2!B985-ASCII2!B989-ASCII2!B993-ASCII2!B997-ASCII2!B1001-ASCII2!B1005-ASCII2!B1009-ASCII2!B1013-ASCII2!B1017-ASCII2!B1021,5)","v":0}]
["Consumers Outstanding Balance as at Quarter End: Total Value = Under 3% + 3.1% to 4.0% + 4.1% to 5.0% + 5.1% to 6.0% + 6.1% to 7.0% + 7.1% to 8.0% + 8.1% to 9.0% + 9.1% to 10.0% + 10.1% to 11% + 11.1% to 12.0% + 12.1% to 13.0% + 13.1% to 14% + 14.1% to 15.0% + 15.1% and Over",{"$f":"ROUND(ASCII2!C1022-ASCII2!C969-ASCII2!C973-ASCII2!C977-ASCII2!C981-ASCII2!C985-ASCII2!C989-ASCII2!C993-ASCII2!C997-ASCII2!C1001-ASCII2!C1005-ASCII2!C1009-ASCII2!C1013-ASCII2!C1017-ASCII2!C1021,5)","v":0}]
[]
["Outstanding Balance as at Quarter End: Total Number = Public Sector + Private Financial Institutions + Incorporated Businesses + Unincorporated Businesses + Consumers",{"$f":"ROUND(ASCII2!B1026-ASCII2!B1023-ASCII2!B1024-ASCII2!B1025,5)","v":0}]
["Outstanding Balance as at Quarter End: Total Value = Public Sector + Private Financial Institutions + Incorporated Businesses + Unincorporated Businesses + Consumers",{"$f":"ROUND(ASCII2!C1026-ASCII2!C1023-ASCII2!C1024-ASCII2!C1025,5)","v":0}]
[]
[]
["Page 7"]
[]
["New Mortgages (Total Number) = Up to 5 years",{"$f":"ROUND(ASCII2!B1031-ASCII2!B1028-ASCII2!B1029-ASCII2!B1030,5)","v":0}]
["New Mortgages (Total Value) = Up to 5 years",{"$f":"ROUND(ASCII2!C1031-ASCII2!C1028-ASCII2!C1029-ASCII2!C1030,5)","v":0}]
[]
["New Mortgages (Total Number) = Over 5 years to 10 years",{"$f":"ROUND(ASCII2!B1035-ASCII2!B1032-ASCII2!B1033-ASCII2!B1034,5)","v":0}]
["New Mortgages (Total Value) = Over 5 years to 10 years",{"$f":"ROUND(ASCII2!C1035-ASCII2!C1032-ASCII2!C1033-ASCII2!C1034,5)","v":0}]
[]
["New Mortgages (Total Number) = Over 10 years to 15 years",{"$f":"ROUND(ASCII2!B1039-ASCII2!B1036-ASCII2!B1037-ASCII2!B1038,5)","v":0}]
["New Mortgages (Total Value) = Over 10 years to 15 years",{"$f":"ROUND(ASCII2!C1039-ASCII2!C1036-ASCII2!C1037-ASCII2!C1038,5)","v":0}]
[]
["New Mortgages (Total Number) = Over 15 years to 20 years",{"$f":"ROUND(ASCII2!B1043-ASCII2!B1040-ASCII2!B1041-ASCII2!B1042,5)","v":0}]
["New Mortgages (Total Value) = Over 15 years to 20 years",{"$f":"ROUND(ASCII2!C1043-ASCII2!C1040-ASCII2!C1041-ASCII2!C1042,5)","v":0}]
[]
["New Mortgages (Total Number) = Over 20 years to 25 years",{"$f":"ROUND(ASCII2!B1047-ASCII2!B1044-ASCII2!B1045-ASCII2!B1046,5)","v":0}]
["New Mortgages (Total Value) = Over 20 years to 25 years",{"$f":"ROUND(ASCII2!C1047-ASCII2!C1044-ASCII2!C1045-ASCII2!C1046,5)","v":0}]
[]
["New Mortgages (Total Number) = Over 25 years to 30 years",{"$f":"ROUND(ASCII2!B1051-ASCII2!B1048-ASCII2!B1049-ASCII2!B1050,5)","v":0}]
["New Mortgages (Total Value) = Over 25 years to 30 years",{"$f":"ROUND(ASCII2!C1051-ASCII2!C1048-ASCII2!C1049-ASCII2!C1050,5)","v":0}]
[]
["New Mortgages (Total Number) = Over 30 years",{"$f":"ROUND(ASCII2!B1055-ASCII2!B1052-ASCII2!B1053-ASCII2!B1054,5)","v":0}]
["New Mortgages (Total Value) = Over 30 years",{"$f":"ROUND(ASCII2!C1055-ASCII2!C1052-ASCII2!C1053-ASCII2!C1054,5)","v":0}]
[]
["New Mortgages (Total Value) = Under 5 years + Over 5 years to 10 years + Over 10 years to 15 years + Over 15 years to 20 years + Over 20 years to 25 years + Over 25 years to 30 years + Over 30 years",{"$f":"ROUND(ASCII2!B1068-ASCII2!C1064-ASCII2!C1065-ASCII2!C1066,5)","v":0}]
[]
[]
["Page 8"]
[]
["Public Sector Actual Loan Rates Approvals During Quarter - Fixed Rate ",{"$f":"IF(ASCII2!B1071<ASCII2!B1070,\"Error\",\"Correct\")","v":"Correct"}]
["Public Sector Actual Loan Rates Interest Margin Applied - Fixed Rate",{"$f":"IF(ASCII2!B1073<ASCII2!B1072,\"Error\",\"Correct\")","v":"Correct"}]
["Public Sector Actual Loan Rates Disbursements During Quarter - Fixed Rate ",{"$f":"IF(ASCII2!B1075<ASCII2!B1074,\"Error\",\"Correct\")","v":"Correct"}]
["Public Sector Actual Loan Rates Interest Margin Applied - Fixed Rate",{"$f":"IF(ASCII2!B1077<ASCII2!B1076,\"Error\",\"Correct\")","v":"Correct"}]
["Public Sector Actual Loan Rates Outstanding Balance as at Quarter End - Fixed Rate ",{"$f":"IF(ASCII2!B1079<ASCII2!B1078,\"Error\",\"Correct\")","v":"Correct"}]
["Public Sector Actual Loan Rates Interest Margin Applied - Fixed Rate",{"$f":"IF(ASCII2!B1081<ASCII2!B1080,\"Error\",\"Correct\")","v":"Correct"}]
[]
["Private Financial Institutions Actual Loan Rates Approvals During Quarter - Fixed Rate ",{"$f":"IF(ASCII2!B1083<ASCII2!B1082,\"Error\",\"Correct\")","v":"Correct"}]
["Private Financial Institutions Actual Loan Rates Interest Margin Applied - Fixed Rate",{"$f":"IF(ASCII2!B1085<ASCII2!B1084,\"Error\",\"Correct\")","v":"Correct"}]
["Private Financial Institutions Actual Loan Rates Disbursements During Quarter - Fixed Rate ",{"$f":"IF(ASCII2!B1087<ASCII2!B1086,\"Error\",\"Correct\")","v":"Correct"}]
["Private Financial Institutions Actual Loan Rates Interest Margin Applied - Fixed Rate",{"$f":"IF(ASCII2!B1089<ASCII2!B1088,\"Error\",\"Correct\")","v":"Correct"}]
["Private Financial Institutions Actual Loan Rates Outstanding Balance as at Quarter End - Fixed Rate ",{"$f":"IF(ASCII2!B1091<ASCII2!B1090,\"Error\",\"Correct\")","v":"Correct"}]
["Private Financial Institutions Actual Loan Rates Interest Margin Applied - Fixed Rate",{"$f":"IF(ASCII2!B1093<ASCII2!B1092,\"Error\",\"Correct\")","v":"Correct"}]
[]
["Incorporated Businesses Actual Loan Rates Approvals During Quarter - Fixed Rate ",{"$f":"IF(ASCII2!B1095<ASCII2!B1094,\"Error\",\"Correct\")","v":"Correct"}]
["Incorporated Businesses Actual Loan Rates Interest Margin Applied - Fixed Rate",{"$f":"IF(ASCII2!B1097<ASCII2!B1096,\"Error\",\"Correct\")","v":"Correct"}]
["Incorporated Businesses Actual Loan Rates Disbursements During Quarter - Fixed Rate ",{"$f":"IF(ASCII2!B1099<ASCII2!B1098,\"Error\",\"Correct\")","v":"Correct"}]
["Incorporated Businesses Actual Loan Rates Interest Margin Applied - Fixed Rate",{"$f":"IF(ASCII2!B1101<ASCII2!B1100,\"Error\",\"Correct\")","v":"Correct"}]
["Incorporated Businesses Actual Loan Rates Outstanding Balance as at Quarter End - Fixed Rate ",{"$f":"IF(ASCII2!B1103<ASCII2!B1102,\"Error\",\"Correct\")","v":"Correct"}]
["Incorporated Businesses Actual Loan Rates Interest Margin Applied - Fixed Rate",{"$f":"IF(ASCII2!B1105<ASCII2!B1104,\"Error\",\"Correct\")","v":"Correct"}]
[]
["Unincorporated Businesses Actual Loan Rates Approvals During Quarter - Fixed Rate ",{"$f":"IF(ASCII2!B1107<ASCII2!B1106,\"Error\",\"Correct\")","v":"Correct"}]
["Unincorporated Businesses Actual Loan Rates Interest Margin Applied - Fixed Rate",{"$f":"IF(ASCII2!B1109<ASCII2!B1108,\"Error\",\"Correct\")","v":"Correct"}]
["Unincorporated Businesses Actual Loan Rates Disbursements During Quarter - Fixed Rate ",{"$f":"IF(ASCII2!B1111<ASCII2!B1110,\"Error\",\"Correct\")","v":"Correct"}]
["Unincorporated Businesses Actual Loan Rates Interest Margin Applied - Fixed Rate",{"$f":"IF(ASCII2!B1113<ASCII2!B1112,\"Error\",\"Correct\")","v":"Correct"}]
["Unincorporated Businesses Actual Loan Rates Outstanding Balance as at Quarter End - Fixed Rate ",{"$f":"IF(ASCII2!B1115<ASCII2!B1114,\"Error\",\"Correct\")","v":"Correct"}]
["Unincorporated Businesses Actual Loan Rates Interest Margin Applied - Fixed Rate",{"$f":"IF(ASCII2!B1117<ASCII2!B1116,\"Error\",\"Correct\")","v":"Correct"}]
[]
["Consumers Actual Loan Rates Approvals During Quarter - Fixed Rate ",{"$f":"IF(ASCII2!B1119<ASCII2!B1118,\"Error\",\"Correct\")","v":"Correct"}]
["Consumers Actual Loan Rates Interest Margin Applied - Fixed Rate",{"$f":"IF(ASCII2!B1121<ASCII2!B1120,\"Error\",\"Correct\")","v":"Correct"}]
["Consumers Actual Loan Rates Disbursements During Quarter - Fixed Rate ",{"$f":"IF(ASCII2!B1123<ASCII2!B1122,\"Error\",\"Correct\")","v":"Correct"}]
["Consumers Actual Loan Rates Interest Margin Applied - Fixed Rate",{"$f":"IF(ASCII2!B1125<ASCII2!B1124,\"Error\",\"Correct\")","v":"Correct"}]
["Consumers Actual Loan Rates Outstanding Balance as at Quarter End - Fixed Rate ",{"$f":"IF(ASCII2!B1127<ASCII2!B1126,\"Error\",\"Correct\")","v":"Correct"}]
["Consumers Actual Loan Rates Interest Margin Applied - Fixed Rate",{"$f":"IF(ASCII2!B1129<ASCII2!B1128,\"Error\",\"Correct\")","v":"Correct"}]
[]
[]
["Public Sector Actual Loan Rates Approvals During Quarter - Variable Rate ",{"$f":"IF(ASCII2!B1131<ASCII2!B1130,\"Error\",\"Correct\")","v":"Correct"}]
["Public Sector Actual Loan Rates Interest Margin Applied - Variable Rate",{"$f":"IF(ASCII2!B1133<ASCII2!B1132,\"Error\",\"Correct\")","v":"Correct"}]
["Public Sector Actual Loan Rates Disbursements During Quarter - Variable Rate ",{"$f":"IF(ASCII2!B1135<ASCII2!B1134,\"Error\",\"Correct\")","v":"Correct"}]
["Public Sector Actual Loan Rates Interest Margin Applied - Variable Rate",{"$f":"IF(ASCII2!B1137<ASCII2!B1136,\"Error\",\"Correct\")","v":"Correct"}]
["Public Sector Actual Loan Rates Outstanding Balance as at Quarter End - Variable Rate ",{"$f":"IF(ASCII2!B1139<ASCII2!B1138,\"Error\",\"Correct\")","v":"Correct"}]
["Public Sector Actual Loan Rates Interest Margin Applied - Variable Rate",{"$f":"IF(ASCII2!B1141<ASCII2!B1140,\"Error\",\"Correct\")","v":"Correct"}]
[]
["Private Financial Institutions Actual Loan Rates Approvals During Quarter - Variable Rate ",{"$f":"IF(ASCII2!B1143<ASCII2!B1142,\"Error\",\"Correct\")","v":"Correct"}]
["Private Financial Institutions Actual Loan Rates Interest Margin Applied - Variable Rate",{"$f":"IF(ASCII2!B1145<ASCII2!B1144,\"Error\",\"Correct\")","v":"Correct"}]
["Private Financial Institutions Actual Loan Rates Disbursements During Quarter - Variable Rate ",{"$f":"IF(ASCII2!B1147<ASCII2!B1146,\"Error\",\"Correct\")","v":"Correct"}]
["Private Financial Institutions Actual Loan Rates Interest Margin Applied - Variable Rate",{"$f":"IF(ASCII2!B1149<ASCII2!B1148,\"Error\",\"Correct\")","v":"Correct"}]
["Private Financial Institutions Actual Loan Rates Outstanding Balance as at Quarter End - Variable Rate ",{"$f":"IF(ASCII2!B1151<ASCII2!B1150,\"Error\",\"Correct\")","v":"Correct"}]
["Private Financial Institutions Actual Loan Rates Interest Margin Applied - Variable Rate",{"$f":"IF(ASCII2!B1153<ASCII2!B1152,\"Error\",\"Correct\")","v":"Correct"}]
[]
["Incorporated Businesses Actual Loan Rates Approvals During Quarter - Variable Rate ",{"$f":"IF(ASCII2!B1155<ASCII2!B1154,\"Error\",\"Correct\")","v":"Correct"}]
["Incorporated Businesses Actual Loan Rates Interest Margin Applied - Variable Rate",{"$f":"IF(ASCII2!B1157<ASCII2!B1156,\"Error\",\"Correct\")","v":"Correct"}]
["Incorporated Businesses Actual Loan Rates Disbursements During Quarter - Variable Rate ",{"$f":"IF(ASCII2!B1159<ASCII2!B1158,\"Error\",\"Correct\")","v":"Correct"}]
["Incorporated Businesses Actual Loan Rates Interest Margin Applied - Variable Rate",{"$f":"IF(ASCII2!B1161<ASCII2!B1160,\"Error\",\"Correct\")","v":"Correct"}]
["Incorporated Businesses Actual Loan Rates Outstanding Balance as at Quarter End - Variable Rate ",{"$f":"IF(ASCII2!B1163<ASCII2!B1162,\"Error\",\"Correct\")","v":"Correct"}]
["Incorporated Businesses Actual Loan Rates Interest Margin Applied - Variable Rate",{"$f":"IF(ASCII2!B1165<ASCII2!B1164,\"Error\",\"Correct\")","v":"Correct"}]
[]
["Unincorporated Businesses Actual Loan Rates Approvals During Quarter - Variable Rate ",{"$f":"IF(ASCII2!B1167<ASCII2!B1166,\"Error\",\"Correct\")","v":"Correct"}]
["Unincorporated Businesses Actual Loan Rates Interest Margin Applied - Variable Rate",{"$f":"IF(ASCII2!B1169<ASCII2!B1168,\"Error\",\"Correct\")","v":"Correct"}]
["Unincorporated Businesses Actual Loan Rates Disbursements During Quarter - Variable Rate ",{"$f":"IF(ASCII2!B1171<ASCII2!B1170,\"Error\",\"Correct\")","v":"Correct"}]
["Unincorporated Businesses Actual Loan Rates Interest Margin Applied - Variable Rate",{"$f":"IF(ASCII2!B1173<ASCII2!B1172,\"Error\",\"Correct\")","v":"Correct"}]
["Unincorporated Businesses Actual Loan Rates Outstanding Balance as at Quarter End - Variable Rate ",{"$f":"IF(ASCII2!B1175<ASCII2!B1174,\"Error\",\"Correct\")","v":"Correct"}]
["Unincorporated Businesses Actual Loan Rates Interest Margin Applied - Variable Rate",{"$f":"IF(ASCII2!B1177<ASCII2!B1176,\"Error\",\"Correct\")","v":"Correct"}]
[]
["Consumers Actual Loan Rates Approvals During Quarter - Variable Rate ",{"$f":"IF(ASCII2!B1179<ASCII2!B1178,\"Error\",\"Correct\")","v":"Correct"}]
["Consumers Actual Loan Rates Interest Margin Applied - Variable Rate",{"$f":"IF(ASCII2!B1181<ASCII2!B1180,\"Error\",\"Correct\")","v":"Correct"}]
["Consumers Actual Loan Rates Disbursements During Quarter - Variable Rate ",{"$f":"IF(ASCII2!B1183<ASCII2!B1182,\"Error\",\"Correct\")","v":"Correct"}]
["Consumers Actual Loan Rates Interest Margin Applied - Variable Rate",{"$f":"IF(ASCII2!B1185<ASCII2!B1184,\"Error\",\"Correct\")","v":"Correct"}]
["Consumers Actual Loan Rates Outstanding Balance as at Quarter End - Variable Rate ",{"$f":"IF(ASCII2!B1187<ASCII2!B1186,\"Error\",\"Correct\")","v":"Correct"}]
["Consumers Actual Loan Rates Interest Margin Applied - Variable Rate",{"$f":"IF(ASCII2!B1189<ASCII2!B1188,\"Error\",\"Correct\")","v":"Correct"}]
[]
[]
["Public Sector Actual Loan Rates Approvals During Quarter - Adjustable Rate ",{"$f":"IF(ASCII2!B1191<ASCII2!B1190,\"Error\",\"Correct\")","v":"Correct"}]
["Public Sector Actual Loan Rates Interest Margin Applied - Adjustable Rate",{"$f":"IF(ASCII2!B1193<ASCII2!B1192,\"Error\",\"Correct\")","v":"Correct"}]
["Public Sector Actual Loan Rates Disbursements During Quarter - Adjustable Rate ",{"$f":"IF(ASCII2!B1195<ASCII2!B1194,\"Error\",\"Correct\")","v":"Correct"}]
["Public Sector Actual Loan Rates Interest Margin Applied - Adjustable Rate",{"$f":"IF(ASCII2!B1197<ASCII2!B1196,\"Error\",\"Correct\")","v":"Correct"}]
["Public Sector Actual Loan Rates Outstanding Balance as at Quarter End - Adjustable Rate ",{"$f":"IF(ASCII2!B1199<ASCII2!B1198,\"Error\",\"Correct\")","v":"Correct"}]
["Public Sector Actual Loan Rates Interest Margin Applied - Adjustable Rate",{"$f":"IF(ASCII2!B1201<ASCII2!B1200,\"Error\",\"Correct\")","v":"Correct"}]
[]
["Private Financial Institutions Actual Loan Rates Approvals During Quarter - Adjustable Rate ",{"$f":"IF(ASCII2!B1203<ASCII2!B1202,\"Error\",\"Correct\")","v":"Correct"}]
["Private Financial Institutions Actual Loan Rates Interest Margin Applied - Adjustable Rate",{"$f":"IF(ASCII2!B1205<ASCII2!B1204,\"Error\",\"Correct\")","v":"Correct"}]
["Private Financial Institutions Actual Loan Rates Disbursements During Quarter - Adjustable Rate ",{"$f":"IF(ASCII2!B1207<ASCII2!B1206,\"Error\",\"Correct\")","v":"Correct"}]
["Private Financial Institutions Actual Loan Rates Interest Margin Applied - Adjustable Rate",{"$f":"IF(ASCII2!B1209<ASCII2!B1208,\"Error\",\"Correct\")","v":"Correct"}]
["Private Financial Institutions Actual Loan Rates Outstanding Balance as at Quarter End - Adjustable Rate ",{"$f":"IF(ASCII2!B1211<ASCII2!B1210,\"Error\",\"Correct\")","v":"Correct"}]
["Private Financial Institutions Actual Loan Rates Interest Margin Applied - Adjustable Rate",{"$f":"IF(ASCII2!B1213<ASCII2!B1212,\"Error\",\"Correct\")","v":"Correct"}]
[]
["Incorporated Businesses Actual Loan Rates Approvals During Quarter - Adjustable Rate ",{"$f":"IF(ASCII2!B1215<ASCII2!B1214,\"Error\",\"Correct\")","v":"Correct"}]
["Incorporated Businesses Actual Loan Rates Interest Margin Applied - Adjustable Rate",{"$f":"IF(ASCII2!B1217<ASCII2!B1216,\"Error\",\"Correct\")","v":"Correct"}]
["Incorporated Businesses Actual Loan Rates Disbursements During Quarter - Adjustable Rate ",{"$f":"IF(ASCII2!B1219<ASCII2!B1218,\"Error\",\"Correct\")","v":"Correct"}]
["Incorporated Businesses Actual Loan Rates Interest Margin Applied - Adjustable Rate",{"$f":"IF(ASCII2!B1221<ASCII2!B1220,\"Error\",\"Correct\")","v":"Correct"}]
["Incorporated Businesses Actual Loan Rates Outstanding Balance as at Quarter End - Adjustable Rate ",{"$f":"IF(ASCII2!B1223<ASCII2!B1222,\"Error\",\"Correct\")","v":"Correct"}]
["Incorporated Businesses Actual Loan Rates Interest Margin Applied - Adjustable Rate",{"$f":"IF(ASCII2!B1225<ASCII2!B1224,\"Error\",\"Correct\")","v":"Correct"}]
[]
["Unincorporated Businesses Actual Loan Rates Approvals During Quarter - Adjustable Rate ",{"$f":"IF(ASCII2!B1227<ASCII2!B1226,\"Error\",\"Correct\")","v":"Correct"}]
["Unincorporated Businesses Actual Loan Rates Interest Margin Applied - Adjustable Rate",{"$f":"IF(ASCII2!B1229<ASCII2!B1228,\"Error\",\"Correct\")","v":"Correct"}]
["Unincorporated Businesses Actual Loan Rates Disbursements During Quarter - Adjustable Rate ",{"$f":"IF(ASCII2!B1231<ASCII2!B1230,\"Error\",\"Correct\")","v":"Correct"}]
["Unincorporated Businesses Actual Loan Rates Interest Margin Applied - Adjustable Rate",{"$f":"IF(ASCII2!B1233<ASCII2!B1232,\"Error\",\"Correct\")","v":"Correct"}]
["Unincorporated Businesses Actual Loan Rates Outstanding Balance as at Quarter End - Adjustable Rate ",{"$f":"IF(ASCII2!B1235<ASCII2!B1234,\"Error\",\"Correct\")","v":"Correct"}]
["Unincorporated Businesses Actual Loan Rates Interest Margin Applied - Adjustable Rate",{"$f":"IF(ASCII2!B1237<ASCII2!B1236,\"Error\",\"Correct\")","v":"Correct"}]
[]
["Consumers Actual Loan Rates Approvals During Quarter - Adjustable Rate ",{"$f":"IF(ASCII2!B1239<ASCII2!B1238,\"Error\",\"Correct\")","v":"Correct"}]
["Consumers Actual Loan Rates Interest Margin Applied - Adjustable Rate",{"$f":"IF(ASCII2!B1241<ASCII2!B1240,\"Error\",\"Correct\")","v":"Correct"}]
["Consumers Actual Loan Rates Disbursements During Quarter - Adjustable Rate ",{"$f":"IF(ASCII2!B1243<ASCII2!B1242,\"Error\",\"Correct\")","v":"Correct"}]
["Consumers Actual Loan Rates Interest Margin Applied - Adjustable Rate",{"$f":"IF(ASCII2!B1245<ASCII2!B1244,\"Error\",\"Correct\")","v":"Correct"}]
["Consumers Actual Loan Rates Outstanding Balance as at Quarter End - Adjustable Rate ",{"$f":"IF(ASCII2!B1247<ASCII2!B1246,\"Error\",\"Correct\")","v":"Correct"}]
["Consumers Actual Loan Rates Interest Margin Applied - Adjustable Rate",{"$f":"IF(ASCII2!B1249<ASCII2!B1248,\"Error\",\"Correct\")","v":"Correct"}]
[]
[]
["Page 9"]
[]
["Trustee Funds: Total Real Estate Mortgage Loans = Residential + Non-Residential",{"$f":"ROUND(ASCII2!B1253-ASCII2!B1251-ASCII2!B1252,5)","v":0}]

{"sheet":"ASCII","index":3,"n_rows":1230,"n_cols":4,"rows_kept":1230,"cut":false,"hidden":true,"merged":[]}
["hdr","cb30A",{"$f":"VLOOKUP('COVER PAGE'!C7,Controls!$B$4:$C$28,2,FALSE)","v":{"$error":"#N/A"}},"3an"]
[{"$f":"VLOOKUP('COVER PAGE'!F9,Controls!$H$4:$I$147,2,FALSE)","v":9}]
[{"$f":"PAGE1!$C$16","v":24}]
["sect1","NUM","VAL"]
[{"$f":"$C$1&\".E30A.REM.PBSEC.APPR.LT450..\"","v":{"$error":"#N/A"}},{"$f":"ROUND(PAGE1!$G$26,5)","v":0},{"$f":"ROUND(PAGE1!$I$26,5)","v":0}]
[{"$f":"$C$1&\".E30A.REM.PBSEC.DISB.LT450..\"","v":{"$error":"#N/A"}},{"$f":"ROUND(PAGE1!$K$26,5)","v":0},{"$f":"ROUND(PAGE1!$M$26,5)","v":0}]
[{"$f":"$C$1&\".E30A.REM.PBSEC.OS.LT450..\"","v":{"$error":"#N/A"}},{"$f":"ROUND(PAGE1!$O$26,5)","v":0},{"$f":"ROUND(PAGE1!$Q$26,5)","v":0}]
[{"$f":"$C$1&\".E30A.REM.PBSEC.APPR.450TO750..\"","v":{"$error":"#N/A"}},{"$f":"ROUND(PAGE1!$G$27,5)","v":0},{"$f":"ROUND(PAGE1!$I$27,5)","v":0}]
[{"$f":"$C$1&\".E30A.REM.PBSEC.DISB.450TO750..\"","v":{"$error":"#N/A"}},{"$f":"ROUND(PAGE1!$K$27,5)","v":0},{"$f":"ROUND(PAGE1!$M$27,5)","v":0}]
[{"$f":"$C$1&\".E30A.REM.PBSEC.OS.450TO750..\"","v":{"$error":"#N/A"}},{"$f":"ROUND(PAGE1!$O$27,5)","v":0},{"$f":"ROUND(PAGE1!$Q$27,5)","v":0}]
[{"$f":"$C$1&\".E30A.REM.PBSEC.APPR.750TO1000..\"","v":{"$error":"#N/A"}},{"$f":"ROUND(PAGE1!$G$28,5)","v":0},{"$f":"ROUND(PAGE1!$I$28,5)","v":0}]
[{"$f":"$C$1&\".E30A.REM.PBSEC.DISB.750TO1000..\"","v":{"$error":"#N/A"}},{"$f":"ROUND(PAGE1!$K$28,5)","v":0},{"$f":"ROUND(PAGE1!$M$28,5)","v":0}]
[{"$f":"$C$1&\".E30A.REM.PBSEC.OS.750TO1000..\"","v":{"$error":"#N/A"}},{"$f":"ROUND(PAGE1!$O$28,5)","v":0},{"$f":"ROUND(PAGE1!$Q$28,5)","v":0}]
[{"$f":"$C$1&\".E30A.REM.PBSEC.APPR.1000TO1250..\"","v":{"$error":"#N/A"}},{"$f":"ROUND(PAGE1!$G$29,5)","v":0},{"$f":"ROUND(PAGE1!$I$29,5)","v":0}]
[{"$f":"$C$1&\".E30A.REM.PBSEC.DISB.1000TO1250..\"","v":{"$error":"#N/A"}},{"$f":"ROUND(PAGE1!$K$29,5)","v":0},{"$f":"ROUND(PAGE1!$M$29,5)","v":0}]
[{"$f":"$C$1&\".E30A.REM.PBSEC.OS.1000TO1250..\"","v":{"$error":"#N/A"}},{"$f":"ROUND(PAGE1!$O$29,5)","v":0},{"$f":"ROUND(PAGE1!$Q$29,5)","v":0}]
[{"$f":"$C$1&\".E30A.REM.PBSEC.APPR.1250TO1500..\"","v":{"$error":"#N/A"}},{"$f":"ROUND(PAGE1!$G$30,5)","v":0},{"$f":"ROUND(PAGE1!$I$30,5)","v":0}]
[{"$f":"$C$1&\".E30A.REM.PBSEC.DISB.1250TO1500..\"","v":{"$error":"#N/A"}},{"$f":"ROUND(PAGE1!$K$30,5)","v":0},{"$f":"ROUND(PAGE1!$M$30,5)","v":0}]
[{"$f":"$C$1&\".E30A.REM.PBSEC.OS.1250TO1500..\"","v":{"$error":"#N/A"}},{"$f":"ROUND(PAGE1!$O$30,5)","v":0},{"$f":"ROUND(PAGE1!$Q$30,5)","v":0}]
[{"$f":"$C$1&\".E30A.REM.PBSEC.APPR.1500TO1750..\"","v":{"$error":"#N/A"}},{"$f":"ROUND(PAGE1!$G$31,5)","v":0},{"$f":"ROUND(PAGE1!$I$31,5)","v":0}]
[{"$f":"$C$1&\".E30A.REM.PBSEC.DISB.1500TO1750..\"","v":{"$error":"#N/A"}},{"$f":"ROUND(PAGE1!$K$31,5)","v":0},{"$f":"ROUND(PAGE1!$M$31,5)","v":0}]
[{"$f":"$C$1&\".E30A.REM.PBSEC.OS.1500TO1750..\"","v":{"$error":"#N/A"}},{"$f":"ROUND(PAGE1!$O$31,5)","v":0},{"$f":"ROUND(PAGE1!$Q$31,5)","v":0}]
[{"$f":"$C$1&\".E30A.REM.PBSEC.APPR.1750TO2000..\"","v":{"$error":"#N/A"}},{"$f":"ROUND(PAGE1!$G$32,5)","v":0},{"$f":"ROUND(PAGE1!$I$32,5)","v":0}]
[{"$f":"$C$1&\".E30A.REM.PBSEC.DISB.1750TO2000..\"","v":{"$error":"#N/A"}},{"$f":"ROUND(PAGE1!$K$32,5)","v":0},{"$f":"ROUND(PAGE1!$M$32,5)","v":0}]
[{"$f":"$C$1&\".E30A.REM.PBSEC.OS.1750TO2000..\"","v":{"$error":"#N/A"}},{"$f":"ROUND(PAGE1!$O$32,5)","v":0},{"$f":"ROUND(PAGE1!$Q$32,5)","v":0}]
[{"$f":"$C$1&\".E30A.REM.PBSEC.APPR.2000TO2250..\"","v":{"$error":"#N/A"}},{"$f":"ROUND(PAGE1!$G$33,5)","v":0},{"$f":"ROUND(PAGE1!$I$33,5)","v":0}]
[{"$f":"$C$1&\".E30A.REM.PBSEC.DISB.2000TO2250..\"","v":{"$error":"#N/A"}},{"$f":"ROUND(PAGE1!$K$33,5)","v":0},{"$f":"ROUND(PAGE1!$M$33,5)","v":0}]
[{"$f":"$C$1&\".E30A.REM.PBSEC.OS.2000TO2250..\"","v":{"$error":"#N/A"}},{"$f":"ROUND(PAGE1!$O$33,5)","v":0},{"$f":"ROUND(PAGE1!$Q$33,5)","v":0}]
[{"$f":"$C$1&\".E30A.REM.PBSEC.APPR.2250TO2500..\"","v":{"$error":"#N/A"}},{"$f":"ROUND(PAGE1!$G$34,5)","v":0},{"$f":"ROUND(PAGE1!$I$34,5)","v":0}]
[{"$f":"$C$1&\".E30A.REM.PBSEC.DISB.2250TO2500..\"","v":{"$error":"#N/A"}},{"$f":"ROUND(PAGE1!$K$34,5)","v":0},{"$f":"ROUND(PAGE1!$M$34,5)","v":0}]
[{"$f":"$C$1&\".E30A.REM.PBSEC.OS.2250TO2500..\"","v":{"$error":"#N/A"}},{"$f":"ROUND(PAGE1!$O$34,5)","v":0},{"$f":"ROUND(PAGE1!$Q$34,5)","v":0}]
[{"$f":"$C$1&\".E30A.REM.PBSEC.APPR.2500TO2750..\"","v":{"$error":"#N/A"}},{"$f":"ROUND(PAGE1!$G$35,5)","v":0},{"$f":"ROUND(PAGE1!$I$35,5)","v":0}]
[{"$f":"$C$1&\".E30A.REM.PBSEC.DISB.2500TO2750..\"","v":{"$error":"#N/A"}},{"$f":"ROUND(PAGE1!$K$35,5)","v":0},{"$f":"ROUND(PAGE1!$M$35,5)","v":0}]
[{"$f":"$C$1&\".E30A.REM.PBSEC.OS.2500TO2750..\"","v":{"$error":"#N/A"}},{"$f":"ROUND(PAGE1!$O$35,5)","v":0},{"$f":"ROUND(PAGE1!$Q$35,5)","v":0}]
[{"$f":"$C$1&\".E30A.REM.PBSEC.APPR.2750TO3000..\"","v":{"$error":"#N/A"}},{"$f":"ROUND(PAGE1!$G$36,5)","v":0},{"$f":"ROUND(PAGE1!$I$36,5)","v":0}]
[{"$f":"$C$1&\".E30A.REM.PBSEC.DISB.2750TO3000..\"","v":{"$error":"#N/A"}},{"$f":"ROUND(PAGE1!$K$36,5)","v":0},{"$f":"ROUND(PAGE1!$M$36,5)","v":0}]
[{"$f":"$C$1&\".E30A.REM.PBSEC.OS.2750TO3000..\"","v":{"$error":"#N/A"}},{"$f":"ROUND(PAGE1!$O$36,5)","v":0},{"$f":"ROUND(PAGE1!$Q$36,5)","v":0}]
[{"$f":"$C$1&\".E30A.REM.PBSEC.APPR.OVR3000..\"","v":{"$error":"#N/A"}},{"$f":"ROUND(PAGE1!$G$37,5)","v":0},{"$f":"ROUND(PAGE1!$I$37,5)","v":0}]
[{"$f":"$C$1&\".E30A.REM.PBSEC.DISB.OVR3000..\"","v":{"$error":"#N/A"}},{"$f":"ROUND(PAGE1!$K$37,5)","v":0},{"$f":"ROUND(PAGE1!$M$37,5)","v":0}]
[{"$f":"$C$1&\".E30A.REM.PBSEC.OS.OVR3000..\"","v":{"$error":"#N/A"}},{"$f":"ROUND(PAGE1!$O$37,5)","v":0},{"$f":"ROUND(PAGE1!$Q$37,5)","v":0}]
[{"$f":"$C$1&\".E30A.REM.PBSEC.APPR.TTL..\"","v":{"$error":"#N/A"}},{"$f":"ROUND(PAGE1!$G$25,5)","v":0},{"$f":"ROUND(PAGE1!$I$25,5)","v":0}]
[{"$f":"$C$1&\".E30A.REM.PBSEC.DISB.TTL..\"","v":{"$error":"#N/A"}},{"$f":"ROUND(PAGE1!$K$25,5)","v":0},{"$f":"ROUND(PAGE1!$M$25,5)","v":0}]
[{"$f":"$C$1&\".E30A.REM.PBSEC.OS.TTL..\"","v":{"$error":"#N/A"}},{"$f":"ROUND(PAGE1!$O$25,5)","v":0},{"$f":"ROUND(PAGE1!$Q$25,5)","v":0}]
[{"$f":"$C$1&\".E30A.REM.PVFIN.APPR.LT450..\"","v":{"$error":"#N/A"}},{"$f":"ROUND(PAGE1!$G$41,5)","v":0},{"$f":"ROUND(PAGE1!$I$41,5)","v":0}]
[{"$f":"$C$1&\".E30A.REM.PVFIN.DISB.LT450..\"","v":{"$error":"#N/A"}},{"$f":"ROUND(PAGE1!$K$41,5)","v":0},{"$f":"ROUND(PAGE1!$M$41,5)","v":0}]
[{"$f":"$C$1&\".E30A.REM.PVFIN.OS.LT450..\"","v":{"$error":"#N/A"}},{"$f":"ROUND(PAGE1!$O$41,5)","v":0},{"$f":"ROUND(PAGE1!$Q$41,5)","v":0}]
[{"$f":"$C$1&\".E30A.REM.PVFIN.APPR.450TO750..\"","v":{"$error":"#N/A"}},{"$f":"ROUND(PAGE1!$G$42,5)","v":0},{"$f":"ROUND(PAGE1!$I$42,5)","v":0}]
[{"$f":"$C$1&\".E30A.REM.PVFIN.DISB.450TO750..\"","v":{"$error":"#N/A"}},{"$f":"ROUND(PAGE1!$K$42,5)","v":0},{"$f":"ROUND(PAGE1!$M$42,5)","v":0}]
[{"$f":"$C$1&\".E30A.REM.PVFIN.OS.450TO750..\"","v":{"$error":"#N/A"}},{"$f":"ROUND(PAGE1!$O$42,5)","v":0},{"$f":"ROUND(PAGE1!$Q$42,5)","v":0}]
[{"$f":"$C$1&\".E30A.REM.PVFIN.APPR.750TO1000..\"","v":{"$error":"#N/A"}},{"$f":"ROUND(PAGE1!$G$43,5)","v":0},{"$f":"ROUND(PAGE1!$I$43,5)","v":0}]
[{"$f":"$C$1&\".E30A.REM.PVFIN.DISB.750TO1000..\"","v":{"$error":"#N/A"}},{"$f":"ROUND(PAGE1!$K$43,5)","v":0},{"$f":"ROUND(PAGE1!$M$43,5)","v":0}]
[{"$f":"$C$1&\".E30A.REM.PVFIN.OS.750TO1000..\"","v":{"$error":"#N/A"}},{"$f":"ROUND(PAGE1!$O$43,5)","v":0},{"$f":"ROUND(PAGE1!$Q$43,5)","v":0}]
[{"$f":"$C$1&\".E30A.REM.PVFIN.APPR.1000TO1250..\"","v":{"$error":"#N/A"}},{"$f":"ROUND(PAGE1!$G$44,5)","v":0},{"$f":"ROUND(PAGE1!$I$44,5)","v":0}]
[{"$f":"$C$1&\".E30A.REM.PVFIN.DISB.1000TO1250..\"","v":{"$error":"#N/A"}},{"$f":"ROUND(PAGE1!$K$44,5)","v":0},{"$f":"ROUND(PAGE1!$M$44,5)","v":0}]
[{"$f":"$C$1&\".E30A.REM.PVFIN.OS.1000TO1250..\"","v":{"$error":"#N/A"}},{"$f":"ROUND(PAGE1!$O$44,5)","v":0},{"$f":"ROUND(PAGE1!$Q$44,5)","v":0}]
[{"$f":"$C$1&\".E30A.REM.PVFIN.APPR.1250TO1500..\"","v":{"$error":"#N/A"}},{"$f":"ROUND(PAGE1!$G$45,5)","v":0},{"$f":"ROUND(PAGE1!$I$45,5)","v":0}]
[{"$f":"$C$1&\".E30A.REM.PVFIN.DISB.1250TO1500..\"","v":{"$error":"#N/A"}},{"$f":"ROUND(PAGE1!$K$45,5)","v":0},{"$f":"ROUND(PAGE1!$M$45,5)","v":0}]
[{"$f":"$C$1&\".E30A.REM.PVFIN.OS.1250TO1500..\"","v":{"$error":"#N/A"}},{"$f":"ROUND(PAGE1!$O$45,5)","v":0},{"$f":"ROUND(PAGE1!$Q$45,5)","v":0}]
[{"$f":"$C$1&\".E30A.REM.PVFIN.APPR.1500TO1750..\"","v":{"$error":"#N/A"}},{"$f":"ROUND(PAGE1!$G$46,5)","v":0},{"$f":"ROUND(PAGE1!$I$46,5)","v":0}]
[{"$f":"$C$1&\".E30A.REM.PVFIN.DISB.1500TO1750..\"","v":{"$error":"#N/A"}},{"$f":"ROUND(PAGE1!$K$46,5)","v":0},{"$f":"ROUND(PAGE1!$M$46,5)","v":0}]
[{"$f":"$C$1&\".E30A.REM.PVFIN.OS.1500TO1750..\"","v":{"$error":"#N/A"}},{"$f":"ROUND(PAGE1!$O$46,5)","v":0},{"$f":"ROUND(PAGE1!$Q$46,5)","v":0}]
[{"$f":"$C$1&\".E30A.REM.PVFIN.APPR.1750TO2000..\"","v":{"$error":"#N/A"}},{"$f":"ROUND(PAGE1!$G$47,5)","v":0},{"$f":"ROUND(PAGE1!$I$47,5)","v":0}]
[{"$f":"$C$1&\".E30A.REM.PVFIN.DISB.1750TO2000..\"","v":{"$error":"#N/A"}},{"$f":"ROUND(PAGE1!$K$47,5)","v":0},{"$f":"ROUND(PAGE1!$M$47,5)","v":0}]
[{"$f":"$C$1&\".E30A.REM.PVFIN.OS.1750TO2000..\"","v":{"$error":"#N/A"}},{"$f":"ROUND(PAGE1!$O$47,5)","v":0},{"$f":"ROUND(PAGE1!$Q$47,5)","v":0}]
[{"$f":"$C$1&\".E30A.REM.PVFIN.APPR.2000TO2250..\"","v":{"$error":"#N/A"}},{"$f":"ROUND(PAGE1!$G$48,5)","v":0},{"$f":"ROUND(PAGE1!$I$48,5)","v":0}]
[{"$f":"$C$1&\".E30A.REM.PVFIN.DISB.2000TO2250..\"","v":{"$error":"#N/A"}},{"$f":"ROUND(PAGE1!$K$48,5)","v":0},{"$f":"ROUND(PAGE1!$M$48,5)","v":0}]
[{"$f":"$C$1&\".E30A.REM.PVFIN.OS.2000TO2250..\"","v":{"$error":"#N/A"}},{"$f":"ROUND(PAGE1!$O$48,5)","v":0},{"$f":"ROUND(PAGE1!$Q$48,5)","v":0}]
[{"$f":"$C$1&\".E30A.REM.PVFIN.APPR.2250TO2500..\"","v":{"$error":"#N/A"}},{"$f":"ROUND(PAGE1!$G$49,5)","v":0},{"$f":"ROUND(PAGE1!$I$49,5)","v":0}]
[{"$f":"$C$1&\".E30A.REM.PVFIN.DISB.2250TO2500..\"","v":{"$error":"#N/A"}},{"$f":"ROUND(PAGE1!$K$49,5)","v":0},{"$f":"ROUND(PAGE1!$M$49,5)","v":0}]
[{"$f":"$C$1&\".E30A.REM.PVFIN.OS.2250TO2500..\"","v":{"$error":"#N/A"}},{"$f":"ROUND(PAGE1!$O$49,5)","v":0},{"$f":"ROUND(PAGE1!$Q$49,5)","v":0}]
[{"$f":"$C$1&\".E30A.REM.PVFIN.APPR.2500TO2750..\"","v":{"$error":"#N/A"}},{"$f":"ROUND(PAGE1!$G$50,5)","v":0},{"$f":"ROUND(PAGE1!$I$50,5)","v":0}]
[{"$f":"$C$1&\".E30A.REM.PVFIN.DISB.2500TO2750..\"","v":{"$error":"#N/A"}},{"$f":"ROUND(PAGE1!$K$50,5)","v":0},{"$f":"ROUND(PAGE1!$M$50,5)","v":0}]
[{"$f":"$C$1&\".E30A.REM.PVFIN.OS.2500TO2750..\"","v":{"$error":"#N/A"}},{"$f":"ROUND(PAGE1!$O$50,5)","v":0},{"$f":"ROUND(PAGE1!$Q$50,5)","v":0}]
[{"$f":"$C$1&\".E30A.REM.PVFIN.APPR.2750TO3000..\"","v":{"$error":"#N/A"}},{"$f":"ROUND(PAGE1!$G$51,5)","v":0},{"$f":"ROUND(PAGE1!$I$51,5)","v":0}]
[{"$f":"$C$1&\".E30A.REM.PVFIN.DISB.2750TO3000..\"","v":{"$error":"#N/A"}},{"$f":"ROUND(PAGE1!$K$51,5)","v":0},{"$f":"ROUND(PAGE1!$M$51,5)","v":0}]
[{"$f":"$C$1&\".E30A.REM.PVFIN.OS.2750TO3000..\"","v":{"$error":"#N/A"}},{"$f":"ROUND(PAGE1!$O$51,5)","v":0},{"$f":"ROUND(PAGE1!$Q$51,5)","v":0}]
[{"$f":"$C$1&\".E30A.REM.PVFIN.APPR.OVR3000..\"","v":{"$error":"#N/A"}},{"$f":"ROUND(PAGE1!$G$52,5)","v":0},{"$f":"ROUND(PAGE1!$I$52,5)","v":0}]
[{"$f":"$C$1&\".E30A.REM.PVFIN.DISB.OVR3000..\"","v":{"$error":"#N/A"}},{"$f":"ROUND(PAGE1!$K$52,5)","v":0},{"$f":"ROUND(PAGE1!$M$52,5)","v":0}]
[{"$f":"$C$1&\".E30A.REM.PVFIN.OS.OVR3000..\"","v":{"$error":"#N/A"}},{"$f":"ROUND(PAGE1!$O$52,5)","v":0},{"$f":"ROUND(PAGE1!$Q$52,5)","v":0}]
[{"$f":"$C$1&\".E30A.REM.PVFIN.APPR.TTL..\"","v":{"$error":"#N/A"}},{"$f":"ROUND(PAGE1!$G$40,5)","v":0},{"$f":"ROUND(PAGE1!$I$40,5)","v":0}]
[{"$f":"$C$1&\".E30A.REM.PVFIN.DISB.TTL..\"","v":{"$error":"#N/A"}},{"$f":"ROUND(PAGE1!$K$40,5)","v":0},{"$f":"ROUND(PAGE1!$M$40,5)","v":0}]
[{"$f":"$C$1&\".E30A.REM.PVFIN.OS.TTL..\"","v":{"$error":"#N/A"}},{"$f":"ROUND(PAGE1!$O$40,5)","v":0},{"$f":"ROUND(PAGE1!$Q$40,5)","v":0}]
[{"$f":"$C$1&\".E30A.REM.IBUS.APPR.LT450..\"","v":{"$error":"#N/A"}},{"$f":"ROUND(PAGE1!$G$56,5)","v":0},{"$f":"ROUND(PAGE1!$I$56,5)","v":0}]
[{"$f":"$C$1&\".E30A.REM.IBUS.DISB.LT450..\"","v":{"$error":"#N/A"}},{"$f":"ROUND(PAGE1!$K$56,5)","v":0},{"$f":"ROUND(PAGE1!$M$56,5)","v":0}]
[{"$f":"$C$1&\".E30A.REM.IBUS.OS.LT450..\"","v":{"$error":"#N/A"}},{"$f":"ROUND(PAGE1!$O$56,5)","v":0},{"$f":"ROUND(PAGE1!$Q$56,5)","v":0}]
[{"$f":"$C$1&\".E30A.REM.IBUS.APPR.450TO750..\"","v":{"$error":"#N/A"}},{"$f":"ROUND(PAGE1!$G$57,5)","v":0},{"$f":"ROUND(PAGE1!$I$57,5)","v":0}]
[{"$f":"$C$1&\".E30A.REM.IBUS.DISB.450TO750..\"","v":{"$error":"#N/A"}},{"$f":"ROUND(PAGE1!$K$57,5)","v":0},{"$f":"ROUND(PAGE1!$M$57,5)","v":0}]
[{"$f":"$C$1&\".E30A.REM.IBUS.OS.450TO750..\"","v":{"$error":"#N/A"}},{"$f":"ROUND(PAGE1!$O$57,5)","v":0},{"$f":"ROUND(PAGE1!$Q$57,5)","v":0}]
[{"$f":"$C$1&\".E30A.REM.IBUS.APPR.750TO1000..\"","v":{"$error":"#N/A"}},{"$f":"ROUND(PAGE1!$G$58,5)","v":0},{"$f":"ROUND(PAGE1!$I$58,5)","v":0}]
[{"$f":"$C$1&\".E30A.REM.IBUS.DISB.750TO1000..\"","v":{"$error":"#N/A"}},{"$f":"ROUND(PAGE1!$K$58,5)","v":0},{"$f":"ROUND(PAGE1!$M$58,5)","v":0}]
[{"$f":"$C$1&\".E30A.REM.IBUS.OS.750TO1000..\"","v":{"$error":"#N/A"}},{"$f":"ROUND(PAGE1!$O$58,5)","v":0},{"$f":"ROUND(PAGE1!$Q$58,5)","v":0}]
[{"$f":"$C$1&\".E30A.REM.IBUS.APPR.1000TO1250..\"","v":{"$error":"#N/A"}},{"$f":"ROUND(PAGE1!$G$59,5)","v":0},{"$f":"ROUND(PAGE1!$I$59,5)","v":0}]
[{"$f":"$C$1&\".E30A.REM.IBUS.DISB.1000TO1250..\"","v":{"$error":"#N/A"}},{"$f":"ROUND(PAGE1!$K$59,5)","v":0},{"$f":"ROUND(PAGE1!$M$59,5)","v":0}]
[{"$f":"$C$1&\".E30A.REM.IBUS.OS.1000TO1250..\"","v":{"$error":"#N/A"}},{"$f":"ROUND(PAGE1!$O$59,5)","v":0},{"$f":"ROUND(PAGE1!$Q$59,5)","v":0}]
[{"$f":"$C$1&\".E30A.REM.IBUS.APPR.1250TO1500..\"","v":{"$error":"#N/A"}},{"$f":"ROUND(PAGE1!$G$60,5)","v":0},{"$f":"ROUND(PAGE1!$I$60,5)","v":0}]
[{"$f":"$C$1&\".E30A.REM.IBUS.DISB.1250TO1500..\"","v":{"$error":"#N/A"}},{"$f":"ROUND(PAGE1!$K$60,5)","v":0},{"$f":"ROUND(PAGE1!$M$60,5)","v":0}]
[{"$f":"$C$1&\".E30A.REM.IBUS.OS.1250TO1500..\"","v":{"$error":"#N/A"}},{"$f":"ROUND(PAGE1!$O$60,5)","v":0},{"$f":"ROUND(PAGE1!$Q$60,5)","v":0}]
[{"$f":"$C$1&\".E30A.REM.IBUS.APPR.1500TO1750..\"","v":{"$error":"#N/A"}},{"$f":"ROUND(PAGE1!$G$61,5)","v":0},{"$f":"ROUND(PAGE1!$I$61,5)","v":0}]
[{"$f":"$C$1&\".E30A.REM.IBUS.DISB.1500TO1750..\"","v":{"$error":"#N/A"}},{"$f":"ROUND(PAGE1!$K$61,5)","v":0},{"$f":"ROUND(PAGE1!$M$61,5)","v":0}]
[{"$f":"$C$1&\".E30A.REM.IBUS.OS.1500TO1750..\"","v":{"$error":"#N/A"}},{"$f":"ROUND(PAGE1!$O$61,5)","v":0},{"$f":"ROUND(PAGE1!$Q$61,5)","v":0}]
[{"$f":"$C$1&\".E30A.REM.IBUS.APPR.1750TO2000..\"","v":{"$error":"#N/A"}},{"$f":"ROUND(PAGE1!$G$62,5)","v":0},{"$f":"ROUND(PAGE1!$I$62,5)","v":0}]
[{"$f":"$C$1&\".E30A.REM.IBUS.DISB.1750TO2000..\"","v":{"$error":"#N/A"}},{"$f":"ROUND(PAGE1!$K$62,5)","v":0},{"$f":"ROUND(PAGE1!$M$62,5)","v":0}]
[{"$f":"$C$1&\".E30A.REM.IBUS.OS.1750TO2000..\"","v":{"$error":"#N/A"}},{"$f":"ROUND(PAGE1!$O$62,5)","v":0},{"$f":"ROUND(PAGE1!$Q$62,5)","v":0}]
[{"$f":"$C$1&\".E30A.REM.IBUS.APPR.2000TO2250..\"","v":{"$error":"#N/A"}},{"$f":"ROUND(PAGE1!$G$63,5)","v":0},{"$f":"ROUND(PAGE1!$I$63,5)","v":0}]
[{"$f":"$C$1&\".E30A.REM.IBUS.DISB.2000TO2250..\"","v":{"$error":"#N/A"}},{"$f":"ROUND(PAGE1!$K$63,5)","v":0},{"$f":"ROUND(PAGE1!$M$63,5)","v":0}]
[{"$f":"$C$1&\".E30A.REM.IBUS.OS.2000TO2250..\"","v":{"$error":"#N/A"}},{"$f":"ROUND(PAGE1!$O$63,5)","v":0},{"$f":"ROUND(PAGE1!$Q$63,5)","v":0}]
[{"$f":"$C$1&\".E30A.REM.IBUS.APPR.2250TO2500..\"","v":{"$error":"#N/A"}},{"$f":"ROUND(PAGE1!$G$64,5)","v":0},{"$f":"ROUND(PAGE1!$I$64,5)","v":0}]
[{"$f":"$C$1&\".E30A.REM.IBUS.DISB.2250TO2500..\"","v":{"$error":"#N/A"}},{"$f":"ROUND(PAGE1!$K$64,5)","v":0},{"$f":"ROUND(PAGE1!$M$64,5)","v":0}]
[{"$f":"$C$1&\".E30A.REM.IBUS.OS.2250TO2500..\"","v":{"$error":"#N/A"}},{"$f":"ROUND(PAGE1!$O$64,5)","v":0},{"$f":"ROUND(PAGE1!$Q$64,5)","v":0}]
[{"$f":"$C$1&\".E30A.REM.IBUS.APPR.2500TO2750..\"","v":{"$error":"#N/A"}},{"$f":"ROUND(PAGE1!$G$65,5)","v":0},{"$f":"ROUND(PAGE1!$I$65,5)","v":0}]
[{"$f":"$C$1&\".E30A.REM.IBUS.DISB.2500TO2750..\"","v":{"$error":"#N/A"}},{"$f":"ROUND(PAGE1!$K$65,5)","v":0},{"$f":"ROUND(PAGE1!$M$65,5)","v":0}]
[{"$f":"$C$1&\".E30A.REM.IBUS.OS.2500TO2750..\"","v":{"$error":"#N/A"}},{"$f":"ROUND(PAGE1!$O$65,5)","v":0},{"$f":"ROUND(PAGE1!$Q$65,5)","v":0}]
[{"$f":"$C$1&\".E30A.REM.IBUS.APPR.2750TO3000..\"","v":{"$error":"#N/A"}},{"$f":"ROUND(PAGE1!$G$66,5)","v":0},{"$f":"ROUND(PAGE1!$I$66,5)","v":0}]
[{"$f":"$C$1&\".E30A.REM.IBUS.DISB.2750TO3000..\"","v":{"$error":"#N/A"}},{"$f":"ROUND(PAGE1!$K$66,5)","v":0},{"$f":"ROUND(PAGE1!$M$66,5)","v":0}]
[{"$f":"$C$1&\".E30A.REM.IBUS.OS.2750TO3000..\"","v":{"$error":"#N/A"}},{"$f":"ROUND(PAGE1!$O$66,5)","v":0},{"$f":"ROUND(PAGE1!$Q$66,5)","v":0}]
[{"$f":"$C$1&\".E30A.REM.IBUS.APPR.OVR3000..\"","v":{"$error":"#N/A"}},{"$f":"ROUND(PAGE1!$G$67,5)","v":0},{"$f":"ROUND(PAGE1!$I$67,5)","v":0}]
[{"$f":"$C$1&\".E30A.REM.IBUS.DISB.OVR3000..\"","v":{"$error":"#N/A"}},{"$f":"ROUND(PAGE1!$K$67,5)","v":0},{"$f":"ROUND(PAGE1!$M$67,5)","v":0}]
[{"$f":"$C$1&\".E30A.REM.IBUS.OS.OVR3000..\"","v":{"$error":"#N/A"}},{"$f":"ROUND(PAGE1!$O$67,5)","v":0},{"$f":"ROUND(PAGE1!$Q$67,5)","v":0}]
[{"$f":"$C$1&\".E30A.REM.IBUS.APPR.TTL..\"","v":{"$error":"#N/A"}},{"$f":"ROUND(PAGE1!$G$55,5)","v":0},{"$f":"ROUND(PAGE1!$I$55,5)","v":0}]
[{"$f":"$C$1&\".E30A.REM.IBUS.DISB.TTL..\"","v":{"$error":"#N/A"}},{"$f":"ROUND(PAGE1!$K$55,5)","v":0},{"$f":"ROUND(PAGE1!$M$55,5)","v":0}]
[{"$f":"$C$1&\".E30A.REM.IBUS.OS.TTL..\"","v":{"$error":"#N/A"}},{"$f":"ROUND(PAGE1!$O$55,5)","v":0},{"$f":"ROUND(PAGE1!$Q$55,5)","v":0}]
[{"$f":"$C$1&\".E30A.REM.UIBUS.APPR.LT450..\"","v":{"$error":"#N/A"}},{"$f":"ROUND(PAGE1!$G$71,5)","v":0},{"$f":"ROUND(PAGE1!$I$71,5)","v":0}]
[{"$f":"$C$1&\".E30A.REM.UIBUS.DISB.LT450..\"","v":{"$error":"#N/A"}},{"$f":"ROUND(PAGE1!$K$71,5)","v":0},{"$f":"ROUND(PAGE1!$M$71,5)","v":0}]
[{"$f":"$C$1&\".E30A.REM.UIBUS.OS.LT450..\"","v":{"$error":"#N/A"}},{"$f":"ROUND(PAGE1!$O$71,5)","v":0},{"$f":"ROUND(PAGE1!$Q$71,5)","v":0}]
[{"$f":"$C$1&\".E30A.REM.UIBUS.APPR.450TO750..\"","v":{"$error":"#N/A"}},{"$f":"ROUND(PAGE1!$G$72,5)","v":0},{"$f":"ROUND(PAGE1!$I$72,5)","v":0}]
[{"$f":"$C$1&\".E30A.REM.UIBUS.DISB.450TO750..\"","v":{"$error":"#N/A"}},{"$f":"ROUND(PAGE1!$K$72,5)","v":0},{"$f":"ROUND(PAGE1!$M$72,5)","v":0}]
[{"$f":"$C$1&\".E30A.REM.UIBUS.OS.450TO750..\"","v":{"$error":"#N/A"}},{"$f":"ROUND(PAGE1!$O$72,5)","v":0},{"$f":"ROUND(PAGE1!$Q$72,5)","v":0}]
[{"$f":"$C$1&\".E30A.REM.UIBUS.APPR.750TO1000..\"","v":{"$error":"#N/A"}},{"$f":"ROUND(PAGE1!$G$73,5)","v":0},{"$f":"ROUND(PAGE1!$I$73,5)","v":0}]
[{"$f":"$C$1&\".E30A.REM.UIBUS.DISB.750TO1000..\"","v":{"$error":"#N/A"}},{"$f":"ROUND(PAGE1!$K$73,5)","v":0},{"$f":"ROUND(PAGE1!$M$73,5)","v":0}]
[{"$f":"$C$1&\".E30A.REM.UIBUS.OS.750TO1000..\"","v":{"$error":"#N/A"}},{"$f":"ROUND(PAGE1!$O$73,5)","v":0},{"$f":"ROUND(PAGE1!$Q$73,5)","v":0}]
[{"$f":"$C$1&\".E30A.REM.UIBUS.APPR.1000TO1250..\"","v":{"$error":"#N/A"}},{"$f":"ROUND(PAGE1!$G$74,5)","v":0},{"$f":"ROUND(PAGE1!$I$74,5)","v":0}]
[{"$f":"$C$1&\".E30A.REM.UIBUS.DISB.1000TO1250..\"","v":{"$error":"#N/A"}},{"$f":"ROUND(PAGE1!$K$74,5)","v":0},{"$f":"ROUND(PAGE1!$M$74,5)","v":0}]
[{"$f":"$C$1&\".E30A.REM.UIBUS.OS.1000TO1250..\"","v":{"$error":"#N/A"}},{"$f":"ROUND(PAGE1!$O$74,5)","v":0},{"$f":"ROUND(PAGE1!$Q$74,5)","v":0}]
[{"$f":"$C$1&\".E30A.REM.UIBUS.APPR.1250TO1500..\"","v":{"$error":"#N/A"}},{"$f":"ROUND(PAGE1!$G$75,5)","v":0},{"$f":"ROUND(PAGE1!$I$75,5)","v":0}]
[{"$f":"$C$1&\".E30A.REM.UIBUS.DISB.1250TO1500..\"","v":{"$error":"#N/A"}},{"$f":"ROUND(PAGE1!$K$75,5)","v":0},{"$f":"ROUND(PAGE1!$M$75,5)","v":0}]
[{"$f":"$C$1&\".E30A.REM.UIBUS.OS.1250TO1500..\"","v":{"$error":"#N/A"}},{"$f":"ROUND(PAGE1!$O$75,5)","v":0},{"$f":"ROUND(PAGE1!$Q$75,5)","v":0}]
[{"$f":"$C$1&\".E30A.REM.UIBUS.APPR.1500TO1750..\"","v":{"$error":"#N/A"}},{"$f":"ROUND(PAGE1!$G$76,5)","v":0},{"$f":"ROUND(PAGE1!$I$76,5)","v":0}]
[{"$f":"$C$1&\".E30A.REM.UIBUS.DISB.1500TO1750..\"","v":{"$error":"#N/A"}},{"$f":"ROUND(PAGE1!$K$76,5)","v":0},{"$f":"ROUND(PAGE1!$M$76,5)","v":0}]
[{"$f":"$C$1&\".E30A.REM.UIBUS.OS.1500TO1750..\"","v":{"$error":"#N/A"}},{"$f":"ROUND(PAGE1!$O$76,5)","v":0},{"$f":"ROUND(PAGE1!$Q$76,5)","v":0}]
[{"$f":"$C$1&\".E30A.REM.UIBUS.APPR.1750TO2000..\"","v":{"$error":"#N/A"}},{"$f":"ROUND(PAGE1!$G$77,5)","v":0},{"$f":"ROUND(PAGE1!$I$77,5)","v":0}]
[{"$f":"$C$1&\".E30A.REM.UIBUS.DISB.1750TO2000..\"","v":{"$error":"#N/A"}},{"$f":"ROUND(PAGE1!$K$77,5)","v":0},{"$f":"ROUND(PAGE1!$M$77,5)","v":0}]
[{"$f":"$C$1&\".E30A.REM.UIBUS.OS.1750TO2000..\"","v":{"$error":"#N/A"}},{"$f":"ROUND(PAGE1!$O$77,5)","v":0},{"$f":"ROUND(PAGE1!$Q$77,5)","v":0}]
[{"$f":"$C$1&\".E30A.REM.UIBUS.APPR.2000TO2250..\"","v":{"$error":"#N/A"}},{"$f":"ROUND(PAGE1!$G$78,5)","v":0},{"$f":"ROUND(PAGE1!$I$78,5)","v":0}]
[{"$f":"$C$1&\".E30A.REM.UIBUS.DISB.2000TO2250..\"","v":{"$error":"#N/A"}},{"$f":"ROUND(PAGE1!$K$78,5)","v":0},{"$f":"ROUND(PAGE1!$M$78,5)","v":0}]
[{"$f":"$C$1&\".E30A.REM.UIBUS.OS.2000TO2250..\"","v":{"$error":"#N/A"}},{"$f":"ROUND(PAGE1!$O$78,5)","v":0},{"$f":"ROUND(PAGE1!$Q$78,5)","v":0}]
[{"$f":"$C$1&\".E30A.REM.UIBUS.APPR.2250TO2500..\"","v":{"$error":"#N/A"}},{"$f":"ROUND(PAGE1!$G$79,5)","v":0},{"$f":"ROUND(PAGE1!$I$79,5)","v":0}]
[{"$f":"$C$1&\".E30A.REM.UIBUS.DISB.2250TO2500..\"","v":{"$error":"#N/A"}},{"$f":"ROUND(PAGE1!$K$79,5)","v":0},{"$f":"ROUND(PAGE1!$M$79,5)","v":0}]
[{"$f":"$C$1&\".E30A.REM.UIBUS.OS.2250TO2500..\"","v":{"$error":"#N/A"}},{"$f":"ROUND(PAGE1!$O$79,5)","v":0},{"$f":"ROUND(PAGE1!$Q$79,5)","v":0}]
[{"$f":"$C$1&\".E30A.REM.UIBUS.APPR.2500TO2750..\"","v":{"$error":"#N/A"}},{"$f":"ROUND(PAGE1!$G$80,5)","v":0},{"$f":"ROUND(PAGE1!$I$80,5)","v":0}]
[{"$f":"$C$1&\".E30A.REM.UIBUS.DISB.2500TO2750..\"","v":{"$error":"#N/A"}},{"$f":"ROUND(PAGE1!$K$80,5)","v":0},{"$f":"ROUND(PAGE1!$M$80,5)","v":0}]
[{"$f":"$C$1&\".E30A.REM.UIBUS.OS.2500TO2750..\"","v":{"$error":"#N/A"}},{"$f":"ROUND(PAGE1!$O$80,5)","v":0},{"$f":"ROUND(PAGE1!$Q$80,5)","v":0}]
[{"$f":"$C$1&\".E30A.REM.UIBUS.APPR.2750TO3000..\"","v":{"$error":"#N/A"}},{"$f":"ROUND(PAGE1!$G$81,5)","v":0},{"$f":"ROUND(PAGE1!$I$81,5)","v":0}]
[{"$f":"$C$1&\".E30A.REM.UIBUS.DISB.2750TO3000..\"","v":{"$error":"#N/A"}},{"$f":"ROUND(PAGE1!$K$81,5)","v":0},{"$f":"ROUND(PAGE1!$M$81,5)","v":0}]
[{"$f":"$C$1&\".E30A.REM.UIBUS.OS.2750TO3000..\"","v":{"$error":"#N/A"}},{"$f":"ROUND(PAGE1!$O$81,5)","v":0},{"$f":"ROUND(PAGE1!$Q$81,5)","v":0}]
[{"$f":"$C$1&\".E30A.REM.UIBUS.APPR.OVR3000..\"","v":{"$error":"#N/A"}},{"$f":"ROUND(PAGE1!$G$82,5)","v":0},{"$f":"ROUND(PAGE1!$I$82,5)","v":0}]
[{"$f":"$C$1&\".E30A.REM.UIBUS.DISB.OVR3000..\"","v":{"$error":"#N/A"}},{"$f":"ROUND(PAGE1!$K$82,5)","v":0},{"$f":"ROUND(PAGE1!$M$82,5)","v":0}]
[{"$f":"$C$1&\".E30A.REM.UIBUS.OS.OVR3000..\"","v":{"$error":"#N/A"}},{"$f":"ROUND(PAGE1!$O$82,5)","v":0},{"$f":"ROUND(PAGE1!$Q$82,5)","v":0}]
[{"$f":"$C$1&\".E30A.REM.UIBUS.APPR.TTL..\"","v":{"$error":"#N/A"}},{"$f":"ROUND(PAGE1!$G$70,5)","v":0},{"$f":"ROUND(PAGE1!$I$70,5)","v":0}]
[{"$f":"$C$1&\".E30A.REM.UIBUS.DISB.TTL..\"","v":{"$error":"#N/A"}},{"$f":"ROUND(PAGE1!$K$70,5)","v":0},{"$f":"ROUND(PAGE1!$M$70,5)","v":0}]
[{"$f":"$C$1&\".E30A.REM.UIBUS.OS.TTL..\"","v":{"$error":"#N/A"}},{"$f":"ROUND(PAGE1!$O$70,5)","v":0},{"$f":"ROUND(PAGE1!$Q$70,5)","v":0}]
[{"$f":"$C$1&\".E30A.REM.CONSM.APPR.LT450..\"","v":{"$error":"#N/A"}},{"$f":"ROUND(PAGE1!$G$85,5)","v":0},{"$f":"ROUND(PAGE1!$I$85,5)","v":0}]
[{"$f":"$C$1&\".E30A.REM.CONSM.DISB.LT450..\"","v":{"$error":"#N/A"}},{"$f":"ROUND(PAGE1!$K$85,5)","v":0},{"$f":"ROUND(PAGE1!$M$85,5)","v":0}]
[{"$f":"$C$1&\".E30A.REM.CONSM.OS.LT450..\"","v":{"$error":"#N/A"}},{"$f":"ROUND(PAGE1!$O$85,5)","v":0},{"$f":"ROUND(PAGE1!$Q$85,5)","v":0}]
[{"$f":"$C$1&\".E30A.REM.CONSM.APPR.450TO750..\"","v":{"$error":"#N/A"}},{"$f":"ROUND(PAGE1!$G$86,5)","v":0},{"$f":"ROUND(PAGE1!$I$86,5)","v":0}]
[{"$f":"$C$1&\".E30A.REM.CONSM.DISB.450TO750..\"","v":{"$error":"#N/A"}},{"$f":"ROUND(PAGE1!$K$86,5)","v":0},{"$f":"ROUND(PAGE1!$M$86,5)","v":0}]
[{"$f":"$C$1&\".E30A.REM.CONSM.OS.450TO750..\"","v":{"$error":"#N/A"}},{"$f":"ROUND(PAGE1!$O$86,5)","v":0},{"$f":"ROUND(PAGE1!$Q$86,5)","v":0}]
[{"$f":"$C$1&\".E30A.REM.CONSM.APPR.750TO1000..\"","v":{"$error":"#N/A"}},{"$f":"ROUND(PAGE1!$G$87,5)","v":0},{"$f":"ROUND(PAGE1!$I$87,5)","v":0}]
[{"$f":"$C$1&\".E30A.REM.CONSM.DISB.750TO1000..\"","v":{"$error":"#N/A"}},{"$f":"ROUND(PAGE1!$K$87,5)","v":0},{"$f":"ROUND(PAGE1!$M$87,5)","v":0}]
[{"$f":"$C$1&\".E30A.REM.CONSM.OS.750TO1000..\"","v":{"$error":"#N/A"}},{"$f":"ROUND(PAGE1!$O$87,5)","v":0},{"$f":"ROUND(PAGE1!$Q$87,5)","v":0}]
[{"$f":"$C$1&\".E30A.REM.CONSM.APPR.1000TO1250..\"","v":{"$error":"#N/A"}},{"$f":"ROUND(PAGE1!$G$88,5)","v":0},{"$f":"ROUND(PAGE1!$I$88,5)","v":0}]
[{"$f":"$C$1&\".E30A.REM.CONSM.DISB.1000TO1250..\"","v":{"$error":"#N/A"}},{"$f":"ROUND(PAGE1!$K$88,5)","v":0},{"$f":"ROUND(PAGE1!$M$88,5)","v":0}]
[{"$f":"$C$1&\".E30A.REM.CONSM.OS.1000TO1250..\"","v":{"$error":"#N/A"}},{"$f":"ROUND(PAGE1!$O$88,5)","v":0},{"$f":"ROUND(PAGE1!$Q$88,5)","v":0}]
[{"$f":"$C$1&\".E30A.REM.CONSM.APPR.1250TO1500..\"","v":{"$error":"#N/A"}},{"$f":"ROUND(PAGE1!$G$89,5)","v":0},{"$f":"ROUND(PAGE1!$I$89,5)","v":0}]
[{"$f":"$C$1&\".E30A.REM.CONSM.DISB.1250TO1500..\"","v":{"$error":"#N/A"}},{"$f":"ROUND(PAGE1!$K$89,5)","v":0},{"$f":"ROUND(PAGE1!$M$89,5)","v":0}]
[{"$f":"$C$1&\".E30A.REM.CONSM.OS.1250TO1500..\"","v":{"$error":"#N/A"}},{"$f":"ROUND(PAGE1!$O$89,5)","v":0},{"$f":"ROUND(PAGE1!$Q$89,5)","v":0}]
[{"$f":"$C$1&\".E30A.REM.CONSM.APPR.1500TO1750..\"","v":{"$error":"#N/A"}},{"$f":"ROUND(PAGE1!$G$90,5)","v":0},{"$f":"ROUND(PAGE1!$I$90,5)","v":0}]
[{"$f":"$C$1&\".E30A.REM.CONSM.DISB.1500TO1750..\"","v":{"$error":"#N/A"}},{"$f":"ROUND(PAGE1!$K$90,5)","v":0},{"$f":"ROUND(PAGE1!$M$90,5)","v":0}]
[{"$f":"$C$1&\".E30A.REM.CONSM.OS.1500TO1750..\"","v":{"$error":"#N/A"}},{"$f":"ROUND(PAGE1!$O$90,5)","v":0},{"$f":"ROUND(PAGE1!$Q$90,5)","v":0}]
[{"$f":"$C$1&\".E30A.REM.CONSM.APPR.1750TO2000..\"","v":{"$error":"#N/A"}},{"$f":"ROUND(PAGE1!$G$91,5)","v":0},{"$f":"ROUND(PAGE1!$I$91,5)","v":0}]
[{"$f":"$C$1&\".E30A.REM.CONSM.DISB.1750TO2000..\"","v":{"$error":"#N/A"}},{"$f":"ROUND(PAGE1!$K$91,5)","v":0},{"$f":"ROUND(PAGE1!$M$91,5)","v":0}]
[{"$f":"$C$1&\".E30A.REM.CONSM.OS.1750TO2000..\"","v":{"$error":"#N/A"}},{"$f":"ROUND(PAGE1!$O$91,5)","v":0},{"$f":"ROUND(PAGE1!$Q$91,5)","v":0}]
[{"$f":"$C$1&\".E30A.REM.CONSM.APPR.2000TO2250..\"","v":{"$error":"#N/A"}},{"$f":"ROUND(PAGE1!$G$92,5)","v":0},{"$f":"ROUND(PAGE1!$I$92,5)","v":0}]
[{"$f":"$C$1&\".E30A.REM.CONSM.DISB.2000TO2250..\"","v":{"$error":"#N/A"}},{"$f":"ROUND(PAGE1!$K$92,5)","v":0},{"$f":"ROUND(PAGE1!$M$92,5)","v":0}]
[{"$f":"$C$1&\".E30A.REM.CONSM.OS.2000TO2250..\"","v":{"$error":"#N/A"}},{"$f":"ROUND(PAGE1!$O$92,5)","v":0},{"$f":"ROUND(PAGE1!$Q$92,5)","v":0}]
[{"$f":"$C$1&\".E30A.REM.CONSM.APPR.2250TO2500..\"","v":{"$error":"#N/A"}},{"$f":"ROUND(PAGE1!$G$93,5)","v":0},{"$f":"ROUND(PAGE1!$I$93,5)","v":0}]
[{"$f":"$C$1&\".E30A.REM.CONSM.DISB.2250TO2500..\"","v":{"$error":"#N/A"}},{"$f":"ROUND(PAGE1!$K$93,5)","v":0},{"$f":"ROUND(PAGE1!$M$93,5)","v":0}]
[{"$f":"$C$1&\".E30A.REM.CONSM.OS.2250TO2500..\"","v":{"$error":"#N/A"}},{"$f":"ROUND(PAGE1!$O$93,5)","v":0},{"$f":"ROUND(PAGE1!$Q$93,5)","v":0}]
[{"$f":"$C$1&\".E30A.REM.CONSM.APPR.2500TO2750..\"","v":{"$error":"#N/A"}},{"$f":"ROUND(PAGE1!$G$94,5)","v":0},{"$f":"ROUND(PAGE1!$I$94,5)","v":0}]
[{"$f":"$C$1&\".E30A.REM.CONSM.DISB.2500TO2750..\"","v":{"$error":"#N/A"}},{"$f":"ROUND(PAGE1!$K$94,5)","v":0},{"$f":"ROUND(PAGE1!$M$94,5)","v":0}]
[{"$f":"$C$1&\".E30A.REM.CONSM.OS.2500TO2750..\"","v":{"$error":"#N/A"}},{"$f":"ROUND(PAGE1!$O$94,5)","v":0},{"$f":"ROUND(PAGE1!$Q$94,5)","v":0}]
[{"$f":"$C$1&\".E30A.REM.CONSM.APPR.2750TO3000..\"","v":{"$error":"#N/A"}},{"$f":"ROUND(PAGE1!$G$95,5)","v":0},{"$f":"ROUND(PAGE1!$I$95,5)","v":0}]
[{"$f":"$C$1&\".E30A.REM.CONSM.DISB.2750TO3000..\"","v":{"$error":"#N/A"}},{"$f":"ROUND(PAGE1!$K$95,5)","v":0},{"$f":"ROUND(PAGE1!$M$95,5)","v":0}]
[{"$f":"$C$1&\".E30A.REM.CONSM.OS.2750TO3000..\"","v":{"$error":"#N/A"}},{"$f":"ROUND(PAGE1!$O$95,5)","v":0},{"$f":"ROUND(PAGE1!$Q$95,5)","v":0}]
[{"$f":"$C$1&\".E30A.REM.CONSM.APPR.OVR3000..\"","v":{"$error":"#N/A"}},{"$f":"ROUND(PAGE1!$G$96,5)","v":0},{"$f":"ROUND(PAGE1!$I$96,5)","v":0}]
[{"$f":"$C$1&\".E30A.REM.CONSM.DISB.OVR3000..\"","v":{"$error":"#N/A"}},{"$f":"ROUND(PAGE1!$K$96,5)","v":0},{"$f":"ROUND(PAGE1!$M$96,5)","v":0}]
[{"$f":"$C$1&\".E30A.REM.CONSM.OS.OVR3000..\"","v":{"$error":"#N/A"}},{"$f":"ROUND(PAGE1!$O$96,5)","v":0},{"$f":"ROUND(PAGE1!$Q$96,5)","v":0}]
[{"$f":"$C$1&\".E30A.REM.CONSM.APPR.TTL..\"","v":{"$error":"#N/A"}},{"$f":"ROUND(PAGE1!$G$84,5)","v":0},{"$f":"ROUND(PAGE1!$I$84,5)","v":0}]
[{"$f":"$C$1&\".E30A.REM.CONSM.DISB.TTL..\"","v":{"$error":"#N/A"}},{"$f":"ROUND(PAGE1!$K$84,5)","v":0},{"$f":"ROUND(PAGE1!$M$84,5)","v":0}]
[{"$f":"$C$1&\".E30A.REM.CONSM.OS.TTL..\"","v":{"$error":"#N/A"}},{"$f":"ROUND(PAGE1!$O$84,5)","v":0},{"$f":"ROUND(PAGE1!$Q$84,5)","v":0}]
[{"$f":"$C$1&\".E30A.REM.APPR.AGG_TTL...\"","v":{"$error":"#N/A"}},{"$f":"ROUND(PAGE1!$G$98,5)","v":0},{"$f":"ROUND(PAGE1!$I$98,5)","v":0}]
[{"$f":"$C$1&\".E30A.REM.DISB.AGG_TTL...\"","v":{"$error":"#N/A"}},{"$f":"ROUND(PAGE1!$K$98,5)","v":0},{"$f":"ROUND(PAGE1!$M$98,5)","v":0}]
[{"$f":"$C$1&\".E30A.REM.OS.AGG_TTL...\"","v":{"$error":"#N/A"}},{"$f":"ROUND(PAGE1!$O$98,5)","v":0},{"$f":"ROUND(PAGE1!$Q$98,5)","v":0}]
["sect2","NUM","VAL"]
[{"$f":"$C$1&\".E30A.REM.PBSEC._INT.0_3_PERCT.APPR.\"","v":{"$error":"#N/A"}},{"$f":"ROUND(PAGE2!$G$21,5)","v":0},{"$f":"ROUND(PAGE2!$I$21,5)","v":0}]
[{"$f":"$C$1&\".E30A.REM.PBSEC._INT.0_3_PERCT.OS.\"","v":{"$error":"#N/A"}},{"$f":"ROUND(PAGE2!$L$21,5)","v":0},{"$f":"ROUND(PAGE2!$N$21,5)","v":0}]
[{"$f":"$C$1&\".E30A.REM.PBSEC._INT.3.1_4_PERCT.APPR.\"","v":{"$error":"#N/A"}},{"$f":"ROUND(PAGE2!$G$22,5)","v":0},{"$f":"ROUND(PAGE2!$I$22,5)","v":0}]
[{"$f":"$C$1&\".E30A.REM.PBSEC._INT.3.1_4_PERCT.OS.\"","v":{"$error":"#N/A"}},{"$f":"ROUND(PAGE2!$L$22,5)","v":0},{"$f":"ROUND(PAGE2!$N$22,5)","v":0}]
[{"$f":"$C$1&\".E30A.REM.PBSEC._INT.4.1_5_PERCT.APPR.\"","v":{"$error":"#N/A"}},{"$f":"ROUND(PAGE2!$G$23,5)","v":0},{"$f":"ROUND(PAGE2!$I$23,5)","v":0}]
[{"$f":"$C$1&\".E30A.REM.PBSEC._INT.4.1_5_PERCT.OS.\"","v":{"$error":"#N/A"}},{"$f":"ROUND(PAGE2!$L$23,5)","v":0},{"$f":"ROUND(PAGE2!$N$23,5)","v":0}]
[{"$f":"$C$1&\".E30A.REM.PBSEC._INT.5.1_6_PERCT.APPR.\"","v":{"$error":"#N/A"}},{"$f":"ROUND(PAGE2!$G$24,5)","v":0},{"$f":"ROUND(PAGE2!$I$24,5)","v":0}]
[{"$f":"$C$1&\".E30A.REM.PBSEC._INT.5.1_6_PERCT.OS.\"","v":{"$error":"#N/A"}},{"$f":"ROUND(PAGE2!$L$24,5)","v":0},{"$f":"ROUND(PAGE2!$N$24,5)","v":0}]
[{"$f":"$C$1&\".E30A.REM.PBSEC._INT.6.1_7_PERCT.APPR.\"","v":{"$error":"#N/A"}},{"$f":"ROUND(PAGE2!$G$25,5)","v":0},{"$f":"ROUND(PAGE2!$I$25,5)","v":0}]
[{"$f":"$C$1&\".E30A.REM.PBSEC._INT.6.1_7_PERCT.OS.\"","v":{"$error":"#N/A"}},{"$f":"ROUND(PAGE2!$L$25,5)","v":0},{"$f":"ROUND(PAGE2!$N$25,5)","v":0}]
[{"$f":"$C$1&\".E30A.REM.PBSEC._INT.7.1_8_PERCT.APPR.\"","v":{"$error":"#N/A"}},{"$f":"ROUND(PAGE2!$G$26,5)","v":0},{"$f":"ROUND(PAGE2!$I$26,5)","v":0}]
[{"$f":"$C$1&\".E30A.REM.PBSEC._INT.7.1_8_PERCT.OS.\"","v":{"$error":"#N/A"}},{"$f":"ROUND(PAGE2!$L$26,5)","v":0},{"$f":"ROUND(PAGE2!$N$26,5)","v":0}]
[{"$f":"$C$1&\".E30A.REM.PBSEC._INT.8.1_9_PERCT.APPR.\"","v":{"$error":"#N/A"}},{"$f":"ROUND(PAGE2!$G$27,5)","v":0},{"$f":"ROUND(PAGE2!$I$27,5)","v":0}]
[{"$f":"$C$1&\".E30A.REM.PBSEC._INT.8.1_9_PERCT.OS.\"","v":{"$error":"#N/A"}},{"$f":"ROUND(PAGE2!$L$27,5)","v":0},{"$f":"ROUND(PAGE2!$N$27,5)","v":0}]
[{"$f":"$C$1&\".E30A.REM.PBSEC._INT.9.1_10_PERCT.APPR.\"","v":{"$error":"#N/A"}},{"$f":"ROUND(PAGE2!$G$28,5)","v":0},{"$f":"ROUND(PAGE2!$I$28,5)","v":0}]
[{"$f":"$C$1&\".E30A.REM.PBSEC._INT.9.1_10_PERCT.OS.\"","v":{"$error":"#N/A"}},{"$f":"ROUND(PAGE2!$L$28,5)","v":0},{"$f":"ROUND(PAGE2!$N$28,5)","v":0}]
[{"$f":"$C$1&\".E30A.REM.PBSEC._INT.10.1_11_PERCT.APPR.\"","v":{"$error":"#N/A"}},{"$f":"ROUND(PAGE2!$G$29,5)","v":0},{"$f":"ROUND(PAGE2!$I$29,5)","v":0}]
[{"$f":"$C$1&\".E30A.REM.PBSEC._INT.10.1_11_PERCT.OS.\"","v":{"$error":"#N/A"}},{"$f":"ROUND(PAGE2!$L$29,5)","v":0},{"$f":"ROUND(PAGE2!$N$29,5)","v":0}]
[{"$f":"$C$1&\".E30A.REM.PBSEC._INT.11.1_12_PERCT.APPR.\"","v":{"$error":"#N/A"}},{"$f":"ROUND(PAGE2!$G$30,5)","v":0},{"$f":"ROUND(PAGE2!$I$30,5)","v":0}]
[{"$f":"$C$1&\".E30A.REM.PBSEC._INT.11.1_12_PERCT.OS.\"","v":{"$error":"#N/A"}},{"$f":"ROUND(PAGE2!$L$30,5)","v":0},{"$f":"ROUND(PAGE2!$N$30,5)","v":0}]
[{"$f":"$C$1&\".E30A.REM.PBSEC._INT.12.1_13_PERCT.APPR.\"","v":{"$error":"#N/A"}},{"$f":"ROUND(PAGE2!$G$31,5)","v":0},{"$f":"ROUND(PAGE2!$I$31,5)","v":0}]
[{"$f":"$C$1&\".E30A.REM.PBSEC._INT.12.1_13_PERCT.OS.\"","v":{"$error":"#N/A"}},{"$f":"ROUND(PAGE2!$L$31,5)","v":0},{"$f":"ROUND(PAGE2!$N$31,5)","v":0}]
[{"$f":"$C$1&\".E30A.REM.PBSEC._INT.13.1_14_PERCT.APPR.\"","v":{"$error":"#N/A"}},{"$f":"ROUND(PAGE2!$G$32,5)","v":0},{"$f":"ROUND(PAGE2!$I$32,5)","v":0}]
[{"$f":"$C$1&\".E30A.REM.PBSEC._INT.13.1_14_PERCT.OS.\"","v":{"$error":"#N/A"}},{"$f":"ROUND(PAGE2!$L$32,5)","v":0},{"$f":"ROUND(PAGE2!$N$32,5)","v":0}]
[{"$f":"$C$1&\".E30A.REM.PBSEC._INT.14.1_15_PERCT.APPR.\"","v":{"$error":"#N/A"}},{"$f":"ROUND(PAGE2!$G$33,5)","v":0},{"$f":"ROUND(PAGE2!$I$33,5)","v":0}]
[{"$f":"$C$1&\".E30A.REM.PBSEC._INT.14.1_15_PERCT.OS.\"","v":{"$error":"#N/A"}},{"$f":"ROUND(PAGE2!$L$33,5)","v":0},{"$f":"ROUND(PAGE2!$N$33,5)","v":0}]
[{"$f":"$C$1&\".E30A.REM.PBSEC._INT.OVR_15_PERCT.APPR.\"","v":{"$error":"#N/A"}},{"$f":"ROUND(PAGE2!$G$34,5)","v":0},{"$f":"ROUND(PAGE2!$I$34,5)","v":0}]
[{"$f":"$C$1&\".E30A.REM.PBSEC._INT.OVR_15_PERCT.OS.\"","v":{"$error":"#N/A"}},{"$f":"ROUND(PAGE2!$L$34,5)","v":0},{"$f":"ROUND(PAGE2!$N$34,5)","v":0}]
[{"$f":"$C$1&\".E30A.REM.PVFIN._INT.0_3_PERCT.APPR.\"","v":{"$error":"#N/A"}},{"$f":"ROUND(PAGE2!$G$39,5)","v":0},{"$f":"ROUND(PAGE2!$I$39,5)","v":0}]
[{"$f":"$C$1&\".E30A.REM.PVFIN._INT.0_3_PERCT.OS.\"","v":{"$error":"#N/A"}},{"$f":"ROUND(PAGE2!$L$39,5)","v":0},{"$f":"ROUND(PAGE2!$N$39,5)","v":0}]
[{"$f":"$C$1&\".E30A.REM.PVFIN._INT.3.1_4_PERCT.APPR.\"","v":{"$error":"#N/A"}},{"$f":"ROUND(PAGE2!$G$40,5)","v":0},{"$f":"ROUND(PAGE2!$I$40,5)","v":0}]
[{"$f":"$C$1&\".E30A.REM.PVFIN._INT.3.1_4_PERCT.OS.\"","v":{"$error":"#N/A"}},{"$f":"ROUND(PAGE2!$L$40,5)","v":0},{"$f":"ROUND(PAGE2!$N$40,5)","v":0}]
[{"$f":"$C$1&\".E30A.REM.PVFIN._INT.4.1_5_PERCT.APPR.\"","v":{"$error":"#N/A"}},{"$f":"ROUND(PAGE2!$G$41,5)","v":0},{"$f":"ROUND(PAGE2!$I$41,5)","v":0}]
[{"$f":"$C$1&\".E30A.REM.PVFIN._INT.4.1_5_PERCT.OS.\"","v":{"$error":"#N/A"}},{"$f":"ROUND(PAGE2!$L$41,5)","v":0},{"$f":"ROUND(PAGE2!$N$41,5)","v":0}]
[{"$f":"$C$1&\".E30A.REM.PVFIN._INT.5.1_6_PERCT.APPR.\"","v":{"$error":"#N/A"}},{"$f":"ROUND(PAGE2!$G$42,5)","v":0},{"$f":"ROUND(PAGE2!$I$42,5)","v":0}]
[{"$f":"$C$1&\".E30A.REM.PVFIN._INT.5.1_6_PERCT.OS.\"","v":{"$error":"#N/A"}},{"$f":"ROUND(PAGE2!$L$42,5)","v":0},{"$f":"ROUND(PAGE2!$N$42,5)","v":0}]
[{"$f":"$C$1&\".E30A.REM.PVFIN._INT.6.1_7_PERCT.APPR.\"","v":{"$error":"#N/A"}},{"$f":"ROUND(PAGE2!$G$43,5)","v":0},{"$f":"ROUND(PAGE2!$I$43,5)","v":0}]
[{"$f":"$C$1&\".E30A.REM.PVFIN._INT.6.1_7_PERCT.OS.\"","v":{"$error":"#N/A"}},{"$f":"ROUND(PAGE2!$L$43,5)","v":0},{"$f":"ROUND(PAGE2!$N$43,5)","v":0}]
[{"$f":"$C$1&\".E30A.REM.PVFIN._INT.7.1_8_PERCT.APPR.\"","v":{"$error":"#N/A"}},{"$f":"ROUND(PAGE2!$G$44,5)","v":0},{"$f":"ROUND(PAGE2!$I$44,5)","v":0}]
[{"$f":"$C$1&\".E30A.REM.PVFIN._INT.7.1_8_PERCT.OS.\"","v":{"$error":"#N/A"}},{"$f":"ROUND(PAGE2!$L$44,5)","v":0},{"$f":"ROUND(PAGE2!$N$44,5)","v":0}]
[{"$f":"$C$1&\".E30A.REM.PVFIN._INT.8.1_9_PERCT.APPR.\"","v":{"$error":"#N/A"}},{"$f":"ROUND(PAGE2!$G$45,5)","v":0},{"$f":"ROUND(PAGE2!$I$45,5)","v":0}]
[{"$f":"$C$1&\".E30A.REM.PVFIN._INT.8.1_9_PERCT.OS.\"","v":{"$error":"#N/A"}},{"$f":"ROUND(PAGE2!$L$45,5)","v":0},{"$f":"ROUND(PAGE2!$N$45,5)","v":0}]
[{"$f":"$C$1&\".E30A.REM.PVFIN._INT.9.1_10_PERCT.APPR.\"","v":{"$error":"#N/A"}},{"$f":"ROUND(PAGE2!$G$46,5)","v":0},{"$f":"ROUND(PAGE2!$I$46,5)","v":0}]
[{"$f":"$C$1&\".E30A.REM.PVFIN._INT.9.1_10_PERCT.OS.\"","v":{"$error":"#N/A"}},{"$f":"ROUND(PAGE2!$L$46,5)","v":0},{"$f":"ROUND(PAGE2!$N$46,5)","v":0}]
[{"$f":"$C$1&\".E30A.REM.PVFIN._INT.10.1_11_PERCT.APPR.\"","v":{"$error":"#N/A"}},{"$f":"ROUND(PAGE2!$G$47,5)","v":0},{"$f":"ROUND(PAGE2!$I$47,5)","v":0}]
[{"$f":"$C$1&\".E30A.REM.PVFIN._INT.10.1_11_PERCT.OS.\"","v":{"$error":"#N/A"}},{"$f":"ROUND(PAGE2!$L$47,5)","v":0},{"$f":"ROUND(PAGE2!$N$47,5)","v":0}]
[{"$f":"$C$1&\".E30A.REM.PVFIN._INT.11.1_12_PERCT.APPR.\"","v":{"$error":"#N/A"}},{"$f":"ROUND(PAGE2!$G$48,5)","v":0},{"$f":"ROUND(PAGE2!$I$48,5)","v":0}]
[{"$f":"$C$1&\".E30A.REM.PVFIN._INT.11.1_12_PERCT.OS.\"","v":{"$error":"#N/A"}},{"$f":"ROUND(PAGE2!$L$48,5)","v":0},{"$f":"ROUND(PAGE2!$N$48,5)","v":0}]
[{"$f":"$C$1&\".E30A.REM.PVFIN._INT.12.1_13_PERCT.APPR.\"","v":{"$error":"#N/A"}},{"$f":"ROUND(PAGE2!$G$49,5)","v":0},{"$f":"ROUND(PAGE2!$I$49,5)","v":0}]
[{"$f":"$C$1&\".E30A.REM.PVFIN._INT.12.1_13_PERCT.OS.\"","v":{"$error":"#N/A"}},{"$f":"ROUND(PAGE2!$L$49,5)","v":0},{"$f":"ROUND(PAGE2!$N$49,5)","v":0}]
[{"$f":"$C$1&\".E30A.REM.PVFIN._INT.13.1_14_PERCT.APPR.\"","v":{"$error":"#N/A"}},{"$f":"ROUND(PAGE2!$G$50,5)","v":0},{"$f":"ROUND(PAGE2!$I$50,5)","v":0}]
[{"$f":"$C$1&\".E30A.REM.PVFIN._INT.13.1_14_PERCT.OS.\"","v":{"$error":"#N/A"}},{"$f":"ROUND(PAGE2!$L$50,5)","v":0},{"$f":"ROUND(PAGE2!$N$50,5)","v":0}]
[{"$f":"$C$1&\".E30A.REM.PVFIN._INT.14.1_15_PERCT.APPR.\"","v":{"$error":"#N/A"}},{"$f":"ROUND(PAGE2!$G$51,5)","v":0},{"$f":"ROUND(PAGE2!$I$51,5)","v":0}]
[{"$f":"$C$1&\".E30A.REM.PVFIN._INT.14.1_15_PERCT.OS.\"","v":{"$error":"#N/A"}},{"$f":"ROUND(PAGE2!$L$51,5)","v":0},{"$f":"ROUND(PAGE2!$N$51,5)","v":0}]
[{"$f":"$C$1&\".E30A.REM.PVFIN._INT.OVR_15_PERCT.APPR.\"","v":{"$error":"#N/A"}},{"$f":"ROUND(PAGE2!$G$52,5)","v":0},{"$f":"ROUND(PAGE2!$I$52,5)","v":0}]
[{"$f":"$C$1&\".E30A.REM.PVFIN._INT.OVR_15_PERCT.OS.\"","v":{"$error":"#N/A"}},{"$f":"ROUND(PAGE2!$L$52,5)","v":0},{"$f":"ROUND(PAGE2!$N$52,5)","v":0}]
[{"$f":"$C$1&\".E30A.REM.IBUS._INT.0_3_PERCT.APPR.\"","v":{"$error":"#N/A"}},{"$f":"ROUND(PAGE2!$G$57,5)","v":0},{"$f":"ROUND(PAGE2!$I$57,5)","v":0}]
[{"$f":"$C$1&\".E30A.REM.IBUS._INT.0_3_PERCT.OS.\"","v":{"$error":"#N/A"}},{"$f":"ROUND(PAGE2!$L$57,5)","v":0},{"$f":"ROUND(PAGE2!$N$57,5)","v":0}]
[{"$f":"$C$1&\".E30A.REM.IBUS._INT.3.1_4_PERCT.APPR.\"","v":{"$error":"#N/A"}},{"$f":"ROUND(PAGE2!$G$58,5)","v":0},{"$f":"ROUND(PAGE2!$I$58,5)","v":0}]
[{"$f":"$C$1&\".E30A.REM.IBUS._INT.3.1_4_PERCT.OS.\"","v":{"$error":"#N/A"}},{"$f":"ROUND(PAGE2!$L$58,5)","v":0},{"$f":"ROUND(PAGE2!$N$58,5)","v":0}]
[{"$f":"$C$1&\".E30A.REM.IBUS._INT.4.1_5_PERCT.APPR.\"","v":{"$error":"#N/A"}},{"$f":"ROUND(PAGE2!$G$59,5)","v":0},{"$f":"ROUND(PAGE2!$I$59,5)","v":0}]
[{"$f":"$C$1&\".E30A.REM.IBUS._INT.4.1_5_PERCT.OS.\"","v":{"$error":"#N/A"}},{"$f":"ROUND(PAGE2!$L$59,5)","v":0},{"$f":"ROUND(PAGE2!$N$59,5)","v":0}]
[{"$f":"$C$1&\".E30A.REM.IBUS._INT.5.1_6_PERCT.APPR.\"","v":{"$error":"#N/A"}},{"$f":"ROUND(PAGE2!$G$60,5)","v":0},{"$f":"ROUND(PAGE2!$I$60,5)","v":0}]
[{"$f":"$C$1&\".E30A.REM.IBUS._INT.5.1_6_PERCT.OS.\"","v":{"$error":"#N/A"}},{"$f":"ROUND(PAGE2!$L$60,5)","v":0},{"$f":"ROUND(PAGE2!$N$60,5)","v":0}]
[{"$f":"$C$1&\".E30A.REM.IBUS._INT.6.1_7_PERCT.APPR.\"","v":{"$error":"#N/A"}},{"$f":"ROUND(PAGE2!$G$61,5)","v":0},{"$f":"ROUND(PAGE2!$I$61,5)","v":0}]
[{"$f":"$C$1&\".E30A.REM.IBUS._INT.6.1_7_PERCT.OS.\"","v":{"$error":"#N/A"}},{"$f":"ROUND(PAGE2!$L$61,5)","v":0},{"$f":"ROUND(PAGE2!$N$61,5)","v":0}]
[{"$f":"$C$1&\".E30A.REM.IBUS._INT.7.1_8_PERCT.APPR.\"","v":{"$error":"#N/A"}},{"$f":"ROUND(PAGE2!$G$62,5)","v":0},{"$f":"ROUND(PAGE2!$I$62,5)","v":0}]
[{"$f":"$C$1&\".E30A.REM.IBUS._INT.7.1_8_PERCT.OS.\"","v":{"$error":"#N/A"}},{"$f":"ROUND(PAGE2!$L$62,5)","v":0},{"$f":"ROUND(PAGE2!$N$62,5)","v":0}]
[{"$f":"$C$1&\".E30A.REM.IBUS._INT.8.1_9_PERCT.APPR.\"","v":{"$error":"#N/A"}},{"$f":"ROUND(PAGE2!$G$63,5)","v":0},{"$f":"ROUND(PAGE2!$I$63,5)","v":0}]
[{"$f":"$C$1&\".E30A.REM.IBUS._INT.8.1_9_PERCT.OS.\"","v":{"$error":"#N/A"}},{"$f":"ROUND(PAGE2!$L$63,5)","v":0},{"$f":"ROUND(PAGE2!$N$63,5)","v":0}]
[{"$f":"$C$1&\".E30A.REM.IBUS._INT.9.1_10_PERCT.APPR.\"","v":{"$error":"#N/A"}},{"$f":"ROUND(PAGE2!$G$64,5)","v":0},{"$f":"ROUND(PAGE2!$I$64,5)","v":0}]
[{"$f":"$C$1&\".E30A.REM.IBUS._INT.9.1_10_PERCT.OS.\"","v":{"$error":"#N/A"}},{"$f":"ROUND(PAGE2!$L$64,5)","v":0},{"$f":"ROUND(PAGE2!$N$64,5)","v":0}]
[{"$f":"$C$1&\".E30A.REM.IBUS._INT.10.1_11_PERCT.APPR.\"","v":{"$error":"#N/A"}},{"$f":"ROUND(PAGE2!$G$65,5)","v":0},{"$f":"ROUND(PAGE2!$I$65,5)","v":0}]
[{"$f":"$C$1&\".E30A.REM.IBUS._INT.10.1_11_PERCT.OS.\"","v":{"$error":"#N/A"}},{"$f":"ROUND(PAGE2!$L$65,5)","v":0},{"$f":"ROUND(PAGE2!$N$65,5)","v":0}]
[{"$f":"$C$1&\".E30A.REM.IBUS._INT.11.1_12_PERCT.APPR.\"","v":{"$error":"#N/A"}},{"$f":"ROUND(PAGE2!$G$66,5)","v":0},{"$f":"ROUND(PAGE2!$I$66,5)","v":0}]
[{"$f":"$C$1&\".E30A.REM.IBUS._INT.11.1_12_PERCT.OS.\"","v":{"$error":"#N/A"}},{"$f":"ROUND(PAGE2!$L$66,5)","v":0},{"$f":"ROUND(PAGE2!$N$66,5)","v":0}]
[{"$f":"$C$1&\".E30A.REM.IBUS._INT.12.1_13_PERCT.APPR.\"","v":{"$error":"#N/A"}},{"$f":"ROUND(PAGE2!$G$67,5)","v":0},{"$f":"ROUND(PAGE2!$I$67,5)","v":0}]
[{"$f":"$C$1&\".E30A.REM.IBUS._INT.12.1_13_PERCT.OS.\"","v":{"$error":"#N/A"}},{"$f":"ROUND(PAGE2!$L$67,5)","v":0},{"$f":"ROUND(PAGE2!$N$67,5)","v":0}]
[{"$f":"$C$1&\".E30A.REM.IBUS._INT.13.1_14_PERCT.APPR.\"","v":{"$error":"#N/A"}},{"$f":"ROUND(PAGE2!$G$68,5)","v":0},{"$f":"ROUND(PAGE2!$I$68,5)","v":0}]
[{"$f":"$C$1&\".E30A.REM.IBUS._INT.13.1_14_PERCT.OS.\"","v":{"$error":"#N/A"}},{"$f":"ROUND(PAGE2!$L$68,5)","v":0},{"$f":"ROUND(PAGE2!$N$68,5)","v":0}]
[{"$f":"$C$1&\".E30A.REM.IBUS._INT.14.1_15_PERCT.APPR.\"","v":{"$error":"#N/A"}},{"$f":"ROUND(PAGE2!$G$69,5)","v":0},{"$f":"ROUND(PAGE2!$I$69,5)","v":0}]
[{"$f":"$C$1&\".E30A.REM.IBUS._INT.14.1_15_PERCT.OS.\"","v":{"$error":"#N/A"}},{"$f":"ROUND(PAGE2!$L$69,5)","v":0},{"$f":"ROUND(PAGE2!$N$69,5)","v":0}]
[{"$f":"$C$1&\".E30A.REM.IBUS._INT.OVR_15_PERCT.APPR.\"","v":{"$error":"#N/A"}},{"$f":"ROUND(PAGE2!$G$70,5)","v":0},{"$f":"ROUND(PAGE2!$I$70,5)","v":0}]
[{"$f":"$C$1&\".E30A.REM.IBUS._INT.OVR_15_PERCT.OS.\"","v":{"$error":"#N/A"}},{"$f":"ROUND(PAGE2!$L$70,5)","v":0},{"$f":"ROUND(PAGE2!$N$70,5)","v":0}]
[{"$f":"$C$1&\".E30A.REM.UIBUS._INT.0_3_PERCT.APPR.\"","v":{"$error":"#N/A"}},{"$f":"ROUND(PAGE2!$G$75,5)","v":0},{"$f":"ROUND(PAGE2!$I$75,5)","v":0}]
[{"$f":"$C$1&\".E30A.REM.UIBUS._INT.0_3_PERCT.OS.\"","v":{"$error":"#N/A"}},{"$f":"ROUND(PAGE2!$L$75,5)","v":0},{"$f":"ROUND(PAGE2!$N$75,5)","v":0}]
[{"$f":"$C$1&\".E30A.REM.UIBUS._INT.3.1_4_PERCT.APPR.\"","v":{"$error":"#N/A"}},{"$f":"ROUND(PAGE2!$G$76,5)","v":0},{"$f":"ROUND(PAGE2!$I$76,5)","v":0}]
[{"$f":"$C$1&\".E30A.REM.UIBUS._INT.3.1_4_PERCT.OS.\"","v":{"$error":"#N/A"}},{"$f":"ROUND(PAGE2!$L$76,5)","v":0},{"$f":"ROUND(PAGE2!$N$76,5)","v":0}]
[{"$f":"$C$1&\".E30A.REM.UIBUS._INT.4.1_5_PERCT.APPR.\"","v":{"$error":"#N/A"}},{"$f":"ROUND(PAGE2!$G$77,5)","v":0},{"$f":"ROUND(PAGE2!$I$77,5)","v":0}]
[{"$f":"$C$1&\".E30A.REM.UIBUS._INT.4.1_5_PERCT.OS.\"","v":{"$error":"#N/A"}},{"$f":"ROUND(PAGE2!$L$77,5)","v":0},{"$f":"ROUND(PAGE2!$N$77,5)","v":0}]
[{"$f":"$C$1&\".E30A.REM.UIBUS._INT.5.1_6_PERCT.APPR.\"","v":{"$error":"#N/A"}},{"$f":"ROUND(PAGE2!$G$78,5)","v":0},{"$f":"ROUND(PAGE2!$I$78,5)","v":0}]
[{"$f":"$C$1&\".E30A.REM.UIBUS._INT.5.1_6_PERCT.OS.\"","v":{"$error":"#N/A"}},{"$f":"ROUND(PAGE2!$L$78,5)","v":0},{"$f":"ROUND(PAGE2!$N$78,5)","v":0}]
[{"$f":"$C$1&\".E30A.REM.UIBUS._INT.6.1_7_PERCT.APPR.\"","v":{"$error":"#N/A"}},{"$f":"ROUND(PAGE2!$G$79,5)","v":0},{"$f":"ROUND(PAGE2!$I$79,5)","v":0}]
[{"$f":"$C$1&\".E30A.REM.UIBUS._INT.6.1_7_PERCT.OS.\"","v":{"$error":"#N/A"}},{"$f":"ROUND(PAGE2!$L$79,5)","v":0},{"$f":"ROUND(PAGE2!$N$79,5)","v":0}]
[{"$f":"$C$1&\".E30A.REM.UIBUS._INT.7.1_8_PERCT.APPR.\"","v":{"$error":"#N/A"}},{"$f":"ROUND(PAGE2!$G$80,5)","v":0},{"$f":"ROUND(PAGE2!$I$80,5)","v":0}]
[{"$f":"$C$1&\".E30A.REM.UIBUS._INT.7.1_8_PERCT.OS.\"","v":{"$error":"#N/A"}},{"$f":"ROUND(PAGE2!$L$80,5)","v":0},{"$f":"ROUND(PAGE2!$N$80,5)","v":0}]
[{"$f":"$C$1&\".E30A.REM.UIBUS._INT.8.1_9_PERCT.APPR.\"","v":{"$error":"#N/A"}},{"$f":"ROUND(PAGE2!$G$81,5)","v":0},{"$f":"ROUND(PAGE2!$I$81,5)","v":0}]
[{"$f":"$C$1&\".E30A.REM.UIBUS._INT.8.1_9_PERCT.OS.\"","v":{"$error":"#N/A"}},{"$f":"ROUND(PAGE2!$L$81,5)","v":0},{"$f":"ROUND(PAGE2!$N$81,5)","v":0}]
[{"$f":"$C$1&\".E30A.REM.UIBUS._INT.9.1_10_PERCT.APPR.\"","v":{"$error":"#N/A"}},{"$f":"ROUND(PAGE2!$G$82,5)","v":0},{"$f":"ROUND(PAGE2!$I$82,5)","v":0}]
[{"$f":"$C$1&\".E30A.REM.UIBUS._INT.9.1_10_PERCT.OS.\"","v":{"$error":"#N/A"}},{"$f":"ROUND(PAGE2!$L$82,5)","v":0},{"$f":"ROUND(PAGE2!$N$82,5)","v":0}]
[{"$f":"$C$1&\".E30A.REM.UIBUS._INT.10.1_11_PERCT.APPR.\"","v":{"$error":"#N/A"}},{"$f":"ROUND(PAGE2!$G$83,5)","v":0},{"$f":"ROUND(PAGE2!$I$83,5)","v":0}]
[{"$f":"$C$1&\".E30A.REM.UIBUS._INT.10.1_11_PERCT.OS.\"","v":{"$error":"#N/A"}},{"$f":"ROUND(PAGE2!$L$83,5)","v":0},{"$f":"ROUND(PAGE2!$N$83,5)","v":0}]
[{"$f":"$C$1&\".E30A.REM.UIBUS._INT.11.1_12_PERCT.APPR.\"","v":{"$error":"#N/A"}},{"$f":"ROUND(PAGE2!$G$84,5)","v":0},{"$f":"ROUND(PAGE2!$I$84,5)","v":0}]
[{"$f":"$C$1&\".E30A.REM.UIBUS._INT.11.1_12_PERCT.OS.\"","v":{"$error":"#N/A"}},{"$f":"ROUND(PAGE2!$L$84,5)","v":0},{"$f":"ROUND(PAGE2!$N$84,5)","v":0}]
[{"$f":"$C$1&\".E30A.REM.UIBUS._INT.12.1_13_PERCT.APPR.\"","v":{"$error":"#N/A"}},{"$f":"ROUND(PAGE2!$G$85,5)","v":0},{"$f":"ROUND(PAGE2!$I$85,5)","v":0}]
[{"$f":"$C$1&\".E30A.REM.UIBUS._INT.12.1_13_PERCT.OS.\"","v":{"$error":"#N/A"}},{"$f":"ROUND(PAGE2!$L$85,5)","v":0},{"$f":"ROUND(PAGE2!$N$85,5)","v":0}]
[{"$f":"$C$1&\".E30A.REM.UIBUS._INT.13.1_14_PERCT.APPR.\"","v":{"$error":"#N/A"}},{"$f":"ROUND(PAGE2!$G$86,5)","v":0},{"$f":"ROUND(PAGE2!$I$86,5)","v":0}]
[{"$f":"$C$1&\".E30A.REM.UIBUS._INT.13.1_14_PERCT.OS.\"","v":{"$error":"#N/A"}},{"$f":"ROUND(PAGE2!$L$86,5)","v":0},{"$f":"ROUND(PAGE2!$N$86,5)","v":0}]
[{"$f":"$C$1&\".E30A.REM.UIBUS._INT.14.1_15_PERCT.APPR.\"","v":{"$error":"#N/A"}},{"$f":"ROUND(PAGE2!$G$87,5)","v":0},{"$f":"ROUND(PAGE2!$I$87,5)","v":0}]
[{"$f":"$C$1&\".E30A.REM.UIBUS._INT.14.1_15_PERCT.OS.\"","v":{"$error":"#N/A"}},{"$f":"ROUND(PAGE2!$L$87,5)","v":0},{"$f":"ROUND(PAGE2!$N$87,5)","v":0}]
[{"$f":"$C$1&\".E30A.REM.UIBUS._INT.OVR_15_PERCT.APPR.\"","v":{"$error":"#N/A"}},{"$f":"ROUND(PAGE2!$G$88,5)","v":0},{"$f":"ROUND(PAGE2!$I$88,5)","v":0}]
[{"$f":"$C$1&\".E30A.REM.UIBUS._INT.OVR_15_PERCT.OS.\"","v":{"$error":"#N/A"}},{"$f":"ROUND(PAGE2!$L$88,5)","v":0},{"$f":"ROUND(PAGE2!$N$88,5)","v":0}]
[{"$f":"$C$1&\".E30A.REM.CONSM._INT.0_3_PERCT.APPR.\"","v":{"$error":"#N/A"}},{"$f":"ROUND(PAGE2!$G$92,5)","v":0},{"$f":"ROUND(PAGE2!$I$92,5)","v":0}]
[{"$f":"$C$1&\".E30A.REM.CONSM._INT.0_3_PERCT.OS.\"","v":{"$error":"#N/A"}},{"$f":"ROUND(PAGE2!$L$92,5)","v":0},{"$f":"ROUND(PAGE2!$N$92,5)","v":0}]
[{"$f":"$C$1&\".E30A.REM.CONSM._INT.3.1_4_PERCT.APPR.\"","v":{"$error":"#N/A"}},{"$f":"ROUND(PAGE2!$G$93,5)","v":0},{"$f":"ROUND(PAGE2!$I$93,5)","v":0}]
[{"$f":"$C$1&\".E30A.REM.CONSM._INT.3.1_4_PERCT.OS.\"","v":{"$error":"#N/A"}},{"$f":"ROUND(PAGE2!$L$93,5)","v":0},{"$f":"ROUND(PAGE2!$N$93,5)","v":0}]
[{"$f":"$C$1&\".E30A.REM.CONSM._INT.4.1_5_PERCT.APPR.\"","v":{"$error":"#N/A"}},{"$f":"ROUND(PAGE2!$G$94,5)","v":0},{"$f":"ROUND(PAGE2!$I$94,5)","v":0}]
[{"$f":"$C$1&\".E30A.REM.CONSM._INT.4.1_5_PERCT.OS.\"","v":{"$error":"#N/A"}},{"$f":"ROUND(PAGE2!$L$94,5)","v":0},{"$f":"ROUND(PAGE2!$N$94,5)","v":0}]
[{"$f":"$C$1&\".E30A.REM.CONSM._INT.5.1_6_PERCT.APPR.\"","v":{"$error":"#N/A"}},{"$f":"ROUND(PAGE2!$G$95,5)","v":0},{"$f":"ROUND(PAGE2!$I$95,5)","v":0}]
[{"$f":"$C$1&\".E30A.REM.CONSM._INT.5.1_6_PERCT.OS.\"","v":{"$error":"#N/A"}},{"$f":"ROUND(PAGE2!$L$95,5)","v":0},{"$f":"ROUND(PAGE2!$N$95,5)","v":0}]
[{"$f":"$C$1&\".E30A.REM.CONSM._INT.6.1_7_PERCT.APPR.\"","v":{"$error":"#N/A"}},{"$f":"ROUND(PAGE2!$G$96,5)","v":0},{"$f":"ROUND(PAGE2!$I$96,5)","v":0}]
[{"$f":"$C$1&\".E30A.REM.CONSM._INT.6.1_7_PERCT.OS.\"","v":{"$error":"#N/A"}},{"$f":"ROUND(PAGE2!$L$96,5)","v":0},{"$f":"ROUND(PAGE2!$N$96,5)","v":0}]
[{"$f":"$C$1&\".E30A.REM.CONSM._INT.7.1_8_PERCT.APPR.\"","v":{"$error":"#N/A"}},{"$f":"ROUND(PAGE2!$G$97,5)","v":0},{"$f":"ROUND(PAGE2!$I$97,5)","v":0}]
[{"$f":"$C$1&\".E30A.REM.CONSM._INT.7.1_8_PERCT.OS.\"","v":{"$error":"#N/A"}},{"$f":"ROUND(PAGE2!$L$97,5)","v":0},{"$f":"ROUND(PAGE2!$N$97,5)","v":0}]
[{"$f":"$C$1&\".E30A.REM.CONSM._INT.8.1_9_PERCT.APPR.\"","v":{"$error":"#N/A"}},{"$f":"ROUND(PAGE2!$G$98,5)","v":0},{"$f":"ROUND(PAGE2!$I$98,5)","v":0}]
[{"$f":"$C$1&\".E30A.REM.CONSM._INT.8.1_9_PERCT.OS.\"","v":{"$error":"#N/A"}},{"$f":"ROUND(PAGE2!$L$98,5)","v":0},{"$f":"ROUND(PAGE2!$N$98,5)","v":0}]
[{"$f":"$C$1&\".E30A.REM.CONSM._INT.9.1_10_PERCT.APPR.\"","v":{"$error":"#N/A"}},{"$f":"ROUND(PAGE2!$G$99,5)","v":0},{"$f":"ROUND(PAGE2!$I$99,5)","v":0}]
[{"$f":"$C$1&\".E30A.REM.CONSM._INT.9.1_10_PERCT.OS.\"","v":{"$error":"#N/A"}},{"$f":"ROUND(PAGE2!$L$99,5)","v":0},{"$f":"ROUND(PAGE2!$N$99,5)","v":0}]
[{"$f":"$C$1&\".E30A.REM.CONSM._INT.10.1_11_PERCT.APPR.\"","v":{"$error":"#N/A"}},{"$f":"ROUND(PAGE2!$G$100,5)","v":0},{"$f":"ROUND(PAGE2!$I$100,5)","v":0}]
[{"$f":"$C$1&\".E30A.REM.CONSM._INT.10.1_11_PERCT.OS.\"","v":{"$error":"#N/A"}},{"$f":"ROUND(PAGE2!$L$100,5)","v":0},{"$f":"ROUND(PAGE2!$N$100,5)","v":0}]
[{"$f":"$C$1&\".E30A.REM.CONSM._INT.11.1_12_PERCT.APPR.\"","v":{"$error":"#N/A"}},{"$f":"ROUND(PAGE2!$G$101,5)","v":0},{"$f":"ROUND(PAGE2!$I$101,5)","v":0}]
[{"$f":"$C$1&\".E30A.REM.CONSM._INT.11.1_12_PERCT.OS.\"","v":{"$error":"#N/A"}},{"$f":"ROUND(PAGE2!$L$101,5)","v":0},{"$f":"ROUND(PAGE2!$N$101,5)","v":0}]
[{"$f":"$C$1&\".E30A.REM.CONSM._INT.12.1_13_PERCT.APPR.\"","v":{"$error":"#N/A"}},{"$f":"ROUND(PAGE2!$G$102,5)","v":0},{"$f":"ROUND(PAGE2!$I$102,5)","v":0}]
[{"$f":"$C$1&\".E30A.REM.CONSM._INT.12.1_13_PERCT.OS.\"","v":{"$error":"#N/A"}},{"$f":"ROUND(PAGE2!$L$102,5)","v":0},{"$f":"ROUND(PAGE2!$N$102,5)","v":0}]
[{"$f":"$C$1&\".E30A.REM.CONSM._INT.13.1_14_PERCT.APPR.\"","v":{"$error":"#N/A"}},{"$f":"ROUND(PAGE2!$G$103,5)","v":0},{"$f":"ROUND(PAGE2!$I$103,5)","v":0}]
[{"$f":"$C$1&\".E30A.REM.CONSM._INT.13.1_14_PERCT.OS.\"","v":{"$error":"#N/A"}},{"$f":"ROUND(PAGE2!$L$103,5)","v":0},{"$f":"ROUND(PAGE2!$N$103,5)","v":0}]
[{"$f":"$C$1&\".E30A.REM.CONSM._INT.14.1_15_PERCT.APPR.\"","v":{"$error":"#N/A"}},{"$f":"ROUND(PAGE2!$G$104,5)","v":0},{"$f":"ROUND(PAGE2!$I$104,5)","v":0}]
[{"$f":"$C$1&\".E30A.REM.CONSM._INT.14.1_15_PERCT.OS.\"","v":{"$error":"#N/A"}},{"$f":"ROUND(PAGE2!$L$104,5)","v":0},{"$f":"ROUND(PAGE2!$N$104,5)","v":0}]
[{"$f":"$C$1&\".E30A.REM.CONSM._INT.OVR_15.1_PERCT.APPR.\"","v":{"$error":"#N/A"}},{"$f":"ROUND(PAGE2!$G$105,5)","v":0},{"$f":"ROUND(PAGE2!$I$105,5)","v":0}]
[{"$f":"$C$1&\".E30A.REM.CONSM._INT.OVR_15.1_PERCT.OS.\"","v":{"$error":"#N/A"}},{"$f":"ROUND(PAGE2!$L$105,5)","v":0},{"$f":"ROUND(PAGE2!$N$105,5)","v":0}]
[{"$f":"$C$1&\".E30A.REM.APPR.SEC.AGG_TTL..\"","v":{"$error":"#N/A"}},{"$f":"ROUND(PAGE2!$G$107,5)","v":0},{"$f":"ROUND(PAGE2!$I$107,5)","v":0}]
[{"$f":"$C$1&\".E30A.REM.OS.SEC.AGG_TTL..\"","v":{"$error":"#N/A"}},{"$f":"ROUND(PAGE2!$L$107,5)","v":0},{"$f":"ROUND(PAGE2!$N$107,5)","v":0}]
["sect3","NUM","VAL"]
[{"$f":"$C$1&\".E30A.REM.RES._INT.0_3_PERCT.DISB.\"","v":{"$error":"#N/A"}},{"$f":"ROUND(PAGE3!$G$21,5)","v":0},{"$f":"ROUND(PAGE3!$I$21,5)","v":0}]
[{"$f":"$C$1&\".E30A.REM.RES._INT.0_3_PERCT.OS.\"","v":{"$error":"#N/A"}},{"$f":"ROUND(PAGE3!$L$21,5)","v":0},{"$f":"ROUND(PAGE3!$N$21,5)","v":0}]
[{"$f":"$C$1&\".E30A.REM.RES._INT.3.1_4_PERCT.DISB.\"","v":{"$error":"#N/A"}},{"$f":"ROUND(PAGE3!$G$22,5)","v":0},{"$f":"ROUND(PAGE3!$I$22,5)","v":0}]
[{"$f":"$C$1&\".E30A.REM.RES._INT.3.1_4_PERCT.OS.\"","v":{"$error":"#N/A"}},{"$f":"ROUND(PAGE3!$L$22,5)","v":0},{"$f":"ROUND(PAGE3!$N$22,5)","v":0}]
[{"$f":"$C$1&\".E30A.REM.RES._INT.4.1_5_PERCT.DISB.\"","v":{"$error":"#N/A"}},{"$f":"ROUND(PAGE3!$G$23,5)","v":0},{"$f":"ROUND(PAGE3!$I$23,5)","v":0}]
[{"$f":"$C$1&\".E30A.REM.RES._INT.4.1_5_PERCT.OS.\"","v":{"$error":"#N/A"}},{"$f":"ROUND(PAGE3!$L$23,5)","v":0},{"$f":"ROUND(PAGE3!$N$23,5)","v":0}]
[{"$f":"$C$1&\".E30A.REM.RES._INT.5.1_6_PERCT.DISB.\"","v":{"$error":"#N/A"}},{"$f":"ROUND(PAGE3!$G$24,5)","v":0},{"$f":"ROUND(PAGE3!$I$24,5)","v":0}]
[{"$f":"$C$1&\".E30A.REM.RES._INT.5.1_6_PERCT.OS.\"","v":{"$error":"#N/A"}},{"$f":"ROUND(PAGE3!$L$24,5)","v":0},{"$f":"ROUND(PAGE3!$N$24,5)","v":0}]
[{"$f":"$C$1&\".E30A.REM.RES._INT.6.1_7_PERCT.DISB.\"","v":{"$error":"#N/A"}},{"$f":"ROUND(PAGE3!$G$25,5)","v":0},{"$f":"ROUND(PAGE3!$I$25,5)","v":0}]
[{"$f":"$C$1&\".E30A.REM.RES._INT.6.1_7_PERCT.OS.\"","v":{"$error":"#N/A"}},{"$f":"ROUND(PAGE3!$L$25,5)","v":0},{"$f":"ROUND(PAGE3!$N$25,5)","v":0}]
[{"$f":"$C$1&\".E30A.REM.RES._INT.7.1_8_PERCT.DISB.\"","v":{"$error":"#N/A"}},{"$f":"ROUND(PAGE3!$G$26,5)","v":0},{"$f":"ROUND(PAGE3!$I$26,5)","v":0}]
[{"$f":"$C$1&\".E30A.REM.RES._INT.7.1_8_PERCT.OS.\"","v":{"$error":"#N/A"}},{"$f":"ROUND(PAGE3!$L$26,5)","v":0},{"$f":"ROUND(PAGE3!$N$26,5)","v":0}]
[{"$f":"$C$1&\".E30A.REM.RES._INT.8.1_9_PERCT.DISB.\"","v":{"$error":"#N/A"}},{"$f":"ROUND(PAGE3!$G$27,5)","v":0},{"$f":"ROUND(PAGE3!$I$27,5)","v":0}]
[{"$f":"$C$1&\".E30A.REM.RES._INT.8.1_9_PERCT.OS.\"","v":{"$error":"#N/A"}},{"$f":"ROUND(PAGE3!$L$27,5)","v":0},{"$f":"ROUND(PAGE3!$N$27,5)","v":0}]
[{"$f":"$C$1&\".E30A.REM.RES._INT.9.1_10_PERCT.DISB.\"","v":{"$error":"#N/A"}},{"$f":"ROUND(PAGE3!$G$28,5)","v":0},{"$f":"ROUND(PAGE3!$I$28,5)","v":0}]
[{"$f":"$C$1&\".E30A.REM.RES._INT.9.1_10_PERCT.OS.\"","v":{"$error":"#N/A"}},{"$f":"ROUND(PAGE3!$L$28,5)","v":0},{"$f":"ROUND(PAGE3!$N$28,5)","v":0}]
[{"$f":"$C$1&\".E30A.REM.RES._INT.10.1_11_PERCT.DISB.\"","v":{"$error":"#N/A"}},{"$f":"ROUND(PAGE3!$G$29,5)","v":0},{"$f":"ROUND(PAGE3!$I$29,5)","v":0}]
[{"$f":"$C$1&\".E30A.REM.RES._INT.10.1_11_PERCT.OS.\"","v":{"$error":"#N/A"}},{"$f":"ROUND(PAGE3!$L$29,5)","v":0},{"$f":"ROUND(PAGE3!$N$29,5)","v":0}]
[{"$f":"$C$1&\".E30A.REM.RES._INT.11.1_12_PERCT.DISB.\"","v":{"$error":"#N/A"}},{"$f":"ROUND(PAGE3!$G$30,5)","v":0},{"$f":"ROUND(PAGE3!$I$30,5)","v":0}]
[{"$f":"$C$1&\".E30A.REM.RES._INT.11.1_12_PERCT.OS.\"","v":{"$error":"#N/A"}},{"$f":"ROUND(PAGE3!$L$30,5)","v":0},{"$f":"ROUND(PAGE3!$N$30,5)","v":0}]
[{"$f":"$C$1&\".E30A.REM.RES._INT.12.1_13_PERCT.DISB.\"","v":{"$error":"#N/A"}},{"$f":"ROUND(PAGE3!$G$31,5)","v":0},{"$f":"ROUND(PAGE3!$I$31,5)","v":0}]
[{"$f":"$C$1&\".E30A.REM.RES._INT.12.1_13_PERCT.OS.\"","v":{"$error":"#N/A"}},{"$f":"ROUND(PAGE3!$L$31,5)","v":0},{"$f":"ROUND(PAGE3!$N$31,5)","v":0}]
[{"$f":"$C$1&\".E30A.REM.RES._INT.13.1_14_PERCT.DISB.\"","v":{"$error":"#N/A"}},{"$f":"ROUND(PAGE3!$G$32,5)","v":0},{"$f":"ROUND(PAGE3!$I$32,5)","v":0}]
[{"$f":"$C$1&\".E30A.REM.RES._INT.13.1_14_PERCT.OS.\"","v":{"$error":"#N/A"}},{"$f":"ROUND(PAGE3!$L$32,5)","v":0},{"$f":"ROUND(PAGE3!$N$32,5)","v":0}]
[{"$f":"$C$1&\".E30A.REM.RES._INT.14.1_15_PERCT.DISB.\"","v":{"$error":"#N/A"}},{"$f":"ROUND(PAGE3!$G$33,5)","v":0},{"$f":"ROUND(PAGE3!$I$33,5)","v":0}]
[{"$f":"$C$1&\".E30A.REM.RES._INT.14.1_15_PERCT.OS.\"","v":{"$error":"#N/A"}},{"$f":"ROUND(PAGE3!$L$33,5)","v":0},{"$f":"ROUND(PAGE3!$N$33,5)","v":0}]
[{"$f":"$C$1&\".E30A.REM.RES._INT.OVR_15_PERCT.DISB.\"","v":{"$error":"#N/A"}},{"$f":"ROUND(PAGE3!$G$34,5)","v":0},{"$f":"ROUND(PAGE3!$I$34,5)","v":0}]
[{"$f":"$C$1&\".E30A.REM.RES._INT.OVR_15_PERCT.OS.\"","v":{"$error":"#N/A"}},{"$f":"ROUND(PAGE3!$L$34,5)","v":0},{"$f":"ROUND(PAGE3!$N$34,5)","v":0}]
[{"$f":"$C$1&\".E30A.REM.NRES._INT.0_3_PERCT.DISB.\"","v":{"$error":"#N/A"}},{"$f":"ROUND(PAGE3!$G$40,5)","v":0},{"$f":"ROUND(PAGE3!$I$40,5)","v":0}]
[{"$f":"$C$1&\".E30A.REM.NRES._INT.0_3_PERCT.OS.\"","v":{"$error":"#N/A"}},{"$f":"ROUND(PAGE3!$L$40,5)","v":0},{"$f":"ROUND(PAGE3!$N$40,5)","v":0}]
[{"$f":"$C$1&\".E30A.REM.NRES._INT.3.1_4_PERCT.DISB.\"","v":{"$error":"#N/A"}},{"$f":"ROUND(PAGE3!$G$41,5)","v":0},{"$f":"ROUND(PAGE3!$I$41,5)","v":0}]
[{"$f":"$C$1&\".E30A.REM.NRES._INT.3.1_4_PERCT.OS.\"","v":{"$error":"#N/A"}},{"$f":"ROUND(PAGE3!$L$41,5)","v":0},{"$f":"ROUND(PAGE3!$N$41,5)","v":0}]
[{"$f":"$C$1&\".E30A.REM.NRES._INT.4.1_5_PERCT.DISB.\"","v":{"$error":"#N/A"}},{"$f":"ROUND(PAGE3!$G$42,5)","v":0},{"$f":"ROUND(PAGE3!$I$42,5)","v":0}]
[{"$f":"$C$1&\".E30A.REM.NRES._INT.4.1_5_PERCT.OS.\"","v":{"$error":"#N/A"}},{"$f":"ROUND(PAGE3!$L$42,5)","v":0},{"$f":"ROUND(PAGE3!$N$42,5)","v":0}]
[{"$f":"$C$1&\".E30A.REM.NRES._INT.5.1_6_PERCT.DISB.\"","v":{"$error":"#N/A"}},{"$f":"ROUND(PAGE3!$G$43,5)","v":0},{"$f":"ROUND(PAGE3!$I$43,5)","v":0}]
[{"$f":"$C$1&\".E30A.REM.NRES._INT.5.1_6_PERCT.OS.\"","v":{"$error":"#N/A"}},{"$f":"ROUND(PAGE3!$L$43,5)","v":0},{"$f":"ROUND(PAGE3!$N$43,5)","v":0}]
[{"$f":"$C$1&\".E30A.REM.NRES._INT.6.1_7_PERCT.DISB.\"","v":{"$error":"#N/A"}},{"$f":"ROUND(PAGE3!$G$44,5)","v":0},{"$f":"ROUND(PAGE3!$I$44,5)","v":0}]
[{"$f":"$C$1&\".E30A.REM.NRES._INT.6.1_7_PERCT.OS.\"","v":{"$error":"#N/A"}},{"$f":"ROUND(PAGE3!$L$44,5)","v":0},{"$f":"ROUND(PAGE3!$N$44,5)","v":0}]
[{"$f":"$C$1&\".E30A.REM.NRES._INT.7.1_8_PERCT.DISB.\"","v":{"$error":"#N/A"}},{"$f":"ROUND(PAGE3!$G$45,5)","v":0},{"$f":"ROUND(PAGE3!$I$45,5)","v":0}]
[{"$f":"$C$1&\".E30A.REM.NRES._INT.7.1_8_PERCT.OS.\"","v":{"$error":"#N/A"}},{"$f":"ROUND(PAGE3!$L$45,5)","v":0},{"$f":"ROUND(PAGE3!$N$45,5)","v":0}]
[{"$f":"$C$1&\".E30A.REM.NRES._INT.8.1_9_PERCT.DISB.\"","v":{"$error":"#N/A"}},{"$f":"ROUND(PAGE3!$G$46,5)","v":0},{"$f":"ROUND(PAGE3!$I$46,5)","v":0}]
[{"$f":"$C$1&\".E30A.REM.NRES._INT.8.1_9_PERCT.OS.\"","v":{"$error":"#N/A"}},{"$f":"ROUND(PAGE3!$L$46,5)","v":0},{"$f":"ROUND(PAGE3!$N$46,5)","v":0}]
[{"$f":"$C$1&\".E30A.REM.NRES._INT.9.1_10_PERCT.DISB.\"","v":{"$error":"#N/A"}},{"$f":"ROUND(PAGE3!$G$47,5)","v":0},{"$f":"ROUND(PAGE3!$I$47,5)","v":0}]
[{"$f":"$C$1&\".E30A.REM.NRES._INT.9.1_10_PERCT.OS.\"","v":{"$error":"#N/A"}},{"$f":"ROUND(PAGE3!$L$47,5)","v":0},{"$f":"ROUND(PAGE3!$N$47,5)","v":0}]
[{"$f":"$C$1&\".E30A.REM.NRES._INT.10.1_11_PERCT.DISB.\"","v":{"$error":"#N/A"}},{"$f":"ROUND(PAGE3!$G$48,5)","v":0},{"$f":"ROUND(PAGE3!$I$48,5)","v":0}]
[{"$f":"$C$1&\".E30A.REM.NRES._INT.10.1_11_PERCT.OS.\"","v":{"$error":"#N/A"}},{"$f":"ROUND(PAGE3!$L$48,5)","v":0},{"$f":"ROUND(PAGE3!$N$48,5)","v":0}]
[{"$f":"$C$1&\".E30A.REM.NRES._INT.11.1_12_PERCT.DISB.\"","v":{"$error":"#N/A"}},{"$f":"ROUND(PAGE3!$G$49,5)","v":0},{"$f":"ROUND(PAGE3!$I$49,5)","v":0}]
[{"$f":"$C$1&\".E30A.REM.NRES._INT.11.1_12_PERCT.OS.\"","v":{"$error":"#N/A"}},{"$f":"ROUND(PAGE3!$L$49,5)","v":0},{"$f":"ROUND(PAGE3!$N$49,5)","v":0}]
[{"$f":"$C$1&\".E30A.REM.NRES._INT.12.1_13_PERCT.DISB.\"","v":{"$error":"#N/A"}},{"$f":"ROUND(PAGE3!$G$50,5)","v":0},{"$f":"ROUND(PAGE3!$I$50,5)","v":0}]
[{"$f":"$C$1&\".E30A.REM.NRES._INT.12.1_13_PERCT.OS.\"","v":{"$error":"#N/A"}},{"$f":"ROUND(PAGE3!$L$50,5)","v":0},{"$f":"ROUND(PAGE3!$N$50,5)","v":0}]
[{"$f":"$C$1&\".E30A.REM.NRES._INT.13.1_14_PERCT.DISB.\"","v":{"$error":"#N/A"}},{"$f":"ROUND(PAGE3!$G$51,5)","v":0},{"$f":"ROUND(PAGE3!$I$51,5)","v":0}]
[{"$f":"$C$1&\".E30A.REM.NRES._INT.13.1_14_PERCT.OS.\"","v":{"$error":"#N/A"}},{"$f":"ROUND(PAGE3!$L$51,5)","v":0},{"$f":"ROUND(PAGE3!$N$51,5)","v":0}]
[{"$f":"$C$1&\".E30A.REM.NRES._INT.14.1_15_PERCT.DISB.\"","v":{"$error":"#N/A"}},{"$f":"ROUND(PAGE3!$G$52,5)","v":0},{"$f":"ROUND(PAGE3!$I$52,5)","v":0}]
[{"$f":"$C$1&\".E30A.REM.NRES._INT.14.1_15_PERCT.OS.\"","v":{"$error":"#N/A"}},{"$f":"ROUND(PAGE3!$L$52,5)","v":0},{"$f":"ROUND(PAGE3!$N$52,5)","v":0}]
[{"$f":"$C$1&\".E30A.REM.NRES._INT.OVR_15.1_PERCT.DISB.\"","v":{"$error":"#N/A"}},{"$f":"ROUND(PAGE3!$G$53,5)","v":0},{"$f":"ROUND(PAGE3!$I$53,5)","v":0}]
[{"$f":"$C$1&\".E30A.REM.NRES._INT.OVR_15.1_PERCT.OS.\"","v":{"$error":"#N/A"}},{"$f":"ROUND(PAGE3!$L$53,5)","v":0},{"$f":"ROUND(PAGE3!$N$53,5)","v":0}]
[{"$f":"$C$1&\".E30A.REM.RES.DISB.TTL..\"","v":{"$error":"#N/A"}},{"$f":"ROUND(PAGE3!$G$36,5)","v":0},{"$f":"ROUND(PAGE3!$I$36,5)","v":0}]
[{"$f":"$C$1&\".E30A.REM.RES.OS.TTL..\"","v":{"$error":"#N/A"}},{"$f":"ROUND(PAGE3!$L$36,5)","v":0},{"$f":"ROUND(PAGE3!$N$36,5)","v":0}]
[{"$f":"$C$1&\".E30A.REM.NRES.DISB.TTL..\"","v":{"$error":"#N/A"}},{"$f":"ROUND(PAGE3!$G$55,5)","v":0},{"$f":"ROUND(PAGE3!$I$55,5)","v":0}]
[{"$f":"$C$1&\".E30A.REM.NRES.OS.TTL..\"","v":{"$error":"#N/A"}},{"$f":"ROUND(PAGE3!$L$55,5)","v":0},{"$f":"ROUND(PAGE3!$N$55,5)","v":0}]
[{"$f":"$C$1&\".E30A.REM.DISB.PTYPE.AGG_TTL..\"","v":{"$error":"#N/A"}},{"$f":"ROUND(PAGE3!$G$58,5)","v":0},{"$f":"ROUND(PAGE3!$I$58,5)","v":0}]
[{"$f":"$C$1&\".E30A.REM.OS.PTYPE.AGG_TTL..\"","v":{"$error":"#N/A"}},{"$f":"ROUND(PAGE3!$L$58,5)","v":0},{"$f":"ROUND(PAGE3!$N$58,5)","v":0}]
["sect4","NUM","VAL"]
[{"$f":"$C$1&\".E30A.REM.RENOV.APPR...\"","v":{"$error":"#N/A"}},{"$f":"ROUND('PAGE4 '!$G$20,5)","v":0},{"$f":"ROUND('PAGE4 '!$I$20,5)","v":0}]
[{"$f":"$C$1&\".E30A.REM.RENOV.DISB...\"","v":{"$error":"#N/A"}},{"$f":"ROUND('PAGE4 '!$K$20,5)","v":0},{"$f":"ROUND('PAGE4 '!$M$20,5)","v":0}]
[{"$f":"$C$1&\".E30A.REM.RENOV.OS...\"","v":{"$error":"#N/A"}},{"$f":"ROUND('PAGE4 '!$O$20,5)","v":0},{"$f":"ROUND('PAGE4 '!$Q$20,5)","v":0}]
[{"$f":"$C$1&\".E30A.REM.NEW_HOUSE.APPR...\"","v":{"$error":"#N/A"}},{"$f":"ROUND('PAGE4 '!$G$24,5)","v":0},{"$f":"ROUND('PAGE4 '!$I$24,5)","v":0}]
[{"$f":"$C$1&\".E30A.REM.NEW_HOUSE.DISB...\"","v":{"$error":"#N/A"}},{"$f":"ROUND('PAGE4 '!$K$24,5)","v":0},{"$f":"ROUND('PAGE4 '!$M$24,5)","v":0}]
[{"$f":"$C$1&\".E30A.REM.NEW_HOUSE.OS...\"","v":{"$error":"#N/A"}},{"$f":"ROUND('PAGE4 '!$O$24,5)","v":0},{"$f":"ROUND('PAGE4 '!$Q$24,5)","v":0}]
[{"$f":"$C$1&\".E30A.REM.EXIST_HOUSE.APPR...\"","v":{"$error":"#N/A"}},{"$f":"ROUND('PAGE4 '!$G$27,5)","v":0},{"$f":"ROUND('PAGE4 '!$I$27,5)","v":0}]
[{"$f":"$C$1&\".E30A.REM.EXIST_HOUSE.DISB...\"","v":{"$error":"#N/A"}},{"$f":"ROUND('PAGE4 '!$K$27,5)","v":0},{"$f":"ROUND('PAGE4 '!$M$27,5)","v":0}]
[{"$f":"$C$1&\".E30A.REM.EXIST_HOUSE.OS...\"","v":{"$error":"#N/A"}},{"$f":"ROUND('PAGE4 '!$O$27,5)","v":0},{"$f":"ROUND('PAGE4 '!$Q$27,5)","v":0}]
[{"$f":"$C$1&\".E30A.REM.LAND.APPR..\"","v":{"$error":"#N/A"}},{"$f":"ROUND('PAGE4 '!$G$29,5)","v":0},{"$f":"ROUND('PAGE4 '!$I$29,5)","v":0}]
[{"$f":"$C$1&\".E30A.REM.LAND.DISB...\"","v":{"$error":"#N/A"}},{"$f":"ROUND('PAGE4 '!$K$29,5)","v":0},{"$f":"ROUND('PAGE4 '!$M$29,5)","v":0}]
[{"$f":"$C$1&\".E30A.REM.LAND.OS..\"","v":{"$error":"#N/A"}},{"$f":"ROUND('PAGE4 '!$O$29,5)","v":0},{"$f":"ROUND('PAGE4 '!$Q$29,5)","v":0}]
[{"$f":"$C$1&\".E30A.REM.LNS.RESCH...\"","v":{"$error":"#N/A"}},{"$f":"ROUND('PAGE4 '!$O$35,5)","v":0},{"$f":"ROUND('PAGE4 '!$Q$35,5)","v":0}]
["sect5","NUM"]
[{"$f":"$C$1&\".E30A.REM.LN_APP.REC.NRES..\"","v":{"$error":"#N/A"}},{"$f":"ROUND('PAGE4 '!$C$47,5)","v":0}]
[{"$f":"$C$1&\".E30A.REM.LN_APP.REC.RES..\"","v":{"$error":"#N/A"}},{"$f":"ROUND('PAGE4 '!$C$45,5)","v":0}]
["sect6","RATE"]
[{"$f":"$C$1&\".E30A.REM.LTV_PERCT.RES.LAND..\"","v":{"$error":"#N/A"}},{"$f":"ROUND('PAGE4 '!$C$53,5)","v":0}]
[{"$f":"$C$1&\".E30A.REM.LTV_PERCT.RES.LAND_HOUSE..\"","v":{"$error":"#N/A"}},{"$f":"ROUND('PAGE4 '!$I$53,5)","v":0}]
[{"$f":"$C$1&\".E30A.REM.LTV_PERCT.NRES.LAND..\"","v":{"$error":"#N/A"}},{"$f":"ROUND('PAGE4 '!$C$55,5)","v":0}]
[{"$f":"$C$1&\".E30A.REM.LTV_PERCT.NRES.LAND_BLDG..\"","v":{"$error":"#N/A"}},{"$f":"ROUND('PAGE4 '!$I$55,5)","v":0}]
[{"$f":"$C$1&\".E30A.REM.LN_DISC.DISTR.FR.RES.\"","v":{"$error":"#N/A"}},{"$f":"ROUND('PAGE4 '!$I$62,5)","v":0}]
[{"$f":"$C$1&\".E30A.REM.LN_DISC.DISTR.VR.RES.\"","v":{"$error":"#N/A"}},{"$f":"ROUND('PAGE4 '!$I$64,5)","v":0}]
[{"$f":"$C$1&\".E30A.REM.LN_DISC.DISTR.AR.RES.\"","v":{"$error":"#N/A"}},{"$f":"ROUND('PAGE4 '!$I$66,5)","v":0}]
["sect7","NUM","VAL"]
[{"$f":"$C$1&\".E30A.REM.FR.PBSEC.DISB._INT.0_3_PERCT.\"","v":{"$error":"#N/A"}},{"$f":"ROUND(PAGE5!$C$20,5)","v":0},{"$f":"ROUND(PAGE5!$E$20,5)","v":0}]
[{"$f":"$C$1&\".E30A.REM.VAR.PBSEC.DISB._INT.0_3_PERCT.\"","v":{"$error":"#N/A"}},{"$f":"ROUND(PAGE5!$G$20,5)","v":0},{"$f":"ROUND(PAGE5!$I$20,5)","v":0}]
[{"$f":"$C$1&\".E30A.REM.ADJ.PBSEC.DISB._INT.0_3_PERCT.\"","v":{"$error":"#N/A"}},{"$f":"ROUND(PAGE5!$K$20,5)","v":0},{"$f":"ROUND(PAGE5!$M$20,5)","v":0}]
[{"$f":"$C$1&\".E30A.REM.PBSEC.DISB._INT.0_3_PERCT.TTL.\"","v":{"$error":"#N/A"}},{"$f":"ROUND(PAGE5!$P$20,5)","v":0},{"$f":"ROUND(PAGE5!$R$20,5)","v":0}]
[{"$f":"$C$1&\".E30A.REM.FR.PBSEC.DISB._INT.3.1_4_PERCT.\"","v":{"$error":"#N/A"}},{"$f":"ROUND(PAGE5!$C$21,5)","v":0},{"$f":"ROUND(PAGE5!$E$21,5)","v":0}]
[{"$f":"$C$1&\".E30A.REM.VAR.PBSEC.DISB._INT.3.1_4_PERCT.\"","v":{"$error":"#N/A"}},{"$f":"ROUND(PAGE5!$G$21,5)","v":0},{"$f":"ROUND(PAGE5!$I$21,5)","v":0}]
[{"$f":"$C$1&\".E30A.REM.ADJ.PBSEC.DISB._INT.3.1_4_PERCT.\"","v":{"$error":"#N/A"}},{"$f":"ROUND(PAGE5!$K$21,5)","v":0},{"$f":"ROUND(PAGE5!$M$21,5)","v":0}]
[{"$f":"$C$1&\".E30A.REM.PBSEC.DISB._INT.3.1_4_PERCT.TTL.\"","v":{"$error":"#N/A"}},{"$f":"ROUND(PAGE5!$P$21,5)","v":0},{"$f":"ROUND(PAGE5!$R$21,5)","v":0}]
[{"$f":"$C$1&\".E30A.REM.FR.PBSEC.DISB._INT.4.1_5_PERCT.\"","v":{"$error":"#N/A"}},{"$f":"ROUND(PAGE5!$C$22,5)","v":0},{"$f":"ROUND(PAGE5!$E$22,5)","v":0}]
[{"$f":"$C$1&\".E30A.REM.VAR.PBSEC.DISB._INT.4.1_5_PERCT.\"","v":{"$error":"#N/A"}},{"$f":"ROUND(PAGE5!$G$22,5)","v":0},{"$f":"ROUND(PAGE5!$I$22,5)","v":0}]
[{"$f":"$C$1&\".E30A.REM.ADJ.PBSEC.DISB._INT.4.1_5_PERCT.\"","v":{"$error":"#N/A"}},{"$f":"ROUND(PAGE5!$K$22,5)","v":0},{"$f":"ROUND(PAGE5!$M$22,5)","v":0}]
[{"$f":"$C$1&\".E30A.REM.PBSEC.DISB._INT.4.1_5_PERCT.TTL.\"","v":{"$error":"#N/A"}},{"$f":"ROUND(PAGE5!$P$22,5)","v":0},{"$f":"ROUND(PAGE5!$R$22,5)","v":0}]
[{"$f":"$C$1&\".E30A.REM.FR.PBSEC.DISB._INT.5.1_6_PERCT.\"","v":{"$error":"#N/A"}},{"$f":"ROUND(PAGE5!$C$23,5)","v":0},{"$f":"ROUND(PAGE5!$E$23,5)","v":0}]
[{"$f":"$C$1&\".E30A.REM.VAR.PBSEC.DISB._INT.5.1_6_PERCT.\"","v":{"$error":"#N/A"}},{"$f":"ROUND(PAGE5!$G$23,5)","v":0},{"$f":"ROUND(PAGE5!$I$23,5)","v":0}]
[{"$f":"$C$1&\".E30A.REM.ADJ.PBSEC.DISB._INT.5.1_6_PERCT.\"","v":{"$error":"#N/A"}},{"$f":"ROUND(PAGE5!$K$23,5)","v":0},{"$f":"ROUND(PAGE5!$M$23,5)","v":0}]
[{"$f":"$C$1&\".E30A.REM.PBSEC.DISB._INT.5.1_6_PERCT.TTL.\"","v":{"$error":"#N/A"}},{"$f":"ROUND(PAGE5!$P$23,5)","v":0},{"$f":"ROUND(PAGE5!$R$23,5)","v":0}]
[{"$f":"$C$1&\".E30A.REM.FR.PBSEC.DISB._INT.6.1_7_PERCT.\"","v":{"$error":"#N/A"}},{"$f":"ROUND(PAGE5!$C$24,5)","v":0},{"$f":"ROUND(PAGE5!$E$24,5)","v":0}]
[{"$f":"$C$1&\".E30A.REM.VAR.PBSEC.DISB._INT.6.1_7_PERCT.\"","v":{"$error":"#N/A"}},{"$f":"ROUND(PAGE5!$G$24,5)","v":0},{"$f":"ROUND(PAGE5!$I$24,5)","v":0}]
[{"$f":"$C$1&\".E30A.REM.ADJ.PBSEC.DISB._INT.6.1_7_PERCT.\"","v":{"$error":"#N/A"}},{"$f":"ROUND(PAGE5!$K$24,5)","v":0},{"$f":"ROUND(PAGE5!$M$24,5)","v":0}]
[{"$f":"$C$1&\".E30A.REM.PBSEC.DISB._INT.6.1_7_PERCT.TTL.\"","v":{"$error":"#N/A"}},{"$f":"ROUND(PAGE5!$P$24,5)","v":0},{"$f":"ROUND(PAGE5!$R$24,5)","v":0}]
[{"$f":"$C$1&\".E30A.REM.FR.PBSEC.DISB._INT.7.1_8_PERCT.\"","v":{"$error":"#N/A"}},{"$f":"ROUND(PAGE5!$C$25,5)","v":0},{"$f":"ROUND(PAGE5!$E$25,5)","v":0}]
[{"$f":"$C$1&\".E30A.REM.VAR.PBSEC.DISB._INT.7.1_8_PERCT.\"","v":{"$error":"#N/A"}},{"$f":"ROUND(PAGE5!$G$25,5)","v":0},{"$f":"ROUND(PAGE5!$I$25,5)","v":0}]
[{"$f":"$C$1&\".E30A.REM.ADJ.PBSEC.DISB._INT.7.1_8_PERCT.\"","v":{"$error":"#N/A"}},{"$f":"ROUND(PAGE5!$K$25,5)","v":0},{"$f":"ROUND(PAGE5!$M$25,5)","v":0}]
[{"$f":"$C$1&\".E30A.REM.PBSEC.DISB._INT.7.1_8_PERCT.TTL.\"","v":{"$error":"#N/A"}},{"$f":"ROUND(PAGE5!$P$25,5)","v":0},{"$f":"ROUND(PAGE5!$R$25,5)","v":0}]
[{"$f":"$C$1&\".E30A.REM.FR.PBSEC.DISB._INT.8.1_9_PERCT.\"","v":{"$error":"#N/A"}},{"$f":"ROUND(PAGE5!$C$26,5)","v":0},{"$f":"ROUND(PAGE5!$E$26,5)","v":0}]
[{"$f":"$C$1&\".E30A.REM.VAR.PBSEC.DISB._INT.8.1_9_PERCT.\"","v":{"$error":"#N/A"}},{"$f":"ROUND(PAGE5!$G$26,5)","v":0},{"$f":"ROUND(PAGE5!$I$26,5)","v":0}]
[{"$f":"$C$1&\".E30A.REM.ADJ.PBSEC.DISB._INT.8.1_9_PERCT.\"","v":{"$error":"#N/A"}},{"$f":"ROUND(PAGE5!$K$26,5)","v":0},{"$f":"ROUND(PAGE5!$M$26,5)","v":0}]
[{"$f":"$C$1&\".E30A.REM.PBSEC.DISB._INT.8.1_9_PERCT.TTL.\"","v":{"$error":"#N/A"}},{"$f":"ROUND(PAGE5!$P$26,5)","v":0},{"$f":"ROUND(PAGE5!$R$26,5)","v":0}]
[{"$f":"$C$1&\".E30A.REM.FR.PBSEC.DISB._INT.9.1_10_PERCT.\"","v":{"$error":"#N/A"}},{"$f":"ROUND(PAGE5!$C$27,5)","v":0},{"$f":"ROUND(PAGE5!$E$27,5)","v":0}]
[{"$f":"$C$1&\".E30A.REM.VAR.PBSEC.DISB._INT.9.1_10_PERCT.\"","v":{"$error":"#N/A"}},{"$f":"ROUND(PAGE5!$G$27,5)","v":0},{"$f":"ROUND(PAGE5!$I$27,5)","v":0}]
[{"$f":"$C$1&\".E30A.REM.ADJ.PBSEC.DISB._INT.9.1_10_PERCT.\"","v":{"$error":"#N/A"}},{"$f":"ROUND(PAGE5!$K$27,5)","v":0},{"$f":"ROUND(PAGE5!$M$27,5)","v":0}]
[{"$f":"$C$1&\".E30A.REM.PBSEC.DISB._INT.9.1_10_PERCT.TTL.\"","v":{"$error":"#N/A"}},{"$f":"ROUND(PAGE5!$P$27,5)","v":0},{"$f":"ROUND(PAGE5!$R$27,5)","v":0}]
[{"$f":"$C$1&\".E30A.REM.FR.PBSEC.DISB._INT.10.1_11_PERCT.\"","v":{"$error":"#N/A"}},{"$f":"ROUND(PAGE5!$C$28,5)","v":0},{"$f":"ROUND(PAGE5!$E$28,5)","v":0}]
[{"$f":"$C$1&\".E30A.REM.VAR.PBSEC.DISB._INT.10.1_11_PERCT.\"","v":{"$error":"#N/A"}},{"$f":"ROUND(PAGE5!$G$28,5)","v":0},{"$f":"ROUND(PAGE5!$I$28,5)","v":0}]
[{"$f":"$C$1&\".E30A.REM.ADJ.PBSEC.DISB._INT.10.1_11_PERCT.\"","v":{"$error":"#N/A"}},{"$f":"ROUND(PAGE5!$K$28,5)","v":0},{"$f":"ROUND(PAGE5!$M$28,5)","v":0}]
[{"$f":"$C$1&\".E30A.REM.PBSEC.DISB._INT.10.1_11_PERCT.TTL.\"","v":{"$error":"#N/A"}},{"$f":"ROUND(PAGE5!$P$28,5)","v":0},{"$f":"ROUND(PAGE5!$R$28,5)","v":0}]
[{"$f":"$C$1&\".E30A.REM.FR.PBSEC.DISB._INT.11.1_12_PERCT.\"","v":{"$error":"#N/A"}},{"$f":"ROUND(PAGE5!$C$29,5)","v":0},{"$f":"ROUND(PAGE5!$E$29,5)","v":0}]
[{"$f":"$C$1&\".E30A.REM.VAR.PBSEC.DISB._INT.11.1_12_PERCT.\"","v":{"$error":"#N/A"}},{"$f":"ROUND(PAGE5!$G$29,5)","v":0},{"$f":"ROUND(PAGE5!$I$29,5)","v":0}]
[{"$f":"$C$1&\".E30A.REM.ADJ.PBSEC.DISB._INT.11.1_12_PERCT.\"","v":{"$error":"#N/A"}},{"$f":"ROUND(PAGE5!$K$29,5)","v":0},{"$f":"ROUND(PAGE5!$M$29,5)","v":0}]
[{"$f":"$C$1&\".E30A.REM.PBSEC.DISB._INT.11.1_12_PERCT.TTL.\"","v":{"$error":"#N/A"}},{"$f":"ROUND(PAGE5!$P$29,5)","v":0},{"$f":"ROUND(PAGE5!$R$29,5)","v":0}]
[{"$f":"$C$1&\".E30A.REM.FR.PBSEC.DISB._INT.12.1_13_PERCT.\"","v":{"$error":"#N/A"}},{"$f":"ROUND(PAGE5!$C$30,5)","v":0},{"$f":"ROUND(PAGE5!$E$30,5)","v":0}]
[{"$f":"$C$1&\".E30A.REM.VAR.PBSEC.DISB._INT.12.1_13_PERCT.\"","v":{"$error":"#N/A"}},{"$f":"ROUND(PAGE5!$G$30,5)","v":0},{"$f":"ROUND(PAGE5!$I$30,5)","v":0}]
[{"$f":"$C$1&\".E30A.REM.ADJ.PBSEC.DISB._INT.12.1_13_PERCT.\"","v":{"$error":"#N/A"}},{"$f":"ROUND(PAGE5!$K$30,5)","v":0},{"$f":"ROUND(PAGE5!$M$30,5)","v":0}]
[{"$f":"$C$1&\".E30A.REM.PBSEC.DISB._INT.12.1_13_PERCT.TTL.\"","v":{"$error":"#N/A"}},{"$f":"ROUND(PAGE5!$P$30,5)","v":0},{"$f":"ROUND(PAGE5!$R$30,5)","v":0}]
[{"$f":"$C$1&\".E30A.REM.FR.PBSEC.DISB._INT.13.1_14_PERCT.\"","v":{"$error":"#N/A"}},{"$f":"ROUND(PAGE5!$C$31,5)","v":0},{"$f":"ROUND(PAGE5!$E$31,5)","v":0}]
[{"$f":"$C$1&\".E30A.REM.VAR.PBSEC.DISB._INT.13.1_14_PERCT.\"","v":{"$error":"#N/A"}},{"$f":"ROUND(PAGE5!$G$31,5)","v":0},{"$f":"ROUND(PAGE5!$I$31,5)","v":0}]
[{"$f":"$C$1&\".E30A.REM.ADJ.PBSEC.DISB._INT.13.1_14_PERCT.\"","v":{"$error":"#N/A"}},{"$f":"ROUND(PAGE5!$K$31,5)","v":0},{"$f":"ROUND(PAGE5!$M$31,5)","v":0}]
[{"$f":"$C$1&\".E30A.REM.PBSEC.DISB._INT.13.1_14_PERCT.TTL.\"","v":{"$error":"#N/A"}},{"$f":"ROUND(PAGE5!$P$31,5)","v":0},{"$f":"ROUND(PAGE5!$R$31,5)","v":0}]
[{"$f":"$C$1&\".E30A.REM.FR.PBSEC.DISB._INT.14.1_15_PERCT.\"","v":{"$error":"#N/A"}},{"$f":"ROUND(PAGE5!$C$32,5)","v":0},{"$f":"ROUND(PAGE5!$E$32,5)","v":0}]
[{"$f":"$C$1&\".E30A.REM.VAR.PBSEC.DISB._INT.14.1_15_PERCT.\"","v":{"$error":"#N/A"}},{"$f":"ROUND(PAGE5!$G$32,5)","v":0},{"$f":"ROUND(PAGE5!$I$32,5)","v":0}]
[{"$f":"$C$1&\".E30A.REM.ADJ.PBSEC.DISB._INT.14.1_15_PERCT.\"","v":{"$error":"#N/A"}},{"$f":"ROUND(PAGE5!$K$32,5)","v":0},{"$f":"ROUND(PAGE5!$M$32,5)","v":0}]
[{"$f":"$C$1&\".E30A.REM.PBSEC.DISB._INT.14.1_15_PERCT.TTL.\"","v":{"$error":"#N/A"}},{"$f":"ROUND(PAGE5!$P$32,5)","v":0},{"$f":"ROUND(PAGE5!$R$32,5)","v":0}]
[{"$f":"$C$1&\".E30A.REM.FR.PBSEC.DISB._INT.OVR_15.1_PERCT.\"","v":{"$error":"#N/A"}},{"$f":"ROUND(PAGE5!$C$33,5)","v":0},{"$f":"ROUND(PAGE5!$E$33,5)","v":0}]
[{"$f":"$C$1&\".E30A.REM.VAR.PBSEC.DISB._INT.OVR_15.1_PERCT.\"","v":{"$error":"#N/A"}},{"$f":"ROUND(PAGE5!$G$33,5)","v":0},{"$f":"ROUND(PAGE5!$I$33,5)","v":0}]
[{"$f":"$C$1&\".E30A.REM.ADJ.PBSEC.DISB._INT.OVR_15.1_PERCT.\"","v":{"$error":"#N/A"}},{"$f":"ROUND(PAGE5!$K$33,5)","v":0},{"$f":"ROUND(PAGE5!$M$33,5)","v":0}]
[{"$f":"$C$1&\".E30A.REM.PBSEC.DISB._INT.OVR_15.1_PERCT.TTL.\"","v":{"$error":"#N/A"}},{"$f":"ROUND(PAGE5!$P$33,5)","v":0},{"$f":"ROUND(PAGE5!$R$33,5)","v":0}]
[{"$f":"$C$1&\".E30A.REM.FR.PVFIN.DISB._INT.0_3_PERCT.\"","v":{"$error":"#N/A"}},{"$f":"ROUND(PAGE5!$C$39,5)","v":0},{"$f":"ROUND(PAGE5!$E$39,5)","v":0}]
[{"$f":"$C$1&\".E30A.REM.VAR.PVFIN.DISB._INT.0_3_PERCT.\"","v":{"$error":"#N/A"}},{"$f":"ROUND(PAGE5!$G$39,5)","v":0},{"$f":"ROUND(PAGE5!$I$39,5)","v":0}]
[{"$f":"$C$1&\".E30A.REM.ADJ.PVFIN.DISB._INT.0_3_PERCT.\"","v":{"$error":"#N/A"}},{"$f":"ROUND(PAGE5!$K$39,5)","v":0},{"$f":"ROUND(PAGE5!$M$39,5)","v":0}]
[{"$f":"$C$1&\".E30A.REM.PVFIN.DISB._INT.0_3_PERCT.TTL.\"","v":{"$error":"#N/A"}},{"$f":"ROUND(PAGE5!$P$39,5)","v":0},{"$f":"ROUND(PAGE5!$R$39,5)","v":0}]
[{"$f":"$C$1&\".E30A.REM.FR.PVFIN.DISB._INT.3.1_4_PERCT.\"","v":{"$error":"#N/A"}},{"$f":"ROUND(PAGE5!$C$40,5)","v":0},{"$f":"ROUND(PAGE5!$E$40,5)","v":0}]
[{"$f":"$C$1&\".E30A.REM.VAR.PVFIN.DISB._INT.3.1_4_PERCT.\"","v":{"$error":"#N/A"}},{"$f":"ROUND(PAGE5!$G$40,5)","v":0},{"$f":"ROUND(PAGE5!$I$40,5)","v":0}]
[{"$f":"$C$1&\".E30A.REM.ADJ.PVFIN.DISB._INT.3.1_4_PERCT.\"","v":{"$error":"#N/A"}},{"$f":"ROUND(PAGE5!$K$40,5)","v":0},{"$f":"ROUND(PAGE5!$M$40,5)","v":0}]
[{"$f":"$C$1&\".E30A.REM.PVFIN.DISB._INT.3.1_4_PERCT.TTL.\"","v":{"$error":"#N/A"}},{"$f":"ROUND(PAGE5!$P$40,5)","v":0},{"$f":"ROUND(PAGE5!$R$40,5)","v":0}]
[{"$f":"$C$1&\".E30A.REM.FR.PVFIN.DISB._INT.4.1_5_PERCT.\"","v":{"$error":"#N/A"}},{"$f":"ROUND(PAGE5!$C$41,5)","v":0},{"$f":"ROUND(PAGE5!$E$41,5)","v":0}]
[{"$f":"$C$1&\".E30A.REM.VAR.PVFIN.DISB._INT.4.1_5_PERCT.\"","v":{"$error":"#N/A"}},{"$f":"ROUND(PAGE5!$G$41,5)","v":0},{"$f":"ROUND(PAGE5!$I$41,5)","v":0}]
[{"$f":"$C$1&\".E30A.REM.ADJ.PVFIN.DISB._INT.4.1_5_PERCT.\"","v":{"$error":"#N/A"}},{"$f":"ROUND(PAGE5!$K$41,5)","v":0},{"$f":"ROUND(PAGE5!$M$41,5)","v":0}]
[{"$f":"$C$1&\".E30A.REM.PVFIN.DISB._INT.4.1_5_PERCT.TTL.\"","v":{"$error":"#N/A"}},{"$f":"ROUND(PAGE5!$P$41,5)","v":0},{"$f":"ROUND(PAGE5!$R$41,5)","v":0}]
[{"$f":"$C$1&\".E30A.REM.FR.PVFIN.DISB._INT.5.1_6_PERCT.\"","v":{"$error":"#N/A"}},{"$f":"ROUND(PAGE5!$C$42,5)","v":0},{"$f":"ROUND(PAGE5!$E$42,5)","v":0}]
[{"$f":"$C$1&\".E30A.REM.VAR.PVFIN.DISB._INT.5.1_6_PERCT.\"","v":{"$error":"#N/A"}},{"$f":"ROUND(PAGE5!$G$42,5)","v":0},{"$f":"ROUND(PAGE5!$I$42,5)","v":0}]
[{"$f":"$C$1&\".E30A.REM.ADJ.PVFIN.DISB._INT.5.1_6_PERCT.\"","v":{"$error":"#N/A"}},{"$f":"ROUND(PAGE5!$K$42,5)","v":0},{"$f":"ROUND(PAGE5!$M$42,5)","v":0}]
[{"$f":"$C$1&\".E30A.REM.PVFIN.DISB._INT.5.1_6_PERCT.TTL.\"","v":{"$error":"#N/A"}},{"$f":"ROUND(PAGE5!$P$42,5)","v":0},{"$f":"ROUND(PAGE5!$R$42,5)","v":0}]
[{"$f":"$C$1&\".E30A.REM.FR.PVFIN.DISB._INT.6.1_7_PERCT.\"","v":{"$error":"#N/A"}},{"$f":"ROUND(PAGE5!$C$43,5)","v":0},{"$f":"ROUND(PAGE5!$E$43,5)","v":0}]
[{"$f":"$C$1&\".E30A.REM.VAR.PVFIN.DISB._INT.6.1_7_PERCT.\"","v":{"$error":"#N/A"}},{"$f":"ROUND(PAGE5!$G$43,5)","v":0},{"$f":"ROUND(PAGE5!$I$43,5)","v":0}]
[{"$f":"$C$1&\".E30A.REM.ADJ.PVFIN.DISB._INT.6.1_7_PERCT.\"","v":{"$error":"#N/A"}},{"$f":"ROUND(PAGE5!$K$43,5)","v":0},{"$f":"ROUND(PAGE5!$M$43,5)","v":0}]
[{"$f":"$C$1&\".E30A.REM.PVFIN.DISB._INT.6.1_7_PERCT.TTL.\"","v":{"$error":"#N/A"}},{"$f":"ROUND(PAGE5!$P$43,5)","v":0},{"$f":"ROUND(PAGE5!$R$43,5)","v":0}]
[{"$f":"$C$1&\".E30A.REM.FR.PVFIN.DISB._INT.7.1_8_PERCT.\"","v":{"$error":"#N/A"}},{"$f":"ROUND(PAGE5!$C$44,5)","v":0},{"$f":"ROUND(PAGE5!$E$44,5)","v":0}]
[{"$f":"$C$1&\".E30A.REM.VAR.PVFIN.DISB._INT.7.1_8_PERCT.\"","v":{"$error":"#N/A"}},{"$f":"ROUND(PAGE5!$G$44,5)","v":0},{"$f":"ROUND(PAGE5!$I$44,5)","v":0}]
[{"$f":"$C$1&\".E30A.REM.ADJ.PVFIN.DISB._INT.7.1_8_PERCT.\"","v":{"$error":"#N/A"}},{"$f":"ROUND(PAGE5!$K$44,5)","v":0},{"$f":"ROUND(PAGE5!$M$44,5)","v":0}]
[{"$f":"$C$1&\".E30A.REM.PVFIN.DISB._INT.7.1_8_PERCT.TTL.\"","v":{"$error":"#N/A"}},{"$f":"ROUND(PAGE5!$P$44,5)","v":0},{"$f":"ROUND(PAGE5!$R$44,5)","v":0}]
[{"$f":"$C$1&\".E30A.REM.FR.PVFIN.DISB._INT.8.1_9_PERCT.\"","v":{"$error":"#N/A"}},{"$f":"ROUND(PAGE5!$C$45,5)","v":0},{"$f":"ROUND(PAGE5!$E$45,5)","v":0}]
[{"$f":"$C$1&\".E30A.REM.VAR.PVFIN.DISB._INT.8.1_9_PERCT.\"","v":{"$error":"#N/A"}},{"$f":"ROUND(PAGE5!$G$45,5)","v":0},{"$f":"ROUND(PAGE5!$I$45,5)","v":0}]
[{"$f":"$C$1&\".E30A.REM.ADJ.PVFIN.DISB._INT.8.1_9_PERCT.\"","v":{"$error":"#N/A"}},{"$f":"ROUND(PAGE5!$K$45,5)","v":0},{"$f":"ROUND(PAGE5!$M$45,5)","v":0}]
[{"$f":"$C$1&\".E30A.REM.PVFIN.DISB._INT.8.1_9_PERCT.TTL.\"","v":{"$error":"#N/A"}},{"$f":"ROUND(PAGE5!$P$45,5)","v":0},{"$f":"ROUND(PAGE5!$R$45,5)","v":0}]
[{"$f":"$C$1&\".E30A.REM.FR.PVFIN.DISB._INT.9.1_10_PERCT.\"","v":{"$error":"#N/A"}},{"$f":"ROUND(PAGE5!$C$46,5)","v":0},{"$f":"ROUND(PAGE5!$E$46,5)","v":0}]
[{"$f":"$C$1&\".E30A.REM.VAR.PVFIN.DISB._INT.9.1_10_PERCT.\"","v":{"$error":"#N/A"}},{"$f":"ROUND(PAGE5!$G$46,5)","v":0},{"$f":"ROUND(PAGE5!$I$46,5)","v":0}]
[{"$f":"$C$1&\".E30A.REM.ADJ.PVFIN.DISB._INT.9.1_10_PERCT.\"","v":{"$error":"#N/A"}},{"$f":"ROUND(PAGE5!$K$46,5)","v":0},{"$f":"ROUND(PAGE5!$M$46,5)","v":0}]
[{"$f":"$C$1&\".E30A.REM.PVFIN.DISB._INT.9.1_10_PERCT.TTL.\"","v":{"$error":"#N/A"}},{"$f":"ROUND(PAGE5!$P$46,5)","v":0},{"$f":"ROUND(PAGE5!$R$46,5)","v":0}]
[{"$f":"$C$1&\".E30A.REM.FR.PVFIN.DISB._INT.10.1_11_PERCT.\"","v":{"$error":"#N/A"}},{"$f":"ROUND(PAGE5!$C$47,5)","v":0},{"$f":"ROUND(PAGE5!$E$47,5)","v":0}]
[{"$f":"$C$1&\".E30A.REM.VAR.PVFIN.DISB._INT.10.1_11_PERCT.\"","v":{"$error":"#N/A"}},{"$f":"ROUND(PAGE5!$G$47,5)","v":0},{"$f":"ROUND(PAGE5!$I$47,5)","v":0}]
[{"$f":"$C$1&\".E30A.REM.ADJ.PVFIN.DISB._INT.10.1_11_PERCT.\"","v":{"$error":"#N/A"}},{"$f":"ROUND(PAGE5!$K$47,5)","v":0},{"$f":"ROUND(PAGE5!$M$47,5)","v":0}]
[{"$f":"$C$1&\".E30A.REM.PVFIN.DISB._INT.10.1_11_PERCT.TTL.\"","v":{"$error":"#N/A"}},{"$f":"ROUND(PAGE5!$P$47,5)","v":0},{"$f":"ROUND(PAGE5!$R$47,5)","v":0}]
[{"$f":"$C$1&\".E30A.REM.FR.PVFIN.DISB._INT.11.1_12_PERCT.\"","v":{"$error":"#N/A"}},{"$f":"ROUND(PAGE5!$C$48,5)","v":0},{"$f":"ROUND(PAGE5!$E$48,5)","v":0}]
[{"$f":"$C$1&\".E30A.REM.VAR.PVFIN.DISB._INT.11.1_12_PERCT.\"","v":{"$error":"#N/A"}},{"$f":"ROUND(PAGE5!$G$48,5)","v":0},{"$f":"ROUND(PAGE5!$I$48,5)","v":0}]
[{"$f":"$C$1&\".E30A.REM.ADJ.PVFIN.DISB._INT.11.1_12_PERCT.\"","v":{"$error":"#N/A"}},{"$f":"ROUND(PAGE5!$K$48,5)","v":0},{"$f":"ROUND(PAGE5!$M$48,5)","v":0}]
[{"$f":"$C$1&\".E30A.REM.PVFIN.DISB._INT.11.1_12_PERCT.TTL.\"","v":{"$error":"#N/A"}},{"$f":"ROUND(PAGE5!$P$48,5)","v":0},{"$f":"ROUND(PAGE5!$R$48,5)","v":0}]
[{"$f":"$C$1&\".E30A.REM.FR.PVFIN.DISB._INT.12.1_13_PERCT.\"","v":{"$error":"#N/A"}},{"$f":"ROUND(PAGE5!$C$49,5)","v":0},{"$f":"ROUND(PAGE5!$E$49,5)","v":0}]
[{"$f":"$C$1&\".E30A.REM.VAR.PVFIN.DISB._INT.12.1_13_PERCT.\"","v":{"$error":"#N/A"}},{"$f":"ROUND(PAGE5!$G$49,5)","v":0},{"$f":"ROUND(PAGE5!$I$49,5)","v":0}]
[{"$f":"$C$1&\".E30A.REM.ADJ.PVFIN.DISB._INT.12.1_13_PERCT.\"","v":{"$error":"#N/A"}},{"$f":"ROUND(PAGE5!$K$49,5)","v":0},{"$f":"ROUND(PAGE5!$M$49,5)","v":0}]
[{"$f":"$C$1&\".E30A.REM.PVFIN.DISB._INT.12.1_13_PERCT.TTL.\"","v":{"$error":"#N/A"}},{"$f":"ROUND(PAGE5!$P$49,5)","v":0},{"$f":"ROUND(PAGE5!$R$49,5)","v":0}]
[{"$f":"$C$1&\".E30A.REM.FR.PVFIN.DISB._INT.13.1_14_PERCT.\"","v":{"$error":"#N/A"}},{"$f":"ROUND(PAGE5!$C$50,5)","v":0},{"$f":"ROUND(PAGE5!$E$50,5)","v":0}]
[{"$f":"$C$1&\".E30A.REM.VAR.PVFIN.DISB._INT.13.1_14_PERCT.\"","v":{"$error":"#N/A"}},{"$f":"ROUND(PAGE5!$G$50,5)","v":0},{"$f":"ROUND(PAGE5!$I$50,5)","v":0}]
[{"$f":"$C$1&\".E30A.REM.ADJ.PVFIN.DISB._INT.13.1_14_PERCT.\"","v":{"$error":"#N/A"}},{"$f":"ROUND(PAGE5!$K$50,5)","v":0},{"$f":"ROUND(PAGE5!$M$50,5)","v":0}]
[{"$f":"$C$1&\".E30A.REM.PVFIN.DISB._INT.13.1_14_PERCT.TTL.\"","v":{"$error":"#N/A"}},{"$f":"ROUND(PAGE5!$P$50,5)","v":0},{"$f":"ROUND(PAGE5!$R$50,5)","v":0}]
[{"$f":"$C$1&\".E30A.REM.FR.PVFIN.DISB._INT.14.1_15_PERCT.\"","v":{"$error":"#N/A"}},{"$f":"ROUND(PAGE5!$C$51,5)","v":0},{"$f":"ROUND(PAGE5!$E$51,5)","v":0}]
[{"$f":"$C$1&\".E30A.REM.VAR.PVFIN.DISB._INT.14.1_15_PERCT.\"","v":{"$error":"#N/A"}},{"$f":"ROUND(PAGE5!$G$51,5)","v":0},{"$f":"ROUND(PAGE5!$I$51,5)","v":0}]
[{"$f":"$C$1&\".E30A.REM.ADJ.PVFIN.DISB._INT.14.1_15_PERCT.\"","v":{"$error":"#N/A"}},{"$f":"ROUND(PAGE5!$K$51,5)","v":0},{"$f":"ROUND(PAGE5!$M$51,5)","v":0}]
[{"$f":"$C$1&\".E30A.REM.PVFIN.DISB._INT.14.1_15_PERCT.TTL.\"","v":{"$error":"#N/A"}},{"$f":"ROUND(PAGE5!$P$51,5)","v":0},{"$f":"ROUND(PAGE5!$R$51,5)","v":0}]
[{"$f":"$C$1&\".E30A.REM.FR.PVFIN.DISB._INT.OVR_15.1_PERCT.\"","v":{"$error":"#N/A"}},{"$f":"ROUND(PAGE5!$C$52,5)","v":0},{"$f":"ROUND(PAGE5!$E$52,5)","v":0}]
[{"$f":"$C$1&\".E30A.REM.VAR.PVFIN.DISB._INT.OVR_15.1_PERCT.\"","v":{"$error":"#N/A"}},{"$f":"ROUND(PAGE5!$G$52,5)","v":0},{"$f":"ROUND(PAGE5!$I$52,5)","v":0}]
[{"$f":"$C$1&\".E30A.REM.ADJ.PVFIN.DISB._INT.OVR_15.1_PERCT.\"","v":{"$error":"#N/A"}},{"$f":"ROUND(PAGE5!$K$52,5)","v":0},{"$f":"ROUND(PAGE5!$M$52,5)","v":0}]
[{"$f":"$C$1&\".E30A.REM.PVFIN.DISB._INT.OVR_15.1_PERCT.TTL.\"","v":{"$error":"#N/A"}},{"$f":"ROUND(PAGE5!$P$52,5)","v":0},{"$f":"ROUND(PAGE5!$R$52,5)","v":0}]
[{"$f":"$C$1&\".E30A.REM.FR.IBUS.DISB._INT.0_3_PERCT.\"","v":{"$error":"#N/A"}},{"$f":"ROUND(PAGE5!$C$58,5)","v":0},{"$f":"ROUND(PAGE5!$E$58,5)","v":0}]
[{"$f":"$C$1&\".E30A.REM.VAR.IBUS.DISB._INT.0_3_PERCT.\"","v":{"$error":"#N/A"}},{"$f":"ROUND(PAGE5!$G$58,5)","v":0},{"$f":"ROUND(PAGE5!$I$58,5)","v":0}]
[{"$f":"$C$1&\".E30A.REM.ADJ.IBUS.DISB._INT.0_3_PERCT.\"","v":{"$error":"#N/A"}},{"$f":"ROUND(PAGE5!$K$58,5)","v":0},{"$f":"ROUND(PAGE5!$M$58,5)","v":0}]
[{"$f":"$C$1&\".E30A.REM.IBUS.DISB._INT.0_3_PERCT.TTL.\"","v":{"$error":"#N/A"}},{"$f":"ROUND(PAGE5!$P$58,5)","v":0},{"$f":"ROUND(PAGE5!$R$58,5)","v":0}]
[{"$f":"$C$1&\".E30A.REM.FR.IBUS.DISB._INT.3.1_4_PERCT.\"","v":{"$error":"#N/A"}},{"$f":"ROUND(PAGE5!$C$59,5)","v":0},{"$f":"ROUND(PAGE5!$E$59,5)","v":0}]
[{"$f":"$C$1&\".E30A.REM.VAR.IBUS.DISB._INT.3.1_4_PERCT.\"","v":{"$error":"#N/A"}},{"$f":"ROUND(PAGE5!$G$59,5)","v":0},{"$f":"ROUND(PAGE5!$I$59,5)","v":0}]
[{"$f":"$C$1&\".E30A.REM.ADJ.IBUS.DISB._INT.3.1_4_PERCT.\"","v":{"$error":"#N/A"}},{"$f":"ROUND(PAGE5!$K$59,5)","v":0},{"$f":"ROUND(PAGE5!$M$59,5)","v":0}]
[{"$f":"$C$1&\".E30A.REM.IBUS.DISB._INT.3.1_4_PERCT.TTL.\"","v":{"$error":"#N/A"}},{"$f":"ROUND(PAGE5!$P$59,5)","v":0},{"$f":"ROUND(PAGE5!$R$59,5)","v":0}]
[{"$f":"$C$1&\".E30A.REM.FR.IBUS.DISB._INT.4.1_5_PERCT.\"","v":{"$error":"#N/A"}},{"$f":"ROUND(PAGE5!$C$60,5)","v":0},{"$f":"ROUND(PAGE5!$E$60,5)","v":0}]
[{"$f":"$C$1&\".E30A.REM.VAR.IBUS.DISB._INT.4.1_5_PERCT.\"","v":{"$error":"#N/A"}},{"$f":"ROUND(PAGE5!$G$60,5)","v":0},{"$f":"ROUND(PAGE5!$I$60,5)","v":0}]
[{"$f":"$C$1&\".E30A.REM.ADJ.IBUS.DISB._INT.4.1_5_PERCT.\"","v":{"$error":"#N/A"}},{"$f":"ROUND(PAGE5!$K$60,5)","v":0},{"$f":"ROUND(PAGE5!$M$60,5)","v":0}]
[{"$f":"$C$1&\".E30A.REM.IBUS.DISB._INT.4.1_5_PERCT.TTL.\"","v":{"$error":"#N/A"}},{"$f":"ROUND(PAGE5!$P$60,5)","v":0},{"$f":"ROUND(PAGE5!$R$60,5)","v":0}]
[{"$f":"$C$1&\".E30A.REM.FR.IBUS.DISB._INT.5.1_6_PERCT.\"","v":{"$error":"#N/A"}},{"$f":"ROUND(PAGE5!$C$61,5)","v":0},{"$f":"ROUND(PAGE5!$E$61,5)","v":0}]
[{"$f":"$C$1&\".E30A.REM.VAR.IBUS.DISB._INT.5.1_6_PERCT.\"","v":{"$error":"#N/A"}},{"$f":"ROUND(PAGE5!$G$61,5)","v":0},{"$f":"ROUND(PAGE5!$I$61,5)","v":0}]
[{"$f":"$C$1&\".E30A.REM.ADJ.IBUS.DISB._INT.5.1_6_PERCT.\"","v":{"$error":"#N/A"}},{"$f":"ROUND(PAGE5!$K$61,5)","v":0},{"$f":"ROUND(PAGE5!$M$61,5)","v":0}]
[{"$f":"$C$1&\".E30A.REM.IBUS.DISB._INT.5.1_6_PERCT.TTL.\"","v":{"$error":"#N/A"}},{"$f":"ROUND(PAGE5!$P$61,5)","v":0},{"$f":"ROUND(PAGE5!$R$61,5)","v":0}]
[{"$f":"$C$1&\".E30A.REM.FR.IBUS.DISB._INT.6.1_7_PERCT.\"","v":{"$error":"#N/A"}},{"$f":"ROUND(PAGE5!$C$62,5)","v":0},{"$f":"ROUND(PAGE5!$E$62,5)","v":0}]
[{"$f":"$C$1&\".E30A.REM.VAR.IBUS.DISB._INT.6.1_7_PERCT.\"","v":{"$error":"#N/A"}},{"$f":"ROUND(PAGE5!$G$62,5)","v":0},{"$f":"ROUND(PAGE5!$I$62,5)","v":0}]
[{"$f":"$C$1&\".E30A.REM.ADJ.IBUS.DISB._INT.6.1_7_PERCT.\"","v":{"$error":"#N/A"}},{"$f":"ROUND(PAGE5!$K$62,5)","v":0},{"$f":"ROUND(PAGE5!$M$62,5)","v":0}]
[{"$f":"$C$1&\".E30A.REM.IBUS.DISB._INT.6.1_7_PERCT.TTL.\"","v":{"$error":"#N/A"}},{"$f":"ROUND(PAGE5!$P$62,5)","v":0},{"$f":"ROUND(PAGE5!$R$62,5)","v":0}]
[{"$f":"$C$1&\".E30A.REM.FR.IBUS.DISB._INT.7.1_8_PERCT.\"","v":{"$error":"#N/A"}},{"$f":"ROUND(PAGE5!$C$63,5)","v":0},{"$f":"ROUND(PAGE5!$E$63,5)","v":0}]
[{"$f":"$C$1&\".E30A.REM.VAR.IBUS.DISB._INT.7.1_8_PERCT.\"","v":{"$error":"#N/A"}},{"$f":"ROUND(PAGE5!$G$63,5)","v":0},{"$f":"ROUND(PAGE5!$I$63,5)","v":0}]
[{"$f":"$C$1&\".E30A.REM.ADJ.IBUS.DISB._INT.7.1_8_PERCT.\"","v":{"$error":"#N/A"}},{"$f":"ROUND(PAGE5!$K$63,5)","v":0},{"$f":"ROUND(PAGE5!$M$63,5)","v":0}]
[{"$f":"$C$1&\".E30A.REM.IBUS.DISB._INT.7.1_8_PERCT.TTL.\"","v":{"$error":"#N/A"}},{"$f":"ROUND(PAGE5!$P$63,5)","v":0},{"$f":"ROUND(PAGE5!$R$63,5)","v":0}]
[{"$f":"$C$1&\".E30A.REM.FR.IBUS.DISB._INT.8.1_9_PERCT.\"","v":{"$error":"#N/A"}},{"$f":"ROUND(PAGE5!$C$64,5)","v":0},{"$f":"ROUND(PAGE5!$E$64,5)","v":0}]
[{"$f":"$C$1&\".E30A.REM.VAR.IBUS.DISB._INT.8.1_9_PERCT.\"","v":{"$error":"#N/A"}},{"$f":"ROUND(PAGE5!$G$64,5)","v":0},{"$f":"ROUND(PAGE5!$I$64,5)","v":0}]
[{"$f":"$C$1&\".E30A.REM.ADJ.IBUS.DISB._INT.8.1_9_PERCT.\"","v":{"$error":"#N/A"}},{"$f":"ROUND(PAGE5!$K$64,5)","v":0},{"$f":"ROUND(PAGE5!$M$64,5)","v":0}]
[{"$f":"$C$1&\".E30A.REM.IBUS.DISB._INT.8.1_9_PERCT.TTL.\"","v":{"$error":"#N/A"}},{"$f":"ROUND(PAGE5!$P$64,5)","v":0},{"$f":"ROUND(PAGE5!$R$64,5)","v":0}]
[{"$f":"$C$1&\".E30A.REM.FR.IBUS.DISB._INT.9.1_10_PERCT.\"","v":{"$error":"#N/A"}},{"$f":"ROUND(PAGE5!$C$65,5)","v":0},{"$f":"ROUND(PAGE5!$E$65,5)","v":0}]
[{"$f":"$C$1&\".E30A.REM.VAR.IBUS.DISB._INT.9.1_10_PERCT.\"","v":{"$error":"#N/A"}},{"$f":"ROUND(PAGE5!$G$65,5)","v":0},{"$f":"ROUND(PAGE5!$I$65,5)","v":0}]
[{"$f":"$C$1&\".E30A.REM.ADJ.IBUS.DISB._INT.9.1_10_PERCT.\"","v":{"$error":"#N/A"}},{"$f":"ROUND(PAGE5!$K$65,5)","v":0},{"$f":"ROUND(PAGE5!$M$65,5)","v":0}]
[{"$f":"$C$1&\".E30A.REM.IBUS.DISB._INT.9.1_10_PERCT.TTL.\"","v":{"$error":"#N/A"}},{"$f":"ROUND(PAGE5!$P$65,5)","v":0},{"$f":"ROUND(PAGE5!$R$65,5)","v":0}]
[{"$f":"$C$1&\".E30A.REM.FR.IBUS.DISB._INT.10.1_11_PERCT.\"","v":{"$error":"#N/A"}},{"$f":"ROUND(PAGE5!$C$66,5)","v":0},{"$f":"ROUND(PAGE5!$E$66,5)","v":0}]
[{"$f":"$C$1&\".E30A.REM.VAR.IBUS.DISB._INT.10.1_11_PERCT.\"","v":{"$error":"#N/A"}},{"$f":"ROUND(PAGE5!$G$66,5)","v":0},{"$f":"ROUND(PAGE5!$I$66,5)","v":0}]
[{"$f":"$C$1&\".E30A.REM.ADJ.IBUS.DISB._INT.10.1_11_PERCT.\"","v":{"$error":"#N/A"}},{"$f":"ROUND(PAGE5!$K$66,5)","v":0},{"$f":"ROUND(PAGE5!$M$66,5)","v":0}]
[{"$f":"$C$1&\".E30A.REM.IBUS.DISB._INT.10.1_11_PERCT.TTL.\"","v":{"$error":"#N/A"}},{"$f":"ROUND(PAGE5!$P$66,5)","v":0},{"$f":"ROUND(PAGE5!$R$66,5)","v":0}]
[{"$f":"$C$1&\".E30A.REM.FR.IBUS.DISB._INT.11.1_12_PERCT.\"","v":{"$error":"#N/A"}},{"$f":"ROUND(PAGE5!$C$67,5)","v":0},{"$f":"ROUND(PAGE5!$E$67,5)","v":0}]
[{"$f":"$C$1&\".E30A.REM.VAR.IBUS.DISB._INT.11.1_12_PERCT.\"","v":{"$error":"#N/A"}},{"$f":"ROUND(PAGE5!$G$67,5)","v":0},{"$f":"ROUND(PAGE5!$I$67,5)","v":0}]
[{"$f":"$C$1&\".E30A.REM.ADJ.IBUS.DISB._INT.11.1_12_PERCT.\"","v":{"$error":"#N/A"}},{"$f":"ROUND(PAGE5!$K$67,5)","v":0},{"$f":"ROUND(PAGE5!$M$67,5)","v":0}]
[{"$f":"$C$1&\".E30A.REM.IBUS.DISB._INT.11.1_12_PERCT.TTL.\"","v":{"$error":"#N/A"}},{"$f":"ROUND(PAGE5!$P$67,5)","v":0},{"$f":"ROUND(PAGE5!$R$67,5)","v":0}]
[{"$f":"$C$1&\".E30A.REM.FR.IBUS.DISB._INT.12.1_13_PERCT.\"","v":{"$error":"#N/A"}},{"$f":"ROUND(PAGE5!$C$68,5)","v":0},{"$f":"ROUND(PAGE5!$E$68,5)","v":0}]
[{"$f":"$C$1&\".E30A.REM.VAR.IBUS.DISB._INT.12.1_13_PERCT.\"","v":{"$error":"#N/A"}},{"$f":"ROUND(PAGE5!$G$68,5)","v":0},{"$f":"ROUND(PAGE5!$I$68,5)","v":0}]
[{"$f":"$C$1&\".E30A.REM.ADJ.IBUS.DISB._INT.12.1_13_PERCT.\"","v":{"$error":"#N/A"}},{"$f":"ROUND(PAGE5!$K$68,5)","v":0},{"$f":"ROUND(PAGE5!$M$68,5)","v":0}]
[{"$f":"$C$1&\".E30A.REM.IBUS.DISB._INT.12.1_13_PERCT.TTL.\"","v":{"$error":"#N/A"}},{"$f":"ROUND(PAGE5!$P$68,5)","v":0},{"$f":"ROUND(PAGE5!$R$68,5)","v":0}]
[{"$f":"$C$1&\".E30A.REM.FR.IBUS.DISB._INT.13.1_14_PERCT.\"","v":{"$error":"#N/A"}},{"$f":"ROUND(PAGE5!$C$69,5)","v":0},{"$f":"ROUND(PAGE5!$E$69,5)","v":0}]
[{"$f":"$C$1&\".E30A.REM.VAR.IBUS.DISB._INT.13.1_14_PERCT.\"","v":{"$error":"#N/A"}},{"$f":"ROUND(PAGE5!$G$69,5)","v":0},{"$f":"ROUND(PAGE5!$I$69,5)","v":0}]
[{"$f":"$C$1&\".E30A.REM.ADJ.IBUS.DISB._INT.13.1_14_PERCT.\"","v":{"$error":"#N/A"}},{"$f":"ROUND(PAGE5!$K$69,5)","v":0},{"$f":"ROUND(PAGE5!$M$69,5)","v":0}]
[{"$f":"$C$1&\".E30A.REM.IBUS.DISB._INT.13.1_14_PERCT.TTL.\"","v":{"$error":"#N/A"}},{"$f":"ROUND(PAGE5!$P$69,5)","v":0},{"$f":"ROUND(PAGE5!$R$69,5)","v":0}]
[{"$f":"$C$1&\".E30A.REM.FR.IBUS.DISB._INT.14.1_15_PERCT.\"","v":{"$error":"#N/A"}},{"$f":"ROUND(PAGE5!$C$70,5)","v":0},{"$f":"ROUND(PAGE5!$E$70,5)","v":0}]
[{"$f":"$C$1&\".E30A.REM.VAR.IBUS.DISB._INT.14.1_15_PERCT.\"","v":{"$error":"#N/A"}},{"$f":"ROUND(PAGE5!$G$70,5)","v":0},{"$f":"ROUND(PAGE5!$I$70,5)","v":0}]
[{"$f":"$C$1&\".E30A.REM.ADJ.IBUS.DISB._INT.14.1_15_PERCT.\"","v":{"$error":"#N/A"}},{"$f":"ROUND(PAGE5!$K$70,5)","v":0},{"$f":"ROUND(PAGE5!$M$70,5)","v":0}]
[{"$f":"$C$1&\".E30A.REM.IBUS.DISB._INT.14.1_15_PERCT.TTL.\"","v":{"$error":"#N/A"}},{"$f":"ROUND(PAGE5!$P$70,5)","v":0},{"$f":"ROUND(PAGE5!$R$70,5)","v":0}]
[{"$f":"$C$1&\".E30A.REM.FR.IBUS.DISB._INT.OVR_15.1_PERCT.\"","v":{"$error":"#N/A"}},{"$f":"ROUND(PAGE5!$C$71,5)","v":0},{"$f":"ROUND(PAGE5!$E$71,5)","v":0}]
[{"$f":"$C$1&\".E30A.REM.VAR.IBUS.DISB._INT.OVR_15.1_PERCT.\"","v":{"$error":"#N/A"}},{"$f":"ROUND(PAGE5!$G$71,5)","v":0},{"$f":"ROUND(PAGE5!$I$71,5)","v":0}]
[{"$f":"$C$1&\".E30A.REM.ADJ.IBUS.DISB._INT.OVR_15.1_PERCT.\"","v":{"$error":"#N/A"}},{"$f":"ROUND(PAGE5!$K$71,5)","v":0},{"$f":"ROUND(PAGE5!$M$71,5)","v":0}]
[{"$f":"$C$1&\".E30A.REM.IBUS.DISB._INT.OVR_15.1_PERCT.TTL.\"","v":{"$error":"#N/A"}},{"$f":"ROUND(PAGE5!$P$71,5)","v":0},{"$f":"ROUND(PAGE5!$R$71,5)","v":0}]
[{"$f":"$C$1&\".E30A.REM.FR.UIBUS.DISB._INT.0_3_PERCT.\"","v":{"$error":"#N/A"}},{"$f":"ROUND(PAGE5!$C$77,5)","v":0},{"$f":"ROUND(PAGE5!$E$77,5)","v":0}]
[{"$f":"$C$1&\".E30A.REM.VAR.UIBUS.DISB._INT.0_3_PERCT.\"","v":{"$error":"#N/A"}},{"$f":"ROUND(PAGE5!$G$77,5)","v":0},{"$f":"ROUND(PAGE5!$I$77,5)","v":0}]
[{"$f":"$C$1&\".E30A.REM.ADJ.UIBUS.DISB._INT.0_3_PERCT.\"","v":{"$error":"#N/A"}},{"$f":"ROUND(PAGE5!$K$77,5)","v":0},{"$f":"ROUND(PAGE5!$M$77,5)","v":0}]
[{"$f":"$C$1&\".E30A.REM.UIBUS.DISB._INT.0_3_PERCT.TTL.\"","v":{"$error":"#N/A"}},{"$f":"ROUND(PAGE5!$P$77,5)","v":0},{"$f":"ROUND(PAGE5!$R$77,5)","v":0}]
[{"$f":"$C$1&\".E30A.REM.FR.UIBUS.DISB._INT.3.1_4_PERCT.\"","v":{"$error":"#N/A"}},{"$f":"ROUND(PAGE5!$C$78,5)","v":0},{"$f":"ROUND(PAGE5!$E$78,5)","v":0}]
[{"$f":"$C$1&\".E30A.REM.VAR.UIBUS.DISB._INT.3.1_4_PERCT.\"","v":{"$error":"#N/A"}},{"$f":"ROUND(PAGE5!$G$78,5)","v":0},{"$f":"ROUND(PAGE5!$I$78,5)","v":0}]
[{"$f":"$C$1&\".E30A.REM.ADJ.UIBUS.DISB._INT.3.1_4_PERCT.\"","v":{"$error":"#N/A"}},{"$f":"ROUND(PAGE5!$K$78,5)","v":0},{"$f":"ROUND(PAGE5!$M$78,5)","v":0}]
[{"$f":"$C$1&\".E30A.REM.UIBUS.DISB._INT.3.1_4_PERCT.TTL.\"","v":{"$error":"#N/A"}},{"$f":"ROUND(PAGE5!$P$78,5)","v":0},{"$f":"ROUND(PAGE5!$R$78,5)","v":0}]
[{"$f":"$C$1&\".E30A.REM.FR.UIBUS.DISB._INT.4.1_5_PERCT.\"","v":{"$error":"#N/A"}},{"$f":"ROUND(PAGE5!$C$79,5)","v":0},{"$f":"ROUND(PAGE5!$E$79,5)","v":0}]
[{"$f":"$C$1&\".E30A.REM.VAR.UIBUS.DISB._INT.4.1_5_PERCT.\"","v":{"$error":"#N/A"}},{"$f":"ROUND(PAGE5!$G$79,5)","v":0},{"$f":"ROUND(PAGE5!$I$79,5)","v":0}]
[{"$f":"$C$1&\".E30A.REM.ADJ.UIBUS.DISB._INT.4.1_5_PERCT.\"","v":{"$error":"#N/A"}},{"$f":"ROUND(PAGE5!$K$79,5)","v":0},{"$f":"ROUND(PAGE5!$M$79,5)","v":0}]
[{"$f":"$C$1&\".E30A.REM.UIBUS.DISB._INT.4.1_5_PERCT.TTL.\"","v":{"$error":"#N/A"}},{"$f":"ROUND(PAGE5!$P$79,5)","v":0},{"$f":"ROUND(PAGE5!$R$79,5)","v":0}]
[{"$f":"$C$1&\".E30A.REM.FR.UIBUS.DISB._INT.5.1_6_PERCT.\"","v":{"$error":"#N/A"}},{"$f":"ROUND(PAGE5!$C$80,5)","v":0},{"$f":"ROUND(PAGE5!$E$80,5)","v":0}]
[{"$f":"$C$1&\".E30A.REM.VAR.UIBUS.DISB._INT.5.1_6_PERCT.\"","v":{"$error":"#N/A"}},{"$f":"ROUND(PAGE5!$G$80,5)","v":0},{"$f":"ROUND(PAGE5!$I$80,5)","v":0}]
[{"$f":"$C$1&\".E30A.REM.ADJ.UIBUS.DISB._INT.5.1_6_PERCT.\"","v":{"$error":"#N/A"}},{"$f":"ROUND(PAGE5!$K$80,5)","v":0},{"$f":"ROUND(PAGE5!$M$80,5)","v":0}]
[{"$f":"$C$1&\".E30A.REM.UIBUS.DISB._INT.5.1_6_PERCT.TTL.\"","v":{"$error":"#N/A"}},{"$f":"ROUND(PAGE5!$P$80,5)","v":0},{"$f":"ROUND(PAGE5!$R$80,5)","v":0}]
[{"$f":"$C$1&\".E30A.REM.FR.UIBUS.DISB._INT.6.1_7_PERCT.\"","v":{"$error":"#N/A"}},{"$f":"ROUND(PAGE5!$C$81,5)","v":0},{"$f":"ROUND(PAGE5!$E$81,5)","v":0}]
[{"$f":"$C$1&\".E30A.REM.VAR.UIBUS.DISB._INT.6.1_7_PERCT.\"","v":{"$error":"#N/A"}},{"$f":"ROUND(PAGE5!$G$81,5)","v":0},{"$f":"ROUND(PAGE5!$I$81,5)","v":0}]
[{"$f":"$C$1&\".E30A.REM.ADJ.UIBUS.DISB._INT.6.1_7_PERCT.\"","v":{"$error":"#N/A"}},{"$f":"ROUND(PAGE5!$K$81,5)","v":0},{"$f":"ROUND(PAGE5!$M$81,5)","v":0}]
[{"$f":"$C$1&\".E30A.REM.UIBUS.DISB._INT.6.1_7_PERCT.TTL.\"","v":{"$error":"#N/A"}},{"$f":"ROUND(PAGE5!$P$81,5)","v":0},{"$f":"ROUND(PAGE5!$R$81,5)","v":0}]
[{"$f":"$C$1&\".E30A.REM.FR.UIBUS.DISB._INT.7.1_8_PERCT.\"","v":{"$error":"#N/A"}},{"$f":"ROUND(PAGE5!$C$82,5)","v":0},{"$f":"ROUND(PAGE5!$E$82,5)","v":0}]
[{"$f":"$C$1&\".E30A.REM.VAR.UIBUS.DISB._INT.7.1_8_PERCT.\"","v":{"$error":"#N/A"}},{"$f":"ROUND(PAGE5!$G$82,5)","v":0},{"$f":"ROUND(PAGE5!$I$82,5)","v":0}]
[{"$f":"$C$1&\".E30A.REM.ADJ.UIBUS.DISB._INT.7.1_8_PERCT.\"","v":{"$error":"#N/A"}},{"$f":"ROUND(PAGE5!$K$82,5)","v":0},{"$f":"ROUND(PAGE5!$M$82,5)","v":0}]
[{"$f":"$C$1&\".E30A.REM.UIBUS.DISB._INT.7.1_8_PERCT.TTL.\"","v":{"$error":"#N/A"}},{"$f":"ROUND(PAGE5!$P$82,5)","v":0},{"$f":"ROUND(PAGE5!$R$82,5)","v":0}]
[{"$f":"$C$1&\".E30A.REM.FR.UIBUS.DISB._INT.8.1_9_PERCT.\"","v":{"$error":"#N/A"}},{"$f":"ROUND(PAGE5!$C$83,5)","v":0},{"$f":"ROUND(PAGE5!$E$83,5)","v":0}]
[{"$f":"$C$1&\".E30A.REM.VAR.UIBUS.DISB._INT.8.1_9_PERCT.\"","v":{"$error":"#N/A"}},{"$f":"ROUND(PAGE5!$G$83,5)","v":0},{"$f":"ROUND(PAGE5!$I$83,5)","v":0}]
[{"$f":"$C$1&\".E30A.REM.ADJ.UIBUS.DISB._INT.8.1_9_PERCT.\"","v":{"$error":"#N/A"}},{"$f":"ROUND(PAGE5!$K$83,5)","v":0},{"$f":"ROUND(PAGE5!$M$83,5)","v":0}]
[{"$f":"$C$1&\".E30A.REM.UIBUS.DISB._INT.8.1_9_PERCT.TTL.\"","v":{"$error":"#N/A"}},{"$f":"ROUND(PAGE5!$P$83,5)","v":0},{"$f":"ROUND(PAGE5!$R$83,5)","v":0}]
[{"$f":"$C$1&\".E30A.REM.FR.UIBUS.DISB._INT.9.1_10_PERCT.\"","v":{"$error":"#N/A"}},{"$f":"ROUND(PAGE5!$C$84,5)","v":0},{"$f":"ROUND(PAGE5!$E$84,5)","v":0}]
[{"$f":"$C$1&\".E30A.REM.VAR.UIBUS.DISB._INT.9.1_10_PERCT.\"","v":{"$error":"#N/A"}},{"$f":"ROUND(PAGE5!$G$84,5)","v":0},{"$f":"ROUND(PAGE5!$I$84,5)","v":0}]
[{"$f":"$C$1&\".E30A.REM.ADJ.UIBUS.DISB._INT.9.1_10_PERCT.\"","v":{"$error":"#N/A"}},{"$f":"ROUND(PAGE5!$K$84,5)","v":0},{"$f":"ROUND(PAGE5!$M$84,5)","v":0}]
[{"$f":"$C$1&\".E30A.REM.UIBUS.DISB._INT.9.1_10_PERCT.TTL.\"","v":{"$error":"#N/A"}},{"$f":"ROUND(PAGE5!$P$84,5)","v":0},{"$f":"ROUND(PAGE5!$R$84,5)","v":0}]
[{"$f":"$C$1&\".E30A.REM.FR.UIBUS.DISB._INT.10.1_11_PERCT.\"","v":{"$error":"#N/A"}},{"$f":"ROUND(PAGE5!$C$85,5)","v":0},{"$f":"ROUND(PAGE5!$E$85,5)","v":0}]
[{"$f":"$C$1&\".E30A.REM.VAR.UIBUS.DISB._INT.10.1_11_PERCT.\"","v":{"$error":"#N/A"}},{"$f":"ROUND(PAGE5!$G$85,5)","v":0},{"$f":"ROUND(PAGE5!$I$85,5)","v":0}]
[{"$f":"$C$1&\".E30A.REM.ADJ.UIBUS.DISB._INT.10.1_11_PERCT.\"","v":{"$error":"#N/A"}},{"$f":"ROUND(PAGE5!$K$85,5)","v":0},{"$f":"ROUND(PAGE5!$M$85,5)","v":0}]
[{"$f":"$C$1&\".E30A.REM.UIBUS.DISB._INT.10.1_11_PERCT.TTL.\"","v":{"$error":"#N/A"}},{"$f":"ROUND(PAGE5!$P$85,5)","v":0},{"$f":"ROUND(PAGE5!$R$85,5)","v":0}]
[{"$f":"$C$1&\".E30A.REM.FR.UIBUS.DISB._INT.11.1_12_PERCT.\"","v":{"$error":"#N/A"}},{"$f":"ROUND(PAGE5!$C$86,5)","v":0},{"$f":"ROUND(PAGE5!$E$86,5)","v":0}]
[{"$f":"$C$1&\".E30A.REM.VAR.UIBUS.DISB._INT.11.1_12_PERCT.\"","v":{"$error":"#N/A"}},{"$f":"ROUND(PAGE5!$G$86,5)","v":0},{"$f":"ROUND(PAGE5!$I$86,5)","v":0}]
[{"$f":"$C$1&\".E30A.REM.ADJ.UIBUS.DISB._INT.11.1_12_PERCT.\"","v":{"$error":"#N/A"}},{"$f":"ROUND(PAGE5!$K$86,5)","v":0},{"$f":"ROUND(PAGE5!$M$86,5)","v":0}]
[{"$f":"$C$1&\".E30A.REM.UIBUS.DISB._INT.11.1_12_PERCT.TTL.\"","v":{"$error":"#N/A"}},{"$f":"ROUND(PAGE5!$P$86,5)","v":0},{"$f":"ROUND(PAGE5!$R$86,5)","v":0}]
[{"$f":"$C$1&\".E30A.REM.FR.UIBUS.DISB._INT.12.1_13_PERCT.\"","v":{"$error":"#N/A"}},{"$f":"ROUND(PAGE5!$C$87,5)","v":0},{"$f":"ROUND(PAGE5!$E$87,5)","v":0}]
[{"$f":"$C$1&\".E30A.REM.VAR.UIBUS.DISB._INT.12.1_13_PERCT.\"","v":{"$error":"#N/A"}},{"$f":"ROUND(PAGE5!$G$87,5)","v":0},{"$f":"ROUND(PAGE5!$I$87,5)","v":0}]
[{"$f":"$C$1&\".E30A.REM.ADJ.UIBUS.DISB._INT.12.1_13_PERCT.\"","v":{"$error":"#N/A"}},{"$f":"ROUND(PAGE5!$K$87,5)","v":0},{"$f":"ROUND(PAGE5!$M$87,5)","v":0}]
[{"$f":"$C$1&\".E30A.REM.UIBUS.DISB._INT.12.1_13_PERCT.TTL.\"","v":{"$error":"#N/A"}},{"$f":"ROUND(PAGE5!$P$87,5)","v":0},{"$f":"ROUND(PAGE5!$R$87,5)","v":0}]
[{"$f":"$C$1&\".E30A.REM.FR.UIBUS.DISB._INT.13.1_14_PERCT.\"","v":{"$error":"#N/A"}},{"$f":"ROUND(PAGE5!$C$88,5)","v":0},{"$f":"ROUND(PAGE5!$E$88,5)","v":0}]
[{"$f":"$C$1&\".E30A.REM.VAR.UIBUS.DISB._INT.13.1_14_PERCT.\"","v":{"$error":"#N/A"}},{"$f":"ROUND(PAGE5!$G$88,5)","v":0},{"$f":"ROUND(PAGE5!$I$88,5)","v":0}]
[{"$f":"$C$1&\".E30A.REM.ADJ.UIBUS.DISB._INT.13.1_14_PERCT.\"","v":{"$error":"#N/A"}},{"$f":"ROUND(PAGE5!$K$88,5)","v":0},{"$f":"ROUND(PAGE5!$M$88,5)","v":0}]
[{"$f":"$C$1&\".E30A.REM.UIBUS.DISB._INT.13.1_14_PERCT.TTL.\"","v":{"$error":"#N/A"}},{"$f":"ROUND(PAGE5!$P$88,5)","v":0},{"$f":"ROUND(PAGE5!$R$88,5)","v":0}]
[{"$f":"$C$1&\".E30A.REM.FR.UIBUS.DISB._INT.14.1_15_PERCT.\"","v":{"$error":"#N/A"}},{"$f":"ROUND(PAGE5!$C$89,5)","v":0},{"$f":"ROUND(PAGE5!$E$89,5)","v":0}]
[{"$f":"$C$1&\".E30A.REM.VAR.UIBUS.DISB._INT.14.1_15_PERCT.\"","v":{"$error":"#N/A"}},{"$f":"ROUND(PAGE5!$G$89,5)","v":0},{"$f":"ROUND(PAGE5!$I$89,5)","v":0}]
[{"$f":"$C$1&\".E30A.REM.ADJ.UIBUS.DISB._INT.14.1_15_PERCT.\"","v":{"$error":"#N/A"}},{"$f":"ROUND(PAGE5!$K$89,5)","v":0},{"$f":"ROUND(PAGE5!$M$89,5)","v":0}]
[{"$f":"$C$1&\".E30A.REM.UIBUS.DISB._INT.14.1_15_PERCT.TTL.\"","v":{"$error":"#N/A"}},{"$f":"ROUND(PAGE5!$P$89,5)","v":0},{"$f":"ROUND(PAGE5!$R$89,5)","v":0}]
[{"$f":"$C$1&\".E30A.REM.FR.UIBUS.DISB._INT.OVR_15.1_PERCT.\"","v":{"$error":"#N/A"}},{"$f":"ROUND(PAGE5!$C$90,5)","v":0},{"$f":"ROUND(PAGE5!$E$90,5)","v":0}]
[{"$f":"$C$1&\".E30A.REM.VAR.UIBUS.DISB._INT.OVR_15.1_PERCT.\"","v":{"$error":"#N/A"}},{"$f":"ROUND(PAGE5!$G$90,5)","v":0},{"$f":"ROUND(PAGE5!$I$90,5)","v":0}]
[{"$f":"$C$1&\".E30A.REM.ADJ.UIBUS.DISB._INT.OVR_15.1_PERCT.\"","v":{"$error":"#N/A"}},{"$f":"ROUND(PAGE5!$K$90,5)","v":0},{"$f":"ROUND(PAGE5!$M$90,5)","v":0}]
[{"$f":"$C$1&\".E30A.REM.UIBUS.DISB._INT.OVR_15.1_PERCT.TTL.\"","v":{"$error":"#N/A"}},{"$f":"ROUND(PAGE5!$P$90,5)","v":0},{"$f":"ROUND(PAGE5!$R$90,5)","v":0}]
[{"$f":"$C$1&\".E30A.REM.FR.CONSM.DISB._INT.0_3_PERCT.\"","v":{"$error":"#N/A"}},{"$f":"ROUND(PAGE5!$C$95,5)","v":0},{"$f":"ROUND(PAGE5!$E$95,5)","v":0}]
[{"$f":"$C$1&\".E30A.REM.VAR.CONSM.DISB._INT.0_3_PERCT.\"","v":{"$error":"#N/A"}},{"$f":"ROUND(PAGE5!$G$95,5)","v":0},{"$f":"ROUND(PAGE5!$I$95,5)","v":0}]
[{"$f":"$C$1&\".E30A.REM.ADJ.CONSM.DISB._INT.0_3_PERCT.\"","v":{"$error":"#N/A"}},{"$f":"ROUND(PAGE5!$K$95,5)","v":0},{"$f":"ROUND(PAGE5!$M$95,5)","v":0}]
[{"$f":"$C$1&\".E30A.REM.CONSM.DISB._INT.0_3_PERCT.TTL.\"","v":{"$error":"#N/A"}},{"$f":"ROUND(PAGE5!$P$95,5)","v":0},{"$f":"ROUND(PAGE5!$R$95,5)","v":0}]
[{"$f":"$C$1&\".E30A.REM.FR.CONSM.DISB._INT.3.1_4_PERCT.\"","v":{"$error":"#N/A"}},{"$f":"ROUND(PAGE5!$C$96,5)","v":0},{"$f":"ROUND(PAGE5!$E$96,5)","v":0}]
[{"$f":"$C$1&\".E30A.REM.VAR.CONSM.DISB._INT.3.1_4_PERCT.\"","v":{"$error":"#N/A"}},{"$f":"ROUND(PAGE5!$G$96,5)","v":0},{"$f":"ROUND(PAGE5!$I$96,5)","v":0}]
[{"$f":"$C$1&\".E30A.REM.ADJ.CONSM.DISB._INT.3.1_4_PERCT.\"","v":{"$error":"#N/A"}},{"$f":"ROUND(PAGE5!$K$96,5)","v":0},{"$f":"ROUND(PAGE5!$M$96,5)","v":0}]
[{"$f":"$C$1&\".E30A.REM.CONSM.DISB._INT.3.1_4_PERCT.TTL.\"","v":{"$error":"#N/A"}},{"$f":"ROUND(PAGE5!$P$96,5)","v":0},{"$f":"ROUND(PAGE5!$R$96,5)","v":0}]
[{"$f":"$C$1&\".E30A.REM.FR.CONSM.DISB._INT.4.1_5_PERCT.\"","v":{"$error":"#N/A"}},{"$f":"ROUND(PAGE5!$C$97,5)","v":0},{"$f":"ROUND(PAGE5!$E$97,5)","v":0}]
[{"$f":"$C$1&\".E30A.REM.VAR.CONSM.DISB._INT.4.1_5_PERCT.\"","v":{"$error":"#N/A"}},{"$f":"ROUND(PAGE5!$G$97,5)","v":0},{"$f":"ROUND(PAGE5!$I$97,5)","v":0}]
[{"$f":"$C$1&\".E30A.REM.ADJ.CONSM.DISB._INT.4.1_5_PERCT.\"","v":{"$error":"#N/A"}},{"$f":"ROUND(PAGE5!$K$97,5)","v":0},{"$f":"ROUND(PAGE5!$M$97,5)","v":0}]
[{"$f":"$C$1&\".E30A.REM.CONSM.DISB._INT.4.1_5_PERCT.TTL.\"","v":{"$error":"#N/A"}},{"$f":"ROUND(PAGE5!$P$97,5)","v":0},{"$f":"ROUND(PAGE5!$R$97,5)","v":0}]
[{"$f":"$C$1&\".E30A.REM.FR.CONSM.DISB._INT.5.1_6_PERCT.\"","v":{"$error":"#N/A"}},{"$f":"ROUND(PAGE5!$C$98,5)","v":0},{"$f":"ROUND(PAGE5!$E$98,5)","v":0}]
[{"$f":"$C$1&\".E30A.REM.VAR.CONSM.DISB._INT.5.1_6_PERCT.\"","v":{"$error":"#N/A"}},{"$f":"ROUND(PAGE5!$G$98,5)","v":0},{"$f":"ROUND(PAGE5!$I$98,5)","v":0}]
[{"$f":"$C$1&\".E30A.REM.ADJ.CONSM.DISB._INT.5.1_6_PERCT.\"","v":{"$error":"#N/A"}},{"$f":"ROUND(PAGE5!$K$98,5)","v":0},{"$f":"ROUND(PAGE5!$M$98,5)","v":0}]
[{"$f":"$C$1&\".E30A.REM.CONSM.DISB._INT.5.1_6_PERCT.TTL.\"","v":{"$error":"#N/A"}},{"$f":"ROUND(PAGE5!$P$98,5)","v":0},{"$f":"ROUND(PAGE5!$R$98,5)","v":0}]
[{"$f":"$C$1&\".E30A.REM.FR.CONSM.DISB._INT.6.1_7_PERCT.\"","v":{"$error":"#N/A"}},{"$f":"ROUND(PAGE5!$C$99,5)","v":0},{"$f":"ROUND(PAGE5!$E$99,5)","v":0}]
[{"$f":"$C$1&\".E30A.REM.VAR.CONSM.DISB._INT.6.1_7_PERCT.\"","v":{"$error":"#N/A"}},{"$f":"ROUND(PAGE5!$G$99,5)","v":0},{"$f":"ROUND(PAGE5!$I$99,5)","v":0}]
[{"$f":"$C$1&\".E30A.REM.ADJ.CONSM.DISB._INT.6.1_7_PERCT.\"","v":{"$error":"#N/A"}},{"$f":"ROUND(PAGE5!$K$99,5)","v":0},{"$f":"ROUND(PAGE5!$M$99,5)","v":0}]
[{"$f":"$C$1&\".E30A.REM.CONSM.DISB._INT.6.1_7_PERCT.TTL.\"","v":{"$error":"#N/A"}},{"$f":"ROUND(PAGE5!$P$99,5)","v":0},{"$f":"ROUND(PAGE5!$R$99,5)","v":0}]
[{"$f":"$C$1&\".E30A.REM.FR.CONSM.DISB._INT.7.1_8_PERCT.\"","v":{"$error":"#N/A"}},{"$f":"ROUND(PAGE5!$C$100,5)","v":0},{"$f":"ROUND(PAGE5!$E$100,5)","v":0}]
[{"$f":"$C$1&\".E30A.REM.VAR.CONSM.DISB._INT.7.1_8_PERCT.\"","v":{"$error":"#N/A"}},{"$f":"ROUND(PAGE5!$G$100,5)","v":0},{"$f":"ROUND(PAGE5!$I$100,5)","v":0}]
[{"$f":"$C$1&\".E30A.REM.ADJ.CONSM.DISB._INT.7.1_8_PERCT.\"","v":{"$error":"#N/A"}},{"$f":"ROUND(PAGE5!$K$100,5)","v":0},{"$f":"ROUND(PAGE5!$M$100,5)","v":0}]
[{"$f":"$C$1&\".E30A.REM.CONSM.DISB._INT.7.1_8_PERCT.TTL.\"","v":{"$error":"#N/A"}},{"$f":"ROUND(PAGE5!$P$100,5)","v":0},{"$f":"ROUND(PAGE5!$R$100,5)","v":0}]
[{"$f":"$C$1&\".E30A.REM.FR.CONSM.DISB._INT.8.1_9_PERCT.\"","v":{"$error":"#N/A"}},{"$f":"ROUND(PAGE5!$C$101,5)","v":0},{"$f":"ROUND(PAGE5!$E$101,5)","v":0}]
[{"$f":"$C$1&\".E30A.REM.VAR.CONSM.DISB._INT.8.1_9_PERCT.\"","v":{"$error":"#N/A"}},{"$f":"ROUND(PAGE5!$G$101,5)","v":0},{"$f":"ROUND(PAGE5!$I$101,5)","v":0}]
[{"$f":"$C$1&\".E30A.REM.ADJ.CONSM.DISB._INT.8.1_9_PERCT.\"","v":{"$error":"#N/A"}},{"$f":"ROUND(PAGE5!$K$101,5)","v":0},{"$f":"ROUND(PAGE5!$M$101,5)","v":0}]
[{"$f":"$C$1&\".E30A.REM.CONSM.DISB._INT.8.1_9_PERCT.TTL.\"","v":{"$error":"#N/A"}},{"$f":"ROUND(PAGE5!$P$101,5)","v":0},{"$f":"ROUND(PAGE5!$R$101,5)","v":0}]
[{"$f":"$C$1&\".E30A.REM.FR.CONSM.DISB._INT.9.1_10_PERCT.\"","v":{"$error":"#N/A"}},{"$f":"ROUND(PAGE5!$C$102,5)","v":0},{"$f":"ROUND(PAGE5!$E$102,5)","v":0}]
[{"$f":"$C$1&\".E30A.REM.VAR.CONSM.DISB._INT.9.1_10_PERCT.\"","v":{"$error":"#N/A"}},{"$f":"ROUND(PAGE5!$G$102,5)","v":0},{"$f":"ROUND(PAGE5!$I$102,5)","v":0}]
[{"$f":"$C$1&\".E30A.REM.ADJ.CONSM.DISB._INT.9.1_10_PERCT.\"","v":{"$error":"#N/A"}},{"$f":"ROUND(PAGE5!$K$102,5)","v":0},{"$f":"ROUND(PAGE5!$M$102,5)","v":0}]
[{"$f":"$C$1&\".E30A.REM.CONSM.DISB._INT.9.1_10_PERCT.TTL.\"","v":{"$error":"#N/A"}},{"$f":"ROUND(PAGE5!$P$102,5)","v":0},{"$f":"ROUND(PAGE5!$R$102,5)","v":0}]
[{"$f":"$C$1&\".E30A.REM.FR.CONSM.DISB._INT.10.1_11_PERCT.\"","v":{"$error":"#N/A"}},{"$f":"ROUND(PAGE5!$C$103,5)","v":0},{"$f":"ROUND(PAGE5!$E$103,5)","v":0}]
[{"$f":"$C$1&\".E30A.REM.VAR.CONSM.DISB._INT.10.1_11_PERCT.\"","v":{"$error":"#N/A"}},{"$f":"ROUND(PAGE5!$G$103,5)","v":0},{"$f":"ROUND(PAGE5!$I$103,5)","v":0}]
[{"$f":"$C$1&\".E30A.REM.ADJ.CONSM.DISB._INT.10.1_11_PERCT.\"","v":{"$error":"#N/A"}},{"$f":"ROUND(PAGE5!$K$103,5)","v":0},{"$f":"ROUND(PAGE5!$M$103,5)","v":0}]
[{"$f":"$C$1&\".E30A.REM.CONSM.DISB._INT.10.1_11_PERCT.TTL.\"","v":{"$error":"#N/A"}},{"$f":"ROUND(PAGE5!$P$103,5)","v":0},{"$f":"ROUND(PAGE5!$R$103,5)","v":0}]
[{"$f":"$C$1&\".E30A.REM.FR.CONSM.DISB._INT.11.1_12_PERCT.\"","v":{"$error":"#N/A"}},{"$f":"ROUND(PAGE5!$C$104,5)","v":0},{"$f":"ROUND(PAGE5!$E$104,5)","v":0}]
[{"$f":"$C$1&\".E30A.REM.VAR.CONSM.DISB._INT.11.1_12_PERCT.\"","v":{"$error":"#N/A"}},{"$f":"ROUND(PAGE5!$G$104,5)","v":0},{"$f":"ROUND(PAGE5!$I$104,5)","v":0}]
[{"$f":"$C$1&\".E30A.REM.ADJ.CONSM.DISB._INT.11.1_12_PERCT.\"","v":{"$error":"#N/A"}},{"$f":"ROUND(PAGE5!$K$104,5)","v":0},{"$f":"ROUND(PAGE5!$M$104,5)","v":0}]
[{"$f":"$C$1&\".E30A.REM.CONSM.DISB._INT.11.1_12_PERCT.TTL.\"","v":{"$error":"#N/A"}},{"$f":"ROUND(PAGE5!$P$104,5)","v":0},{"$f":"ROUND(PAGE5!$R$104,5)","v":0}]
[{"$f":"$C$1&\".E30A.REM.FR.CONSM.DISB._INT.12.1_13_PERCT.\"","v":{"$error":"#N/A"}},{"$f":"ROUND(PAGE5!$C$105,5)","v":0},{"$f":"ROUND(PAGE5!$E$105,5)","v":0}]
[{"$f":"$C$1&\".E30A.REM.VAR.CONSM.DISB._INT.12.1_13_PERCT.\"","v":{"$error":"#N/A"}},{"$f":"ROUND(PAGE5!$G$105,5)","v":0},{"$f":"ROUND(PAGE5!$I$105,5)","v":0}]
[{"$f":"$C$1&\".E30A.REM.ADJ.CONSM.DISB._INT.12.1_13_PERCT.\"","v":{"$error":"#N/A"}},{"$f":"ROUND(PAGE5!$K$105,5)","v":0},{"$f":"ROUND(PAGE5!$M$105,5)","v":0}]
[{"$f":"$C$1&\".E30A.REM.CONSM.DISB._INT.12.1_13_PERCT.TTL.\"","v":{"$error":"#N/A"}},{"$f":"ROUND(PAGE5!$P$105,5)","v":0},{"$f":"ROUND(PAGE5!$R$105,5)","v":0}]
[{"$f":"$C$1&\".E30A.REM.FR.CONSM.DISB._INT.13.1_14_PERCT.\"","v":{"$error":"#N/A"}},{"$f":"ROUND(PAGE5!$C$106,5)","v":0},{"$f":"ROUND(PAGE5!$E$106,5)","v":0}]
[{"$f":"$C$1&\".E30A.REM.VAR.CONSM.DISB._INT.13.1_14_PERCT.\"","v":{"$error":"#N/A"}},{"$f":"ROUND(PAGE5!$G$106,5)","v":0},{"$f":"ROUND(PAGE5!$I$106,5)","v":0}]
[{"$f":"$C$1&\".E30A.REM.ADJ.CONSM.DISB._INT.13.1_14_PERCT.\"","v":{"$error":"#N/A"}},{"$f":"ROUND(PAGE5!$K$106,5)","v":0},{"$f":"ROUND(PAGE5!$M$106,5)","v":0}]
[{"$f":"$C$1&\".E30A.REM.CONSM.DISB._INT.13.1_14_PERCT.TTL.\"","v":{"$error":"#N/A"}},{"$f":"ROUND(PAGE5!$P$106,5)","v":0},{"$f":"ROUND(PAGE5!$R$106,5)","v":0}]
[{"$f":"$C$1&\".E30A.REM.FR.CONSM.DISB._INT.14.1_15_PERCT.\"","v":{"$error":"#N/A"}},{"$f":"ROUND(PAGE5!$C$107,5)","v":0},{"$f":"ROUND(PAGE5!$E$107,5)","v":0}]
[{"$f":"$C$1&\".E30A.REM.VAR.CONSM.DISB._INT.14.1_15_PERCT.\"","v":{"$error":"#N/A"}},{"$f":"ROUND(PAGE5!$G$107,5)","v":0},{"$f":"ROUND(PAGE5!$I$107,5)","v":0}]
[{"$f":"$C$1&\".E30A.REM.ADJ.CONSM.DISB._INT.14.1_15_PERCT.\"","v":{"$error":"#N/A"}},{"$f":"ROUND(PAGE5!$K$107,5)","v":0},{"$f":"ROUND(PAGE5!$M$107,5)","v":0}]
[{"$f":"$C$1&\".E30A.REM.CONSM.DISB._INT.14.1_15_PERCT.TTL.\"","v":{"$error":"#N/A"}},{"$f":"ROUND(PAGE5!$P$107,5)","v":0},{"$f":"ROUND(PAGE5!$R$107,5)","v":0}]
[{"$f":"$C$1&\".E30A.REM.FR.CONSM.DISB._INT.OVR_15.1_PERCT.\"","v":{"$error":"#N/A"}},{"$f":"ROUND(PAGE5!$C$108,5)","v":0},{"$f":"ROUND(PAGE5!$E$108,5)","v":0}]
[{"$f":"$C$1&\".E30A.REM.VAR.CONSM.DISB._INT.OVR_15.1_PERCT.\"","v":{"$error":"#N/A"}},{"$f":"ROUND(PAGE5!$G$108,5)","v":0},{"$f":"ROUND(PAGE5!$I$108,5)","v":0}]
[{"$f":"$C$1&\".E30A.REM.ADJ.CONSM.DISB._INT.OVR_15.1_PERCT.\"","v":{"$error":"#N/A"}},{"$f":"ROUND(PAGE5!$K$108,5)","v":0},{"$f":"ROUND(PAGE5!$M$108,5)","v":0}]
[{"$f":"$C$1&\".E30A.REM.CONSM.DISB._INT.OVR_15.1_PERCT.TTL.\"","v":{"$error":"#N/A"}},{"$f":"ROUND(PAGE5!$P$108,5)","v":0},{"$f":"ROUND(PAGE5!$R$108,5)","v":0}]
[{"$f":"$C$1&\".E30A.REM.FR.DISB.TTL\"","v":{"$error":"#N/A"}},{"$f":"ROUND(PAGE5!$C$112,5)","v":0},{"$f":"ROUND(PAGE5!$E$112,5)","v":0}]
[{"$f":"$C$1&\".E30A.REM.VAR.DISB.TTL\"","v":{"$error":"#N/A"}},{"$f":"ROUND(PAGE5!$G$112,5)","v":0},{"$f":"ROUND(PAGE5!$I$112,5)","v":0}]
[{"$f":"$C$1&\".E30A.REM.ADJ.DISB.TTL\"","v":{"$error":"#N/A"}},{"$f":"ROUND(PAGE5!$K$112,5)","v":0},{"$f":"ROUND(PAGE5!$M$112,5)","v":0}]
[{"$f":"$C$1&\".E30A.REM.DISB._GRNT.AGG_TTL...\"","v":{"$error":"#N/A"}},{"$f":"ROUND(PAGE5!$P$112,5)","v":0},{"$f":"ROUND(PAGE5!$R$112,5)","v":0}]
["sect8","NUM","VAL"]
[{"$f":"$C$1&\".E30A.REM.FR.PBSEC.OS._INT.0_3_PERCT\"","v":{"$error":"#N/A"}},{"$f":"ROUND(PAGE6!$C$19,5)","v":0},{"$f":"ROUND(PAGE6!$E$19,5)","v":0}]
[{"$f":"$C$1&\".E30A.REM.VAR.PBSEC.OS._INT.0_3_PERCT\"","v":{"$error":"#N/A"}},{"$f":"ROUND(PAGE6!$G$19,5)","v":0},{"$f":"ROUND(PAGE6!$I$19,5)","v":0}]
[{"$f":"$C$1&\".E30A.REM.ADJ.PBSEC.OS._INT.0_3_PERCT\"","v":{"$error":"#N/A"}},{"$f":"ROUND(PAGE6!$K$19,5)","v":0},{"$f":"ROUND(PAGE6!$M$19,5)","v":0}]
[{"$f":"$C$1&\".E30A.REM.PBSEC.OS._INT.0_3_PERCT.TTL\"","v":{"$error":"#N/A"}},{"$f":"ROUND(PAGE6!$P$19,5)","v":0},{"$f":"ROUND(PAGE6!$R$19,5)","v":0}]
[{"$f":"$C$1&\".E30A.REM.FR.PBSEC.OS._INT.3.1_4_PERCT\"","v":{"$error":"#N/A"}},{"$f":"ROUND(PAGE6!$C$20,5)","v":0},{"$f":"ROUND(PAGE6!$E$20,5)","v":0}]
[{"$f":"$C$1&\".E30A.REM.VAR.PBSEC.OS._INT.3.1_4_PERCT\"","v":{"$error":"#N/A"}},{"$f":"ROUND(PAGE6!$G$20,5)","v":0},{"$f":"ROUND(PAGE6!$I$20,5)","v":0}]
[{"$f":"$C$1&\".E30A.REM.ADJ.PBSEC.OS._INT.3.1_4_PERCT\"","v":{"$error":"#N/A"}},{"$f":"ROUND(PAGE6!$K$20,5)","v":0},{"$f":"ROUND(PAGE6!$M$20,5)","v":0}]
[{"$f":"$C$1&\".E30A.REM.PBSEC.OS._INT.3.1_4_PERCT.TTL\"","v":{"$error":"#N/A"}},{"$f":"ROUND(PAGE6!$P$20,5)","v":0},{"$f":"ROUND(PAGE6!$R$20,5)","v":0}]
[{"$f":"$C$1&\".E30A.REM.FR.PBSEC.OS._INT.4.1_5_PERCT\"","v":{"$error":"#N/A"}},{"$f":"ROUND(PAGE6!$C$21,5)","v":0},{"$f":"ROUND(PAGE6!$E$21,5)","v":0}]
[{"$f":"$C$1&\".E30A.REM.VAR.PBSEC.OS._INT.4.1_5_PERCT\"","v":{"$error":"#N/A"}},{"$f":"ROUND(PAGE6!$G$21,5)","v":0},{"$f":"ROUND(PAGE6!$I$21,5)","v":0}]
[{"$f":"$C$1&\".E30A.REM.ADJ.PBSEC.OS._INT.4.1_5_PERCT\"","v":{"$error":"#N/A"}},{"$f":"ROUND(PAGE6!$K$21,5)","v":0},{"$f":"ROUND(PAGE6!$M$21,5)","v":0}]
[{"$f":"$C$1&\".E30A.REM.PBSEC.OS._INT.4.1_5_PERCT.TTL\"","v":{"$error":"#N/A"}},{"$f":"ROUND(PAGE6!$P$21,5)","v":0},{"$f":"ROUND(PAGE6!$R$21,5)","v":0}]
[{"$f":"$C$1&\".E30A.REM.FR.PBSEC.OS._INT.5.1_6_PERCT\"","v":{"$error":"#N/A"}},{"$f":"ROUND(PAGE6!$C$22,5)","v":0},{"$f":"ROUND(PAGE6!$E$22,5)","v":0}]
[{"$f":"$C$1&\".E30A.REM.VAR.PBSEC.OS._INT.5.1_6_PERCT\"","v":{"$error":"#N/A"}},{"$f":"ROUND(PAGE6!$G$22,5)","v":0},{"$f":"ROUND(PAGE6!$I$22,5)","v":0}]
[{"$f":"$C$1&\".E30A.REM.ADJ.PBSEC.OS._INT.5.1_6_PERCT\"","v":{"$error":"#N/A"}},{"$f":"ROUND(PAGE6!$K$22,5)","v":0},{"$f":"ROUND(PAGE6!$M$22,5)","v":0}]
[{"$f":"$C$1&\".E30A.REM.PBSEC.OS._INT.5.1_6_PERCT.TTL\"","v":{"$error":"#N/A"}},{"$f":"ROUND(PAGE6!$P$22,5)","v":0},{"$f":"ROUND(PAGE6!$R$22,5)","v":0}]
[{"$f":"$C$1&\".E30A.REM.FR.PBSEC.OS._INT.6.1_7_PERCT\"","v":{"$error":"#N/A"}},{"$f":"ROUND(PAGE6!$C$23,5)","v":0},{"$f":"ROUND(PAGE6!$E$23,5)","v":0}]
[{"$f":"$C$1&\".E30A.REM.VAR.PBSEC.OS._INT.6.1_7_PERCT\"","v":{"$error":"#N/A"}},{"$f":"ROUND(PAGE6!$G$23,5)","v":0},{"$f":"ROUND(PAGE6!$I$23,5)","v":0}]
[{"$f":"$C$1&\".E30A.REM.ADJ.PBSEC.OS._INT.6.1_7_PERCT\"","v":{"$error":"#N/A"}},{"$f":"ROUND(PAGE6!$K$23,5)","v":0},{"$f":"ROUND(PAGE6!$M$23,5)","v":0}]
[{"$f":"$C$1&\".E30A.REM.PBSEC.OS._INT.6.1_7_PERCT.TTL\"","v":{"$error":"#N/A"}},{"$f":"ROUND(PAGE6!$P$23,5)","v":0},{"$f":"ROUND(PAGE6!$R$23,5)","v":0}]
[{"$f":"$C$1&\".E30A.REM.FR.PBSEC.OS._INT.7.1_8_PERCT\"","v":{"$error":"#N/A"}},{"$f":"ROUND(PAGE6!$C$24,5)","v":0},{"$f":"ROUND(PAGE6!$E$24,5)","v":0}]
[{"$f":"$C$1&\".E30A.REM.VAR.PBSEC.OS._INT.7.1_8_PERCT\"","v":{"$error":"#N/A"}},{"$f":"ROUND(PAGE6!$G$24,5)","v":0},{"$f":"ROUND(PAGE6!$I$24,5)","v":0}]
[{"$f":"$C$1&\".E30A.REM.ADJ.PBSEC.OS._INT.7.1_8_PERCT\"","v":{"$error":"#N/A"}},{"$f":"ROUND(PAGE6!$K$24,5)","v":0},{"$f":"ROUND(PAGE6!$M$24,5)","v":0}]
[{"$f":"$C$1&\".E30A.REM.PBSEC.OS._INT.7.1_8_PERCT.TTL\"","v":{"$error":"#N/A"}},{"$f":"ROUND(PAGE6!$P$24,5)","v":0},{"$f":"ROUND(PAGE6!$R$24,5)","v":0}]
[{"$f":"$C$1&\".E30A.REM.FR.PBSEC.OS._INT.8.1_9_PERCT\"","v":{"$error":"#N/A"}},{"$f":"ROUND(PAGE6!$C$25,5)","v":0},{"$f":"ROUND(PAGE6!$E$25,5)","v":0}]
[{"$f":"$C$1&\".E30A.REM.VAR.PBSEC.OS._INT.8.1_9_PERCT\"","v":{"$error":"#N/A"}},{"$f":"ROUND(PAGE6!$G$25,5)","v":0},{"$f":"ROUND(PAGE6!$I$25,5)","v":0}]
[{"$f":"$C$1&\".E30A.REM.ADJ.PBSEC.OS._INT.8.1_9_PERCT\"","v":{"$error":"#N/A"}},{"$f":"ROUND(PAGE6!$K$25,5)","v":0},{"$f":"ROUND(PAGE6!$M$25,5)","v":0}]
[{"$f":"$C$1&\".E30A.REM.PBSEC.OS._INT.8.1_9_PERCT.TTL\"","v":{"$error":"#N/A"}},{"$f":"ROUND(PAGE6!$P$25,5)","v":0},{"$f":"ROUND(PAGE6!$R$25,5)","v":0}]
[{"$f":"$C$1&\".E30A.REM.FR.PBSEC.OS._INT.9.1_10_PERCT\"","v":{"$error":"#N/A"}},{"$f":"ROUND(PAGE6!$C$26,5)","v":0},{"$f":"ROUND(PAGE6!$E$26,5)","v":0}]
[{"$f":"$C$1&\".E30A.REM.VAR.PBSEC.OS._INT.9.1_10_PERCT\"","v":{"$error":"#N/A"}},{"$f":"ROUND(PAGE6!$G$26,5)","v":0},{"$f":"ROUND(PAGE6!$I$26,5)","v":0}]
[{"$f":"$C$1&\".E30A.REM.ADJ.PBSEC.OS._INT.9.1_10_PERCT\"","v":{"$error":"#N/A"}},{"$f":"ROUND(PAGE6!$K$26,5)","v":0},{"$f":"ROUND(PAGE6!$M$26,5)","v":0}]
[{"$f":"$C$1&\".E30A.REM.PBSEC.OS._INT.9.1_10_PERCT.TTL\"","v":{"$error":"#N/A"}},{"$f":"ROUND(PAGE6!$P$26,5)","v":0},{"$f":"ROUND(PAGE6!$R$26,5)","v":0}]
[{"$f":"$C$1&\".E30A.REM.FR.PBSEC.OS._INT.10.1_11_PERCT\"","v":{"$error":"#N/A"}},{"$f":"ROUND(PAGE6!$C$27,5)","v":0},{"$f":"ROUND(PAGE6!$E$27,5)","v":0}]
[{"$f":"$C$1&\".E30A.REM.VAR.PBSEC.OS._INT.10.1_11_PERCT\"","v":{"$error":"#N/A"}},{"$f":"ROUND(PAGE6!$G$27,5)","v":0},{"$f":"ROUND(PAGE6!$I$27,5)","v":0}]
[{"$f":"$C$1&\".E30A.REM.ADJ.PBSEC.OS._INT.10.1_11_PERCT\"","v":{"$error":"#N/A"}},{"$f":"ROUND(PAGE6!$K$27,5)","v":0},{"$f":"ROUND(PAGE6!$M$27,5)","v":0}]
[{"$f":"$C$1&\".E30A.REM.PBSEC.OS._INT.10.1_11_PERCT.TTL\"","v":{"$error":"#N/A"}},{"$f":"ROUND(PAGE6!$P$27,5)","v":0},{"$f":"ROUND(PAGE6!$R$27,5)","v":0}]
[{"$f":"$C$1&\".E30A.REM.FR.PBSEC.OS._INT.11.1_12_PERCT\"","v":{"$error":"#N/A"}},{"$f":"ROUND(PAGE6!$C$28,5)","v":0},{"$f":"ROUND(PAGE6!$E$28,5)","v":0}]
[{"$f":"$C$1&\".E30A.REM.VAR.PBSEC.OS._INT.11.1_12_PERCT\"","v":{"$error":"#N/A"}},{"$f":"ROUND(PAGE6!$G$28,5)","v":0},{"$f":"ROUND(PAGE6!$I$28,5)","v":0}]
[{"$f":"$C$1&\".E30A.REM.ADJ.PBSEC.OS._INT.11.1_12_PERCT\"","v":{"$error":"#N/A"}},{"$f":"ROUND(PAGE6!$K$28,5)","v":0},{"$f":"ROUND(PAGE6!$M$28,5)","v":0}]
[{"$f":"$C$1&\".E30A.REM.PBSEC.OS._INT.11.1_12_PERCT.TTL\"","v":{"$error":"#N/A"}},{"$f":"ROUND(PAGE6!$P$28,5)","v":0},{"$f":"ROUND(PAGE6!$R$28,5)","v":0}]
[{"$f":"$C$1&\".E30A.REM.FR.PBSEC.OS._INT.12.1_13_PERCT\"","v":{"$error":"#N/A"}},{"$f":"ROUND(PAGE6!$C$29,5)","v":0},{"$f":"ROUND(PAGE6!$E$29,5)","v":0}]
[{"$f":"$C$1&\".E30A.REM.VAR.PBSEC.OS._INT.12.1_13_PERCT\"","v":{"$error":"#N/A"}},{"$f":"ROUND(PAGE6!$G$29,5)","v":0},{"$f":"ROUND(PAGE6!$I$29,5)","v":0}]
[{"$f":"$C$1&\".E30A.REM.ADJ.PBSEC.OS._INT.12.1_13_PERCT\"","v":{"$error":"#N/A"}},{"$f":"ROUND(PAGE6!$K$29,5)","v":0},{"$f":"ROUND(PAGE6!$M$29,5)","v":0}]
[{"$f":"$C$1&\".E30A.REM.PBSEC.OS._INT.12.1_13_PERCT.TTL\"","v":{"$error":"#N/A"}},{"$f":"ROUND(PAGE6!$P$29,5)","v":0},{"$f":"ROUND(PAGE6!$R$29,5)","v":0}]
[{"$f":"$C$1&\".E30A.REM.FR.PBSEC.OS._INT.13.1_14_PERCT\"","v":{"$error":"#N/A"}},{"$f":"ROUND(PAGE6!$C$30,5)","v":0},{"$f":"ROUND(PAGE6!$E$30,5)","v":0}]
[{"$f":"$C$1&\".E30A.REM.VAR.PBSEC.OS._INT.13.1_14_PERCT\"","v":{"$error":"#N/A"}},{"$f":"ROUND(PAGE6!$G$30,5)","v":0},{"$f":"ROUND(PAGE6!$I$30,5)","v":0}]
[{"$f":"$C$1&\".E30A.REM.ADJ.PBSEC.OS._INT.13.1_14_PERCT\"","v":{"$error":"#N/A"}},{"$f":"ROUND(PAGE6!$K$30,5)","v":0},{"$f":"ROUND(PAGE6!$M$30,5)","v":0}]
[{"$f":"$C$1&\".E30A.REM.PBSEC.OS._INT.13.1_14_PERCT.TTL\"","v":{"$error":"#N/A"}},{"$f":"ROUND(PAGE6!$P$30,5)","v":0},{"$f":"ROUND(PAGE6!$R$30,5)","v":0}]
[{"$f":"$C$1&\".E30A.REM.FR.PBSEC.OS._INT.14.1_15_PERCT\"","v":{"$error":"#N/A"}},{"$f":"ROUND(PAGE6!$C$31,5)","v":0},{"$f":"ROUND(PAGE6!$E$31,5)","v":0}]
[{"$f":"$C$1&\".E30A.REM.VAR.PBSEC.OS._INT.14.1_15_PERCT\"","v":{"$error":"#N/A"}},{"$f":"ROUND(PAGE6!$G$31,5)","v":0},{"$f":"ROUND(PAGE6!$I$31,5)","v":0}]
[{"$f":"$C$1&\".E30A.REM.ADJ.PBSEC.OS._INT.14.1_15_PERCT\"","v":{"$error":"#N/A"}},{"$f":"ROUND(PAGE6!$K$31,5)","v":0},{"$f":"ROUND(PAGE6!$M$31,5)","v":0}]
[{"$f":"$C$1&\".E30A.REM.PBSEC.OS._INT.14.1_15_PERCT.TTL\"","v":{"$error":"#N/A"}},{"$f":"ROUND(PAGE6!$P$31,5)","v":0},{"$f":"ROUND(PAGE6!$R$31,5)","v":0}]
[{"$f":"$C$1&\".E30A.REM.FR.PBSEC.OS._INT.OVR_15.1_PERCT\"","v":{"$error":"#N/A"}},{"$f":"ROUND(PAGE6!$C$32,5)","v":0},{"$f":"ROUND(PAGE6!$E$32,5)","v":0}]
[{"$f":"$C$1&\".E30A.REM.VAR.PBSEC.OS._INT.OVR_15.1_PERCT\"","v":{"$error":"#N/A"}},{"$f":"ROUND(PAGE6!$G$32,5)","v":0},{"$f":"ROUND(PAGE6!$I$32,5)","v":0}]
[{"$f":"$C$1&\".E30A.REM.ADJ.PBSEC.OS._INT.OVR_15.1_PERCT\"","v":{"$error":"#N/A"}},{"$f":"ROUND(PAGE6!$K$32,5)","v":0},{"$f":"ROUND(PAGE6!$M$32,5)","v":0}]
[{"$f":"$C$1&\".E30A.REM.PBSEC.OS._INT.OVR_15.1_PERCT.TTL\"","v":{"$error":"#N/A"}},{"$f":"ROUND(PAGE6!$P$32,5)","v":0},{"$f":"ROUND(PAGE6!$R$32,5)","v":0}]
[{"$f":"$C$1&\".E30A.REM.FR.PVFIN.OS._INT.0_3_PERCT\"","v":{"$error":"#N/A"}},{"$f":"ROUND(PAGE6!$C$38,5)","v":0},{"$f":"ROUND(PAGE6!$E$38,5)","v":0}]
[{"$f":"$C$1&\".E30A.REM.VAR.PVFIN.OS._INT.0_3_PERCT\"","v":{"$error":"#N/A"}},{"$f":"ROUND(PAGE6!$G$38,5)","v":0},{"$f":"ROUND(PAGE6!$I$38,5)","v":0}]
[{"$f":"$C$1&\".E30A.REM.ADJ.PVFIN.OS._INT.0_3_PERCT\"","v":{"$error":"#N/A"}},{"$f":"ROUND(PAGE6!$K$38,5)","v":0},{"$f":"ROUND(PAGE6!$M$38,5)","v":0}]
[{"$f":"$C$1&\".E30A.REM.PVFIN.OS._INT.0_3_PERCT.TTL\"","v":{"$error":"#N/A"}},{"$f":"ROUND(PAGE6!$P$38,5)","v":0},{"$f":"ROUND(PAGE6!$R$38,5)","v":0}]
[{"$f":"$C$1&\".E30A.REM.FR.PVFIN.OS._INT.3.1_4_PERCT\"","v":{"$error":"#N/A"}},{"$f":"ROUND(PAGE6!$C$39,5)","v":0},{"$f":"ROUND(PAGE6!$E$39,5)","v":0}]
[{"$f":"$C$1&\".E30A.REM.VAR.PVFIN.OS._INT.3.1_4_PERCT\"","v":{"$error":"#N/A"}},{"$f":"ROUND(PAGE6!$G$39,5)","v":0},{"$f":"ROUND(PAGE6!$I$39,5)","v":0}]
[{"$f":"$C$1&\".E30A.REM.ADJ.PVFIN.OS._INT.3.1_4_PERCT\"","v":{"$error":"#N/A"}},{"$f":"ROUND(PAGE6!$K$39,5)","v":0},{"$f":"ROUND(PAGE6!$M$39,5)","v":0}]
[{"$f":"$C$1&\".E30A.REM.PVFIN.OS._INT.3.1_4_PERCT.TTL\"","v":{"$error":"#N/A"}},{"$f":"ROUND(PAGE6!$P$39,5)","v":0},{"$f":"ROUND(PAGE6!$R$39,5)","v":0}]
[{"$f":"$C$1&\".E30A.REM.FR.PVFIN.OS._INT.4.1_5_PERCT\"","v":{"$error":"#N/A"}},{"$f":"ROUND(PAGE6!$C$40,5)","v":0},{"$f":"ROUND(PAGE6!$E$40,5)","v":0}]
[{"$f":"$C$1&\".E30A.REM.VAR.PVFIN.OS._INT.4.1_5_PERCT\"","v":{"$error":"#N/A"}},{"$f":"ROUND(PAGE6!$G$40,5)","v":0},{"$f":"ROUND(PAGE6!$I$40,5)","v":0}]
[{"$f":"$C$1&\".E30A.REM.ADJ.PVFIN.OS._INT.4.1_5_PERCT\"","v":{"$error":"#N/A"}},{"$f":"ROUND(PAGE6!$K$40,5)","v":0},{"$f":"ROUND(PAGE6!$M$40,5)","v":0}]
[{"$f":"$C$1&\".E30A.REM.PVFIN.OS._INT.4.1_5_PERCT.TTL\"","v":{"$error":"#N/A"}},{"$f":"ROUND(PAGE6!$P$40,5)","v":0},{"$f":"ROUND(PAGE6!$R$40,5)","v":0}]
[{"$f":"$C$1&\".E30A.REM.FR.PVFIN.OS._INT.5.1_6_PERCT\"","v":{"$error":"#N/A"}},{"$f":"ROUND(PAGE6!$C$41,5)","v":0},{"$f":"ROUND(PAGE6!$E$41,5)","v":0}]
[{"$f":"$C$1&\".E30A.REM.VAR.PVFIN.OS._INT.5.1_6_PERCT\"","v":{"$error":"#N/A"}},{"$f":"ROUND(PAGE6!$G$41,5)","v":0},{"$f":"ROUND(PAGE6!$I$41,5)","v":0}]
[{"$f":"$C$1&\".E30A.REM.ADJ.PVFIN.OS._INT.5.1_6_PERCT\"","v":{"$error":"#N/A"}},{"$f":"ROUND(PAGE6!$K$41,5)","v":0},{"$f":"ROUND(PAGE6!$M$41,5)","v":0}]
[{"$f":"$C$1&\".E30A.REM.PVFIN.OS._INT.5.1_6_PERCT.TTL\"","v":{"$error":"#N/A"}},{"$f":"ROUND(PAGE6!$P$41,5)","v":0},{"$f":"ROUND(PAGE6!$R$41,5)","v":0}]
[{"$f":"$C$1&\".E30A.REM.FR.PVFIN.OS._INT.6.1_7_PERCT\"","v":{"$error":"#N/A"}},{"$f":"ROUND(PAGE6!$C$42,5)","v":0},{"$f":"ROUND(PAGE6!$E$42,5)","v":0}]
[{"$f":"$C$1&\".E30A.REM.VAR.PVFIN.OS._INT.6.1_7_PERCT\"","v":{"$error":"#N/A"}},{"$f":"ROUND(PAGE6!$G$42,5)","v":0},{"$f":"ROUND(PAGE6!$I$42,5)","v":0}]
[{"$f":"$C$1&\".E30A.REM.ADJ.PVFIN.OS._INT.6.1_7_PERCT\"","v":{"$error":"#N/A"}},{"$f":"ROUND(PAGE6!$K$42,5)","v":0},{"$f":"ROUND(PAGE6!$M$42,5)","v":0}]
[{"$f":"$C$1&\".E30A.REM.PVFIN.OS._INT.6.1_7_PERCT.TTL\"","v":{"$error":"#N/A"}},{"$f":"ROUND(PAGE6!$P$42,5)","v":0},{"$f":"ROUND(PAGE6!$R$42,5)","v":0}]
[{"$f":"$C$1&\".E30A.REM.FR.PVFIN.OS._INT.7.1_8_PERCT\"","v":{"$error":"#N/A"}},{"$f":"ROUND(PAGE6!$C$43,5)","v":0},{"$f":"ROUND(PAGE6!$E$43,5)","v":0}]
[{"$f":"$C$1&\".E30A.REM.VAR.PVFIN.OS._INT.7.1_8_PERCT\"","v":{"$error":"#N/A"}},{"$f":"ROUND(PAGE6!$G$43,5)","v":0},{"$f":"ROUND(PAGE6!$I$43,5)","v":0}]
[{"$f":"$C$1&\".E30A.REM.ADJ.PVFIN.OS._INT.7.1_8_PERCT\"","v":{"$error":"#N/A"}},{"$f":"ROUND(PAGE6!$K$43,5)","v":0},{"$f":"ROUND(PAGE6!$M$43,5)","v":0}]
[{"$f":"$C$1&\".E30A.REM.PVFIN.OS._INT.7.1_8_PERCT.TTL\"","v":{"$error":"#N/A"}},{"$f":"ROUND(PAGE6!$P$43,5)","v":0},{"$f":"ROUND(PAGE6!$R$43,5)","v":0}]
[{"$f":"$C$1&\".E30A.REM.FR.PVFIN.OS._INT.8.1_9_PERCT\"","v":{"$error":"#N/A"}},{"$f":"ROUND(PAGE6!$C$44,5)","v":0},{"$f":"ROUND(PAGE6!$E$44,5)","v":0}]
[{"$f":"$C$1&\".E30A.REM.VAR.PVFIN.OS._INT.8.1_9_PERCT\"","v":{"$error":"#N/A"}},{"$f":"ROUND(PAGE6!$G$44,5)","v":0},{"$f":"ROUND(PAGE6!$I$44,5)","v":0}]
[{"$f":"$C$1&\".E30A.REM.ADJ.PVFIN.OS._INT.8.1_9_PERCT\"","v":{"$error":"#N/A"}},{"$f":"ROUND(PAGE6!$K$44,5)","v":0},{"$f":"ROUND(PAGE6!$M$44,5)","v":0}]
[{"$f":"$C$1&\".E30A.REM.PVFIN.OS._INT.8.1_9_PERCT.TTL\"","v":{"$error":"#N/A"}},{"$f":"ROUND(PAGE6!$P$44,5)","v":0},{"$f":"ROUND(PAGE6!$R$44,5)","v":0}]
[{"$f":"$C$1&\".E30A.REM.FR.PVFIN.OS._INT.9.1_10_PERCT\"","v":{"$error":"#N/A"}},{"$f":"ROUND(PAGE6!$C$45,5)","v":0},{"$f":"ROUND(PAGE6!$E$45,5)","v":0}]
[{"$f":"$C$1&\".E30A.REM.VAR.PVFIN.OS._INT.9.1_10_PERCT\"","v":{"$error":"#N/A"}},{"$f":"ROUND(PAGE6!$G$45,5)","v":0},{"$f":"ROUND(PAGE6!$I$45,5)","v":0}]
[{"$f":"$C$1&\".E30A.REM.ADJ.PVFIN.OS._INT.9.1_10_PERCT\"","v":{"$error":"#N/A"}},{"$f":"ROUND(PAGE6!$K$45,5)","v":0},{"$f":"ROUND(PAGE6!$M$45,5)","v":0}]
[{"$f":"$C$1&\".E30A.REM.PVFIN.OS._INT.9.1_10_PERCT.TTL\"","v":{"$error":"#N/A"}},{"$f":"ROUND(PAGE6!$P$45,5)","v":0},{"$f":"ROUND(PAGE6!$R$45,5)","v":0}]
[{"$f":"$C$1&\".E30A.REM.FR.PVFIN.OS._INT.10.1_11_PERCT\"","v":{"$error":"#N/A"}},{"$f":"ROUND(PAGE6!$C$46,5)","v":0},{"$f":"ROUND(PAGE6!$E$46,5)","v":0}]
[{"$f":"$C$1&\".E30A.REM.VAR.PVFIN.OS._INT.10.1_11_PERCT\"","v":{"$error":"#N/A"}},{"$f":"ROUND(PAGE6!$G$46,5)","v":0},{"$f":"ROUND(PAGE6!$I$46,5)","v":0}]
[{"$f":"$C$1&\".E30A.REM.ADJ.PVFIN.OS._INT.10.1_11_PERCT\"","v":{"$error":"#N/A"}},{"$f":"ROUND(PAGE6!$K$46,5)","v":0},{"$f":"ROUND(PAGE6!$M$46,5)","v":0}]
[{"$f":"$C$1&\".E30A.REM.PVFIN.OS._INT.10.1_11_PERCT.TTL\"","v":{"$error":"#N/A"}},{"$f":"ROUND(PAGE6!$P$46,5)","v":0},{"$f":"ROUND(PAGE6!$R$46,5)","v":0}]
[{"$f":"$C$1&\".E30A.REM.FR.PVFIN.OS._INT.11.1_12_PERCT\"","v":{"$error":"#N/A"}},{"$f":"ROUND(PAGE6!$C$47,5)","v":0},{"$f":"ROUND(PAGE6!$E$47,5)","v":0}]
[{"$f":"$C$1&\".E30A.REM.VAR.PVFIN.OS._INT.11.1_12_PERCT\"","v":{"$error":"#N/A"}},{"$f":"ROUND(PAGE6!$G$47,5)","v":0},{"$f":"ROUND(PAGE6!$I$47,5)","v":0}]
[{"$f":"$C$1&\".E30A.REM.ADJ.PVFIN.OS._INT.11.1_12_PERCT\"","v":{"$error":"#N/A"}},{"$f":"ROUND(PAGE6!$K$47,5)","v":0},{"$f":"ROUND(PAGE6!$M$47,5)","v":0}]
[{"$f":"$C$1&\".E30A.REM.PVFIN.OS._INT.11.1_12_PERCT.TTL\"","v":{"$error":"#N/A"}},{"$f":"ROUND(PAGE6!$P$47,5)","v":0},{"$f":"ROUND(PAGE6!$R$47,5)","v":0}]
[{"$f":"$C$1&\".E30A.REM.FR.PVFIN.OS._INT.12.1_13_PERCT\"","v":{"$error":"#N/A"}},{"$f":"ROUND(PAGE6!$C$48,5)","v":0},{"$f":"ROUND(PAGE6!$E$48,5)","v":0}]
[{"$f":"$C$1&\".E30A.REM.VAR.PVFIN.OS._INT.12.1_13_PERCT\"","v":{"$error":"#N/A"}},{"$f":"ROUND(PAGE6!$G$48,5)","v":0},{"$f":"ROUND(PAGE6!$I$48,5)","v":0}]
[{"$f":"$C$1&\".E30A.REM.ADJ.PVFIN.OS._INT.12.1_13_PERCT\"","v":{"$error":"#N/A"}},{"$f":"ROUND(PAGE6!$K$48,5)","v":0},{"$f":"ROUND(PAGE6!$M$48,5)","v":0}]
[{"$f":"$C$1&\".E30A.REM.PVFIN.OS._INT.12.1_13_PERCT.TTL\"","v":{"$error":"#N/A"}},{"$f":"ROUND(PAGE6!$P$48,5)","v":0},{"$f":"ROUND(PAGE6!$R$48,5)","v":0}]
[{"$f":"$C$1&\".E30A.REM.FR.PVFIN.OS._INT.13.1_14_PERCT\"","v":{"$error":"#N/A"}},{"$f":"ROUND(PAGE6!$C$49,5)","v":0},{"$f":"ROUND(PAGE6!$E$49,5)","v":0}]
[{"$f":"$C$1&\".E30A.REM.VAR.PVFIN.OS._INT.13.1_14_PERCT\"","v":{"$error":"#N/A"}},{"$f":"ROUND(PAGE6!$G$49,5)","v":0},{"$f":"ROUND(PAGE6!$I$49,5)","v":0}]
[{"$f":"$C$1&\".E30A.REM.ADJ.PVFIN.OS._INT.13.1_14_PERCT\"","v":{"$error":"#N/A"}},{"$f":"ROUND(PAGE6!$K$49,5)","v":0},{"$f":"ROUND(PAGE6!$M$49,5)","v":0}]
[{"$f":"$C$1&\".E30A.REM.PVFIN.OS._INT.13.1_14_PERCT.TTL\"","v":{"$error":"#N/A"}},{"$f":"ROUND(PAGE6!$P$49,5)","v":0},{"$f":"ROUND(PAGE6!$R$49,5)","v":0}]
[{"$f":"$C$1&\".E30A.REM.FR.PVFIN.OS._INT.14.1_15_PERCT\"","v":{"$error":"#N/A"}},{"$f":"ROUND(PAGE6!$C$50,5)","v":0},{"$f":"ROUND(PAGE6!$E$50,5)","v":0}]
[{"$f":"$C$1&\".E30A.REM.VAR.PVFIN.OS._INT.14.1_15_PERCT\"","v":{"$error":"#N/A"}},{"$f":"ROUND(PAGE6!$G$50,5)","v":0},{"$f":"ROUND(PAGE6!$I$50,5)","v":0}]
[{"$f":"$C$1&\".E30A.REM.ADJ.PVFIN.OS._INT.14.1_15_PERCT\"","v":{"$error":"#N/A"}},{"$f":"ROUND(PAGE6!$K$50,5)","v":0},{"$f":"ROUND(PAGE6!$M$50,5)","v":0}]
[{"$f":"$C$1&\".E30A.REM.PVFIN.OS._INT.14.1_15_PERCT.TTL\"","v":{"$error":"#N/A"}},{"$f":"ROUND(PAGE6!$P$50,5)","v":0},{"$f":"ROUND(PAGE6!$R$50,5)","v":0}]
[{"$f":"$C$1&\".E30A.REM.FR.PVFIN.OS._INT.OVR_15.1_PERCT\"","v":{"$error":"#N/A"}},{"$f":"ROUND(PAGE6!$C$51,5)","v":0},{"$f":"ROUND(PAGE6!$E$51,5)","v":0}]
[{"$f":"$C$1&\".E30A.REM.VAR.PVFIN.OS._INT.OVR_15.1_PERCT\"","v":{"$error":"#N/A"}},{"$f":"ROUND(PAGE6!$G$51,5)","v":0},{"$f":"ROUND(PAGE6!$I$51,5)","v":0}]
[{"$f":"$C$1&\".E30A.REM.ADJ.PVFIN.OS._INT.OVR_15.1_PERCT\"","v":{"$error":"#N/A"}},{"$f":"ROUND(PAGE6!$K$51,5)","v":0},{"$f":"ROUND(PAGE6!$M$51,5)","v":0}]
[{"$f":"$C$1&\".E30A.REM.PVFIN.OS._INT.OVR_15.1_PERCT.TTL\"","v":{"$error":"#N/A"}},{"$f":"ROUND(PAGE6!$P$51,5)","v":0},{"$f":"ROUND(PAGE6!$R$51,5)","v":0}]
[{"$f":"$C$1&\".E30A.REM.FR.IBUS.OS._INT.0_3_PERCT\"","v":{"$error":"#N/A"}},{"$f":"ROUND(PAGE6!$C$57,5)","v":0},{"$f":"ROUND(PAGE6!$E$57,5)","v":0}]
[{"$f":"$C$1&\".E30A.REM.VAR.IBUS.OS._INT.0_3_PERCT\"","v":{"$error":"#N/A"}},{"$f":"ROUND(PAGE6!$G$57,5)","v":0},{"$f":"ROUND(PAGE6!$I$57,5)","v":0}]
[{"$f":"$C$1&\".E30A.REM.ADJ.IBUS.OS._INT.0_3_PERCT\"","v":{"$error":"#N/A"}},{"$f":"ROUND(PAGE6!$K$57,5)","v":0},{"$f":"ROUND(PAGE6!$M$57,5)","v":0}]
[{"$f":"$C$1&\".E30A.REM.IBUS.OS._INT.0_3_PERCT.TTL\"","v":{"$error":"#N/A"}},{"$f":"ROUND(PAGE6!$P$57,5)","v":0},{"$f":"ROUND(PAGE6!$R$57,5)","v":0}]
[{"$f":"$C$1&\".E30A.REM.FR.IBUS.OS._INT.3.1_4_PERCT\"","v":{"$error":"#N/A"}},{"$f":"ROUND(PAGE6!$C$58,5)","v":0},{"$f":"ROUND(PAGE6!$E$58,5)","v":0}]
[{"$f":"$C$1&\".E30A.REM.VAR.IBUS.OS._INT.3.1_4_PERCT\"","v":{"$error":"#N/A"}},{"$f":"ROUND(PAGE6!$G$58,5)","v":0},{"$f":"ROUND(PAGE6!$I$58,5)","v":0}]
[{"$f":"$C$1&\".E30A.REM.ADJ.IBUS.OS._INT.3.1_4_PERCT\"","v":{"$error":"#N/A"}},{"$f":"ROUND(PAGE6!$K$58,5)","v":0},{"$f":"ROUND(PAGE6!$M$58,5)","v":0}]
[{"$f":"$C$1&\".E30A.REM.IBUS.OS._INT.3.1_4_PERCT.TTL\"","v":{"$error":"#N/A"}},{"$f":"ROUND(PAGE6!$P$58,5)","v":0},{"$f":"ROUND(PAGE6!$R$58,5)","v":0}]
[{"$f":"$C$1&\".E30A.REM.FR.IBUS.OS._INT.4.1_5_PERCT\"","v":{"$error":"#N/A"}},{"$f":"ROUND(PAGE6!$C$59,5)","v":0},{"$f":"ROUND(PAGE6!$E$59,5)","v":0}]
[{"$f":"$C$1&\".E30A.REM.VAR.IBUS.OS._INT.4.1_5_PERCT\"","v":{"$error":"#N/A"}},{"$f":"ROUND(PAGE6!$G$59,5)","v":0},{"$f":"ROUND(PAGE6!$I$59,5)","v":0}]
[{"$f":"$C$1&\".E30A.REM.ADJ.IBUS.OS._INT.4.1_5_PERCT\"","v":{"$error":"#N/A"}},{"$f":"ROUND(PAGE6!$K$59,5)","v":0},{"$f":"ROUND(PAGE6!$M$59,5)","v":0}]
[{"$f":"$C$1&\".E30A.REM.IBUS.OS._INT.4.1_5_PERCT.TTL\"","v":{"$error":"#N/A"}},{"$f":"ROUND(PAGE6!$P$59,5)","v":0},{"$f":"ROUND(PAGE6!$R$59,5)","v":0}]
[{"$f":"$C$1&\".E30A.REM.FR.IBUS.OS._INT.5.1_6_PERCT\"","v":{"$error":"#N/A"}},{"$f":"ROUND(PAGE6!$C$60,5)","v":0},{"$f":"ROUND(PAGE6!$E$60,5)","v":0}]
[{"$f":"$C$1&\".E30A.REM.VAR.IBUS.OS._INT.5.1_6_PERCT\"","v":{"$error":"#N/A"}},{"$f":"ROUND(PAGE6!$G$60,5)","v":0},{"$f":"ROUND(PAGE6!$I$60,5)","v":0}]
[{"$f":"$C$1&\".E30A.REM.ADJ.IBUS.OS._INT.5.1_6_PERCT\"","v":{"$error":"#N/A"}},{"$f":"ROUND(PAGE6!$K$60,5)","v":0},{"$f":"ROUND(PAGE6!$M$60,5)","v":0}]
[{"$f":"$C$1&\".E30A.REM.IBUS.OS._INT.5.1_6_PERCT.TTL\"","v":{"$error":"#N/A"}},{"$f":"ROUND(PAGE6!$P$60,5)","v":0},{"$f":"ROUND(PAGE6!$R$60,5)","v":0}]
[{"$f":"$C$1&\".E30A.REM.FR.IBUS.OS._INT.6.1_7_PERCT\"","v":{"$error":"#N/A"}},{"$f":"ROUND(PAGE6!$C$61,5)","v":0},{"$f":"ROUND(PAGE6!$E$61,5)","v":0}]
[{"$f":"$C$1&\".E30A.REM.VAR.IBUS.OS._INT.6.1_7_PERCT\"","v":{"$error":"#N/A"}},{"$f":"ROUND(PAGE6!$G$61,5)","v":0},{"$f":"ROUND(PAGE6!$I$61,5)","v":0}]
[{"$f":"$C$1&\".E30A.REM.ADJ.IBUS.OS._INT.6.1_7_PERCT\"","v":{"$error":"#N/A"}},{"$f":"ROUND(PAGE6!$K$61,5)","v":0},{"$f":"ROUND(PAGE6!$M$61,5)","v":0}]
[{"$f":"$C$1&\".E30A.REM.IBUS.OS._INT.6.1_7_PERCT.TTL\"","v":{"$error":"#N/A"}},{"$f":"ROUND(PAGE6!$P$61,5)","v":0},{"$f":"ROUND(PAGE6!$R$61,5)","v":0}]
[{"$f":"$C$1&\".E30A.REM.FR.IBUS.OS._INT.7.1_8_PERCT\"","v":{"$error":"#N/A"}},{"$f":"ROUND(PAGE6!$C$62,5)","v":0},{"$f":"ROUND(PAGE6!$E$62,5)","v":0}]
[{"$f":"$C$1&\".E30A.REM.VAR.IBUS.OS._INT.7.1_8_PERCT\"","v":{"$error":"#N/A"}},{"$f":"ROUND(PAGE6!$G$62,5)","v":0},{"$f":"ROUND(PAGE6!$I$62,5)","v":0}]
[{"$f":"$C$1&\".E30A.REM.ADJ.IBUS.OS._INT.7.1_8_PERCT\"","v":{"$error":"#N/A"}},{"$f":"ROUND(PAGE6!$K$62,5)","v":0},{"$f":"ROUND(PAGE6!$M$62,5)","v":0}]
[{"$f":"$C$1&\".E30A.REM.IBUS.OS._INT.7.1_8_PERCT.TTL\"","v":{"$error":"#N/A"}},{"$f":"ROUND(PAGE6!$P$62,5)","v":0},{"$f":"ROUND(PAGE6!$R$62,5)","v":0}]
[{"$f":"$C$1&\".E30A.REM.FR.IBUS.OS._INT.8.1_9_PERCT\"","v":{"$error":"#N/A"}},{"$f":"ROUND(PAGE6!$C$63,5)","v":0},{"$f":"ROUND(PAGE6!$E$63,5)","v":0}]
[{"$f":"$C$1&\".E30A.REM.VAR.IBUS.OS._INT.8.1_9_PERCT\"","v":{"$error":"#N/A"}},{"$f":"ROUND(PAGE6!$G$63,5)","v":0},{"$f":"ROUND(PAGE6!$I$63,5)","v":0}]
[{"$f":"$C$1&\".E30A.REM.ADJ.IBUS.OS._INT.8.1_9_PERCT\"","v":{"$error":"#N/A"}},{"$f":"ROUND(PAGE6!$K$63,5)","v":0},{"$f":"ROUND(PAGE6!$M$63,5)","v":0}]
[{"$f":"$C$1&\".E30A.REM.IBUS.OS._INT.8.1_9_PERCT.TTL\"","v":{"$error":"#N/A"}},{"$f":"ROUND(PAGE6!$P$63,5)","v":0},{"$f":"ROUND(PAGE6!$R$63,5)","v":0}]
[{"$f":"$C$1&\".E30A.REM.FR.IBUS.OS._INT.9.1_10_PERCT\"","v":{"$error":"#N/A"}},{"$f":"ROUND(PAGE6!$C$64,5)","v":0},{"$f":"ROUND(PAGE6!$E$64,5)","v":0}]
[{"$f":"$C$1&\".E30A.REM.VAR.IBUS.OS._INT.9.1_10_PERCT\"","v":{"$error":"#N/A"}},{"$f":"ROUND(PAGE6!$G$64,5)","v":0},{"$f":"ROUND(PAGE6!$I$64,5)","v":0}]
[{"$f":"$C$1&\".E30A.REM.ADJ.IBUS.OS._INT.9.1_10_PERCT\"","v":{"$error":"#N/A"}},{"$f":"ROUND(PAGE6!$K$64,5)","v":0},{"$f":"ROUND(PAGE6!$M$64,5)","v":0}]
[{"$f":"$C$1&\".E30A.REM.IBUS.OS._INT.9.1_10_PERCT.TTL\"","v":{"$error":"#N/A"}},{"$f":"ROUND(PAGE6!$P$64,5)","v":0},{"$f":"ROUND(PAGE6!$R$64,5)","v":0}]
[{"$f":"$C$1&\".E30A.REM.FR.IBUS.OS._INT.10.1_11_PERCT\"","v":{"$error":"#N/A"}},{"$f":"ROUND(PAGE6!$C$65,5)","v":0},{"$f":"ROUND(PAGE6!$E$65,5)","v":0}]
[{"$f":"$C$1&\".E30A.REM.VAR.IBUS.OS._INT.10.1_11_PERCT\"","v":{"$error":"#N/A"}},{"$f":"ROUND(PAGE6!$G$65,5)","v":0},{"$f":"ROUND(PAGE6!$I$65,5)","v":0}]
[{"$f":"$C$1&\".E30A.REM.ADJ.IBUS.OS._INT.10.1_11_PERCT\"","v":{"$error":"#N/A"}},{"$f":"ROUND(PAGE6!$K$65,5)","v":0},{"$f":"ROUND(PAGE6!$M$65,5)","v":0}]
[{"$f":"$C$1&\".E30A.REM.IBUS.OS._INT.10.1_11_PERCT.TTL\"","v":{"$error":"#N/A"}},{"$f":"ROUND(PAGE6!$P$65,5)","v":0},{"$f":"ROUND(PAGE6!$R$65,5)","v":0}]
[{"$f":"$C$1&\".E30A.REM.FR.IBUS.OS._INT.11.1_12_PERCT\"","v":{"$error":"#N/A"}},{"$f":"ROUND(PAGE6!$C$66,5)","v":0},{"$f":"ROUND(PAGE6!$E$66,5)","v":0}]
[{"$f":"$C$1&\".E30A.REM.VAR.IBUS.OS._INT.11.1_12_PERCT\"","v":{"$error":"#N/A"}},{"$f":"ROUND(PAGE6!$G$66,5)","v":0},{"$f":"ROUND(PAGE6!$I$66,5)","v":0}]
[{"$f":"$C$1&\".E30A.REM.ADJ.IBUS.OS._INT.11.1_12_PERCT\"","v":{"$error":"#N/A"}},{"$f":"ROUND(PAGE6!$K$66,5)","v":0},{"$f":"ROUND(PAGE6!$M$66,5)","v":0}]
[{"$f":"$C$1&\".E30A.REM.IBUS.OS._INT.11.1_12_PERCT.TTL\"","v":{"$error":"#N/A"}},{"$f":"ROUND(PAGE6!$P$66,5)","v":0},{"$f":"ROUND(PAGE6!$R$66,5)","v":0}]
[{"$f":"$C$1&\".E30A.REM.FR.IBUS.OS._INT.12.1_13_PERCT\"","v":{"$error":"#N/A"}},{"$f":"ROUND(PAGE6!$C$67,5)","v":0},{"$f":"ROUND(PAGE6!$E$67,5)","v":0}]
[{"$f":"$C$1&\".E30A.REM.VAR.IBUS.OS._INT.12.1_13_PERCT\"","v":{"$error":"#N/A"}},{"$f":"ROUND(PAGE6!$G$67,5)","v":0},{"$f":"ROUND(PAGE6!$I$67,5)","v":0}]
[{"$f":"$C$1&\".E30A.REM.ADJ.IBUS.OS._INT.12.1_13_PERCT\"","v":{"$error":"#N/A"}},{"$f":"ROUND(PAGE6!$K$67,5)","v":0},{"$f":"ROUND(PAGE6!$M$67,5)","v":0}]
[{"$f":"$C$1&\".E30A.REM.IBUS.OS._INT.12.1_13_PERCT.TTL\"","v":{"$error":"#N/A"}},{"$f":"ROUND(PAGE6!$P$67,5)","v":0},{"$f":"ROUND(PAGE6!$R$67,5)","v":0}]
[{"$f":"$C$1&\".E30A.REM.FR.IBUS.OS._INT.13.1_14_PERCT\"","v":{"$error":"#N/A"}},{"$f":"ROUND(PAGE6!$C$68,5)","v":0},{"$f":"ROUND(PAGE6!$E$68,5)","v":0}]
[{"$f":"$C$1&\".E30A.REM.VAR.IBUS.OS._INT.13.1_14_PERCT\"","v":{"$error":"#N/A"}},{"$f":"ROUND(PAGE6!$G$68,5)","v":0},{"$f":"ROUND(PAGE6!$I$68,5)","v":0}]
[{"$f":"$C$1&\".E30A.REM.ADJ.IBUS.OS._INT.13.1_14_PERCT\"","v":{"$error":"#N/A"}},{"$f":"ROUND(PAGE6!$K$68,5)","v":0},{"$f":"ROUND(PAGE6!$M$68,5)","v":0}]
[{"$f":"$C$1&\".E30A.REM.IBUS.OS._INT.13.1_14_PERCT.TTL\"","v":{"$error":"#N/A"}},{"$f":"ROUND(PAGE6!$P$68,5)","v":0},{"$f":"ROUND(PAGE6!$R$68,5)","v":0}]
[{"$f":"$C$1&\".E30A.REM.FR.IBUS.OS._INT.14.1_15_PERCT\"","v":{"$error":"#N/A"}},{"$f":"ROUND(PAGE6!$C$69,5)","v":0},{"$f":"ROUND(PAGE6!$E$69,5)","v":0}]
[{"$f":"$C$1&\".E30A.REM.VAR.IBUS.OS._INT.14.1_15_PERCT\"","v":{"$error":"#N/A"}},{"$f":"ROUND(PAGE6!$G$69,5)","v":0},{"$f":"ROUND(PAGE6!$I$69,5)","v":0}]
[{"$f":"$C$1&\".E30A.REM.ADJ.IBUS.OS._INT.14.1_15_PERCT\"","v":{"$error":"#N/A"}},{"$f":"ROUND(PAGE6!$K$69,5)","v":0},{"$f":"ROUND(PAGE6!$M$69,5)","v":0}]
[{"$f":"$C$1&\".E30A.REM.IBUS.OS._INT.14.1_15_PERCT.TTL\"","v":{"$error":"#N/A"}},{"$f":"ROUND(PAGE6!$P$69,5)","v":0},{"$f":"ROUND(PAGE6!$R$69,5)","v":0}]
[{"$f":"$C$1&\".E30A.REM.FR.IBUS.OS._INT.OVR_15.1_PERCT\"","v":{"$error":"#N/A"}},{"$f":"ROUND(PAGE6!$C$70,5)","v":0},{"$f":"ROUND(PAGE6!$E$70,5)","v":0}]
[{"$f":"$C$1&\".E30A.REM.VAR.IBUS.OS._INT.OVR_15.1_PERCT\"","v":{"$error":"#N/A"}},{"$f":"ROUND(PAGE6!$G$70,5)","v":0},{"$f":"ROUND(PAGE6!$I$70,5)","v":0}]
[{"$f":"$C$1&\".E30A.REM.ADJ.IBUS.OS._INT.OVR_15.1_PERCT\"","v":{"$error":"#N/A"}},{"$f":"ROUND(PAGE6!$K$70,5)","v":0},{"$f":"ROUND(PAGE6!$M$70,5)","v":0}]
[{"$f":"$C$1&\".E30A.REM.IBUS.OS._INT.OVR_15.1_PERCT.TTL\"","v":{"$error":"#N/A"}},{"$f":"ROUND(PAGE6!$P$70,5)","v":0},{"$f":"ROUND(PAGE6!$R$70,5)","v":0}]
[{"$f":"$C$1&\".E30A.REM.FR.UIBUS.OS._INT.0_3_PERCT\"","v":{"$error":"#N/A"}},{"$f":"ROUND(PAGE6!$C$76,5)","v":0},{"$f":"ROUND(PAGE6!$E$76,5)","v":0}]
[{"$f":"$C$1&\".E30A.REM.VAR.UIBUS.OS._INT.0_3_PERCT\"","v":{"$error":"#N/A"}},{"$f":"ROUND(PAGE6!$G$76,5)","v":0},{"$f":"ROUND(PAGE6!$I$76,5)","v":0}]
[{"$f":"$C$1&\".E30A.REM.ADJ.UIBUS.OS._INT.0_3_PERCT\"","v":{"$error":"#N/A"}},{"$f":"ROUND(PAGE6!$K$76,5)","v":0},{"$f":"ROUND(PAGE6!$M$76,5)","v":0}]
[{"$f":"$C$1&\".E30A.REM.UIBUS.OS._INT.0_3_PERCT.TTL\"","v":{"$error":"#N/A"}},{"$f":"ROUND(PAGE6!$P$76,5)","v":0},{"$f":"ROUND(PAGE6!$R$76,5)","v":0}]
[{"$f":"$C$1&\".E30A.REM.FR.UIBUS.OS._INT.3.1_4_PERCT\"","v":{"$error":"#N/A"}},{"$f":"ROUND(PAGE6!$C$77,5)","v":0},{"$f":"ROUND(PAGE6!$E$77,5)","v":0}]
[{"$f":"$C$1&\".E30A.REM.VAR.UIBUS.OS._INT.3.1_4_PERCT\"","v":{"$error":"#N/A"}},{"$f":"ROUND(PAGE6!$G$77,5)","v":0},{"$f":"ROUND(PAGE6!$I$77,5)","v":0}]
[{"$f":"$C$1&\".E30A.REM.ADJ.UIBUS.OS._INT.3.1_4_PERCT\"","v":{"$error":"#N/A"}},{"$f":"ROUND(PAGE6!$K$77,5)","v":0},{"$f":"ROUND(PAGE6!$M$77,5)","v":0}]
[{"$f":"$C$1&\".E30A.REM.UIBUS.OS._INT.3.1_4_PERCT.TTL\"","v":{"$error":"#N/A"}},{"$f":"ROUND(PAGE6!$P$77,5)","v":0},{"$f":"ROUND(PAGE6!$R$77,5)","v":0}]
[{"$f":"$C$1&\".E30A.REM.FR.UIBUS.OS._INT.4.1_5_PERCT\"","v":{"$error":"#N/A"}},{"$f":"ROUND(PAGE6!$C$78,5)","v":0},{"$f":"ROUND(PAGE6!$E$78,5)","v":0}]
[{"$f":"$C$1&\".E30A.REM.VAR.UIBUS.OS._INT.4.1_5_PERCT\"","v":{"$error":"#N/A"}},{"$f":"ROUND(PAGE6!$G$78,5)","v":0},{"$f":"ROUND(PAGE6!$I$78,5)","v":0}]
[{"$f":"$C$1&\".E30A.REM.ADJ.UIBUS.OS._INT.4.1_5_PERCT\"","v":{"$error":"#N/A"}},{"$f":"ROUND(PAGE6!$K$78,5)","v":0},{"$f":"ROUND(PAGE6!$M$78,5)","v":0}]
[{"$f":"$C$1&\".E30A.REM.UIBUS.OS._INT.4.1_5_PERCT.TTL\"","v":{"$error":"#N/A"}},{"$f":"ROUND(PAGE6!$P$78,5)","v":0},{"$f":"ROUND(PAGE6!$R$78,5)","v":0}]
[{"$f":"$C$1&\".E30A.REM.FR.UIBUS.OS._INT.5.1_6_PERCT\"","v":{"$error":"#N/A"}},{"$f":"ROUND(PAGE6!$C$79,5)","v":0},{"$f":"ROUND(PAGE6!$E$79,5)","v":0}]
[{"$f":"$C$1&\".E30A.REM.VAR.UIBUS.OS._INT.5.1_6_PERCT\"","v":{"$error":"#N/A"}},{"$f":"ROUND(PAGE6!$G$79,5)","v":0},{"$f":"ROUND(PAGE6!$I$79,5)","v":0}]
[{"$f":"$C$1&\".E30A.REM.ADJ.UIBUS.OS._INT.5.1_6_PERCT\"","v":{"$error":"#N/A"}},{"$f":"ROUND(PAGE6!$K$79,5)","v":0},{"$f":"ROUND(PAGE6!$M$79,5)","v":0}]
[{"$f":"$C$1&\".E30A.REM.UIBUS.OS._INT.5.1_6_PERCT.TTL\"","v":{"$error":"#N/A"}},{"$f":"ROUND(PAGE6!$P$79,5)","v":0},{"$f":"ROUND(PAGE6!$R$79,5)","v":0}]
[{"$f":"$C$1&\".E30A.REM.FR.UIBUS.OS._INT.6.1_7_PERCT\"","v":{"$error":"#N/A"}},{"$f":"ROUND(PAGE6!$C$80,5)","v":0},{"$f":"ROUND(PAGE6!$E$80,5)","v":0}]
[{"$f":"$C$1&\".E30A.REM.VAR.UIBUS.OS._INT.6.1_7_PERCT\"","v":{"$error":"#N/A"}},{"$f":"ROUND(PAGE6!$G$80,5)","v":0},{"$f":"ROUND(PAGE6!$I$80,5)","v":0}]
[{"$f":"$C$1&\".E30A.REM.ADJ.UIBUS.OS._INT.6.1_7_PERCT\"","v":{"$error":"#N/A"}},{"$f":"ROUND(PAGE6!$K$80,5)","v":0},{"$f":"ROUND(PAGE6!$M$80,5)","v":0}]
[{"$f":"$C$1&\".E30A.REM.UIBUS.OS._INT.6.1_7_PERCT.TTL\"","v":{"$error":"#N/A"}},{"$f":"ROUND(PAGE6!$P$80,5)","v":0},{"$f":"ROUND(PAGE6!$R$80,5)","v":0}]
[{"$f":"$C$1&\".E30A.REM.FR.UIBUS.OS._INT.7.1_8_PERCT\"","v":{"$error":"#N/A"}},{"$f":"ROUND(PAGE6!$C$81,5)","v":0},{"$f":"ROUND(PAGE6!$E$81,5)","v":0}]
[{"$f":"$C$1&\".E30A.REM.VAR.UIBUS.OS._INT.7.1_8_PERCT\"","v":{"$error":"#N/A"}},{"$f":"ROUND(PAGE6!$G$81,5)","v":0},{"$f":"ROUND(PAGE6!$I$81,5)","v":0}]
[{"$f":"$C$1&\".E30A.REM.ADJ.UIBUS.OS._INT.7.1_8_PERCT\"","v":{"$error":"#N/A"}},{"$f":"ROUND(PAGE6!$K$81,5)","v":0},{"$f":"ROUND(PAGE6!$M$81,5)","v":0}]
[{"$f":"$C$1&\".E30A.REM.UIBUS.OS._INT.7.1_8_PERCT.TTL\"","v":{"$error":"#N/A"}},{"$f":"ROUND(PAGE6!$P$81,5)","v":0},{"$f":"ROUND(PAGE6!$R$81,5)","v":0}]
[{"$f":"$C$1&\".E30A.REM.FR.UIBUS.OS._INT.8.1_9_PERCT\"","v":{"$error":"#N/A"}},{"$f":"ROUND(PAGE6!$C$82,5)","v":0},{"$f":"ROUND(PAGE6!$E$82,5)","v":0}]
[{"$f":"$C$1&\".E30A.REM.VAR.UIBUS.OS._INT.8.1_9_PERCT\"","v":{"$error":"#N/A"}},{"$f":"ROUND(PAGE6!$G$82,5)","v":0},{"$f":"ROUND(PAGE6!$I$82,5)","v":0}]
[{"$f":"$C$1&\".E30A.REM.ADJ.UIBUS.OS._INT.8.1_9_PERCT\"","v":{"$error":"#N/A"}},{"$f":"ROUND(PAGE6!$K$82,5)","v":0},{"$f":"ROUND(PAGE6!$M$82,5)","v":0}]
[{"$f":"$C$1&\".E30A.REM.UIBUS.OS._INT.8.1_9_PERCT.TTL\"","v":{"$error":"#N/A"}},{"$f":"ROUND(PAGE6!$P$82,5)","v":0},{"$f":"ROUND(PAGE6!$R$82,5)","v":0}]
[{"$f":"$C$1&\".E30A.REM.FR.UIBUS.OS._INT.9.1_10_PERCT\"","v":{"$error":"#N/A"}},{"$f":"ROUND(PAGE6!$C$83,5)","v":0},{"$f":"ROUND(PAGE6!$E$83,5)","v":0}]
[{"$f":"$C$1&\".E30A.REM.VAR.UIBUS.OS._INT.9.1_10_PERCT\"","v":{"$error":"#N/A"}},{"$f":"ROUND(PAGE6!$G$83,5)","v":0},{"$f":"ROUND(PAGE6!$I$83,5)","v":0}]
[{"$f":"$C$1&\".E30A.REM.ADJ.UIBUS.OS._INT.9.1_10_PERCT\"","v":{"$error":"#N/A"}},{"$f":"ROUND(PAGE6!$K$83,5)","v":0},{"$f":"ROUND(PAGE6!$M$83,5)","v":0}]
[{"$f":"$C$1&\".E30A.REM.UIBUS.OS._INT.9.1_10_PERCT.TTL\"","v":{"$error":"#N/A"}},{"$f":"ROUND(PAGE6!$P$83,5)","v":0},{"$f":"ROUND(PAGE6!$R$83,5)","v":0}]
[{"$f":"$C$1&\".E30A.REM.FR.UIBUS.OS._INT.10.1_11_PERCT\"","v":{"$error":"#N/A"}},{"$f":"ROUND(PAGE6!$C$84,5)","v":0},{"$f":"ROUND(PAGE6!$E$84,5)","v":0}]
[{"$f":"$C$1&\".E30A.REM.VAR.UIBUS.OS._INT.10.1_11_PERCT\"","v":{"$error":"#N/A"}},{"$f":"ROUND(PAGE6!$G$84,5)","v":0},{"$f":"ROUND(PAGE6!$I$84,5)","v":0}]
[{"$f":"$C$1&\".E30A.REM.ADJ.UIBUS.OS._INT.10.1_11_PERCT\"","v":{"$error":"#N/A"}},{"$f":"ROUND(PAGE6!$K$84,5)","v":0},{"$f":"ROUND(PAGE6!$M$84,5)","v":0}]
[{"$f":"$C$1&\".E30A.REM.UIBUS.OS._INT.10.1_11_PERCT.TTL\"","v":{"$error":"#N/A"}},{"$f":"ROUND(PAGE6!$P$84,5)","v":0},{"$f":"ROUND(PAGE6!$R$84,5)","v":0}]
[{"$f":"$C$1&\".E30A.REM.FR.UIBUS.OS._INT.11.1_12_PERCT\"","v":{"$error":"#N/A"}},{"$f":"ROUND(PAGE6!$C$85,5)","v":0},{"$f":"ROUND(PAGE6!$E$85,5)","v":0}]
[{"$f":"$C$1&\".E30A.REM.VAR.UIBUS.OS._INT.11.1_12_PERCT\"","v":{"$error":"#N/A"}},{"$f":"ROUND(PAGE6!$G$85,5)","v":0},{"$f":"ROUND(PAGE6!$I$85,5)","v":0}]
[{"$f":"$C$1&\".E30A.REM.ADJ.UIBUS.OS._INT.11.1_12_PERCT\"","v":{"$error":"#N/A"}},{"$f":"ROUND(PAGE6!$K$85,5)","v":0},{"$f":"ROUND(PAGE6!$M$85,5)","v":0}]
[{"$f":"$C$1&\".E30A.REM.UIBUS.OS._INT.11.1_12_PERCT.TTL\"","v":{"$error":"#N/A"}},{"$f":"ROUND(PAGE6!$P$85,5)","v":0},{"$f":"ROUND(PAGE6!$R$85,5)","v":0}]
[{"$f":"$C$1&\".E30A.REM.FR.UIBUS.OS._INT.12.1_13_PERCT\"","v":{"$error":"#N/A"}},{"$f":"ROUND(PAGE6!$C$86,5)","v":0},{"$f":"ROUND(PAGE6!$E$86,5)","v":0}]
[{"$f":"$C$1&\".E30A.REM.VAR.UIBUS.OS._INT.12.1_13_PERCT\"","v":{"$error":"#N/A"}},{"$f":"ROUND(PAGE6!$G$86,5)","v":0},{"$f":"ROUND(PAGE6!$I$86,5)","v":0}]
[{"$f":"$C$1&\".E30A.REM.ADJ.UIBUS.OS._INT.12.1_13_PERCT\"","v":{"$error":"#N/A"}},{"$f":"ROUND(PAGE6!$K$86,5)","v":0},{"$f":"ROUND(PAGE6!$M$86,5)","v":0}]
[{"$f":"$C$1&\".E30A.REM.UIBUS.OS._INT.12.1_13_PERCT.TTL\"","v":{"$error":"#N/A"}},{"$f":"ROUND(PAGE6!$P$86,5)","v":0},{"$f":"ROUND(PAGE6!$R$86,5)","v":0}]
[{"$f":"$C$1&\".E30A.REM.FR.UIBUS.OS._INT.13.1_14_PERCT\"","v":{"$error":"#N/A"}},{"$f":"ROUND(PAGE6!$C$87,5)","v":0},{"$f":"ROUND(PAGE6!$E$87,5)","v":0}]
[{"$f":"$C$1&\".E30A.REM.VAR.UIBUS.OS._INT.13.1_14_PERCT\"","v":{"$error":"#N/A"}},{"$f":"ROUND(PAGE6!$G$87,5)","v":0},{"$f":"ROUND(PAGE6!$I$87,5)","v":0}]
[{"$f":"$C$1&\".E30A.REM.ADJ.UIBUS.OS._INT.13.1_14_PERCT\"","v":{"$error":"#N/A"}},{"$f":"ROUND(PAGE6!$K$87,5)","v":0},{"$f":"ROUND(PAGE6!$M$87,5)","v":0}]
[{"$f":"$C$1&\".E30A.REM.UIBUS.OS._INT.13.1_14_PERCT.TTL\"","v":{"$error":"#N/A"}},{"$f":"ROUND(PAGE6!$P$87,5)","v":0},{"$f":"ROUND(PAGE6!$R$87,5)","v":0}]
[{"$f":"$C$1&\".E30A.REM.FR.UIBUS.OS._INT.14.1_15_PERCT\"","v":{"$error":"#N/A"}},{"$f":"ROUND(PAGE6!$C$88,5)","v":0},{"$f":"ROUND(PAGE6!$E$88,5)","v":0}]
[{"$f":"$C$1&\".E30A.REM.VAR.UIBUS.OS._INT.14.1_15_PERCT\"","v":{"$error":"#N/A"}},{"$f":"ROUND(PAGE6!$G$88,5)","v":0},{"$f":"ROUND(PAGE6!$I$88,5)","v":0}]
[{"$f":"$C$1&\".E30A.REM.ADJ.UIBUS.OS._INT.14.1_15_PERCT\"","v":{"$error":"#N/A"}},{"$f":"ROUND(PAGE6!$K$88,5)","v":0},{"$f":"ROUND(PAGE6!$M$88,5)","v":0}]
[{"$f":"$C$1&\".E30A.REM.UIBUS.OS._INT.14.1_15_PERCT.TTL\"","v":{"$error":"#N/A"}},{"$f":"ROUND(PAGE6!$P$88,5)","v":0},{"$f":"ROUND(PAGE6!$R$88,5)","v":0}]
[{"$f":"$C$1&\".E30A.REM.FR.UIBUS.OS._INT.OVR_15.1_PERCT\"","v":{"$error":"#N/A"}},{"$f":"ROUND(PAGE6!$C$89,5)","v":0},{"$f":"ROUND(PAGE6!$E$89,5)","v":0}]
[{"$f":"$C$1&\".E30A.REM.VAR.UIBUS.OS._INT.OVR_15.1_PERCT\"","v":{"$error":"#N/A"}},{"$f":"ROUND(PAGE6!$G$89,5)","v":0},{"$f":"ROUND(PAGE6!$I$89,5)","v":0}]
[{"$f":"$C$1&\".E30A.REM.ADJ.UIBUS.OS._INT.OVR_15.1_PERCT\"","v":{"$error":"#N/A"}},{"$f":"ROUND(PAGE6!$K$89,5)","v":0},{"$f":"ROUND(PAGE6!$M$89,5)","v":0}]
[{"$f":"$C$1&\".E30A.REM.UIBUS.OS._INT.OVR_15.1_PERCT.TTL\"","v":{"$error":"#N/A"}},{"$f":"ROUND(PAGE6!$P$89,5)","v":0},{"$f":"ROUND(PAGE6!$R$89,5)","v":0}]
[{"$f":"$C$1&\".E30A.REM.FR.CONSM.OS._INT.0_3_PERCT\"","v":{"$error":"#N/A"}},{"$f":"ROUND(PAGE6!$C$94,5)","v":0},{"$f":"ROUND(PAGE6!$E$94,5)","v":0}]
[{"$f":"$C$1&\".E30A.REM.VAR.CONSM.OS._INT.0_3_PERCT\"","v":{"$error":"#N/A"}},{"$f":"ROUND(PAGE6!$G$94,5)","v":0},{"$f":"ROUND(PAGE6!$I$94,5)","v":0}]
[{"$f":"$C$1&\".E30A.REM.ADJ.CONSM.OS._INT.0_3_PERCT\"","v":{"$error":"#N/A"}},{"$f":"ROUND(PAGE6!$K$94,5)","v":0},{"$f":"ROUND(PAGE6!$M$94,5)","v":0}]
[{"$f":"$C$1&\".E30A.REM.CONSM.OS._INT.0_3_PERCT.TTL\"","v":{"$error":"#N/A"}},{"$f":"ROUND(PAGE6!$P$94,5)","v":0},{"$f":"ROUND(PAGE6!$R$94,5)","v":0}]
[{"$f":"$C$1&\".E30A.REM.FR.CONSM.OS._INT.3.1_4_PERCT\"","v":{"$error":"#N/A"}},{"$f":"ROUND(PAGE6!$C$95,5)","v":0},{"$f":"ROUND(PAGE6!$E$95,5)","v":0}]
[{"$f":"$C$1&\".E30A.REM.VAR.CONSM.OS._INT.3.1_4_PERCT\"","v":{"$error":"#N/A"}},{"$f":"ROUND(PAGE6!$G$95,5)","v":0},{"$f":"ROUND(PAGE6!$I$95,5)","v":0}]
[{"$f":"$C$1&\".E30A.REM.ADJ.CONSM.OS._INT.3.1_4_PERCT\"","v":{"$error":"#N/A"}},{"$f":"ROUND(PAGE6!$K$95,5)","v":0},{"$f":"ROUND(PAGE6!$M$95,5)","v":0}]
[{"$f":"$C$1&\".E30A.REM.CONSM.OS._INT.3.1_4_PERCT.TTL\"","v":{"$error":"#N/A"}},{"$f":"ROUND(PAGE6!$P$95,5)","v":0},{"$f":"ROUND(PAGE6!$R$95,5)","v":0}]
[{"$f":"$C$1&\".E30A.REM.FR.CONSM.OS._INT.4.1_5_PERCT\"","v":{"$error":"#N/A"}},{"$f":"ROUND(PAGE6!$C$96,5)","v":0},{"$f":"ROUND(PAGE6!$E$96,5)","v":0}]
[{"$f":"$C$1&\".E30A.REM.VAR.CONSM.OS._INT.4.1_5_PERCT\"","v":{"$error":"#N/A"}},{"$f":"ROUND(PAGE6!$G$96,5)","v":0},{"$f":"ROUND(PAGE6!$I$96,5)","v":0}]
[{"$f":"$C$1&\".E30A.REM.ADJ.CONSM.OS._INT.4.1_5_PERCT\"","v":{"$error":"#N/A"}},{"$f":"ROUND(PAGE6!$K$96,5)","v":0},{"$f":"ROUND(PAGE6!$M$96,5)","v":0}]
[{"$f":"$C$1&\".E30A.REM.CONSM.OS._INT.4.1_5_PERCT.TTL\"","v":{"$error":"#N/A"}},{"$f":"ROUND(PAGE6!$P$96,5)","v":0},{"$f":"ROUND(PAGE6!$R$96,5)","v":0}]
[{"$f":"$C$1&\".E30A.REM.FR.CONSM.OS._INT.5.1_6_PERCT\"","v":{"$error":"#N/A"}},{"$f":"ROUND(PAGE6!$C$97,5)","v":0},{"$f":"ROUND(PAGE6!$E$97,5)","v":0}]
[{"$f":"$C$1&\".E30A.REM.VAR.CONSM.OS._INT.5.1_6_PERCT\"","v":{"$error":"#N/A"}},{"$f":"ROUND(PAGE6!$G$97,5)","v":0},{"$f":"ROUND(PAGE6!$I$97,5)","v":0}]
[{"$f":"$C$1&\".E30A.REM.ADJ.CONSM.OS._INT.5.1_6_PERCT\"","v":{"$error":"#N/A"}},{"$f":"ROUND(PAGE6!$K$97,5)","v":0},{"$f":"ROUND(PAGE6!$M$97,5)","v":0}]
[{"$f":"$C$1&\".E30A.REM.CONSM.OS._INT.5.1_6_PERCT.TTL\"","v":{"$error":"#N/A"}},{"$f":"ROUND(PAGE6!$P$97,5)","v":0},{"$f":"ROUND(PAGE6!$R$97,5)","v":0}]
[{"$f":"$C$1&\".E30A.REM.FR.CONSM.OS._INT.6.1_7_PERCT\"","v":{"$error":"#N/A"}},{"$f":"ROUND(PAGE6!$C$98,5)","v":0},{"$f":"ROUND(PAGE6!$E$98,5)","v":0}]
[{"$f":"$C$1&\".E30A.REM.VAR.CONSM.OS._INT.6.1_7_PERCT\"","v":{"$error":"#N/A"}},{"$f":"ROUND(PAGE6!$G$98,5)","v":0},{"$f":"ROUND(PAGE6!$I$98,5)","v":0}]
[{"$f":"$C$1&\".E30A.REM.ADJ.CONSM.OS._INT.6.1_7_PERCT\"","v":{"$error":"#N/A"}},{"$f":"ROUND(PAGE6!$K$98,5)","v":0},{"$f":"ROUND(PAGE6!$M$98,5)","v":0}]
[{"$f":"$C$1&\".E30A.REM.CONSM.OS._INT.6.1_7_PERCT.TTL\"","v":{"$error":"#N/A"}},{"$f":"ROUND(PAGE6!$P$98,5)","v":0},{"$f":"ROUND(PAGE6!$R$98,5)","v":0}]
[{"$f":"$C$1&\".E30A.REM.FR.CONSM.OS._INT.7.1_8_PERCT\"","v":{"$error":"#N/A"}},{"$f":"ROUND(PAGE6!$C$99,5)","v":0},{"$f":"ROUND(PAGE6!$E$99,5)","v":0}]
[{"$f":"$C$1&\".E30A.REM.VAR.CONSM.OS._INT.7.1_8_PERCT\"","v":{"$error":"#N/A"}},{"$f":"ROUND(PAGE6!$G$99,5)","v":0},{"$f":"ROUND(PAGE6!$I$99,5)","v":0}]
[{"$f":"$C$1&\".E30A.REM.ADJ.CONSM.OS._INT.7.1_8_PERCT\"","v":{"$error":"#N/A"}},{"$f":"ROUND(PAGE6!$K$99,5)","v":0},{"$f":"ROUND(PAGE6!$M$99,5)","v":0}]
[{"$f":"$C$1&\".E30A.REM.CONSM.OS._INT.7.1_8_PERCT.TTL\"","v":{"$error":"#N/A"}},{"$f":"ROUND(PAGE6!$P$99,5)","v":0},{"$f":"ROUND(PAGE6!$R$99,5)","v":0}]
[{"$f":"$C$1&\".E30A.REM.FR.CONSM.OS._INT.8.1_9_PERCT\"","v":{"$error":"#N/A"}},{"$f":"ROUND(PAGE6!$C$100,5)","v":0},{"$f":"ROUND(PAGE6!$E$100,5)","v":0}]
[{"$f":"$C$1&\".E30A.REM.VAR.CONSM.OS._INT.8.1_9_PERCT\"","v":{"$error":"#N/A"}},{"$f":"ROUND(PAGE6!$G$100,5)","v":0},{"$f":"ROUND(PAGE6!$I$100,5)","v":0}]
[{"$f":"$C$1&\".E30A.REM.ADJ.CONSM.OS._INT.8.1_9_PERCT\"","v":{"$error":"#N/A"}},{"$f":"ROUND(PAGE6!$K$100,5)","v":0},{"$f":"ROUND(PAGE6!$M$100,5)","v":0}]
[{"$f":"$C$1&\".E30A.REM.CONSM.OS._INT.8.1_9_PERCT.TTL\"","v":{"$error":"#N/A"}},{"$f":"ROUND(PAGE6!$P$100,5)","v":0},{"$f":"ROUND(PAGE6!$R$100,5)","v":0}]
[{"$f":"$C$1&\".E30A.REM.FR.CONSM.OS._INT.9.1_10_PERCT\"","v":{"$error":"#N/A"}},{"$f":"ROUND(PAGE6!$C$101,5)","v":0},{"$f":"ROUND(PAGE6!$E$101,5)","v":0}]
[{"$f":"$C$1&\".E30A.REM.VAR.CONSM.OS._INT.9.1_10_PERCT\"","v":{"$error":"#N/A"}},{"$f":"ROUND(PAGE6!$G$101,5)","v":0},{"$f":"ROUND(PAGE6!$I$101,5)","v":0}]
[{"$f":"$C$1&\".E30A.REM.ADJ.CONSM.OS._INT.9.1_10_PERCT\"","v":{"$error":"#N/A"}},{"$f":"ROUND(PAGE6!$K$101,5)","v":0},{"$f":"ROUND(PAGE6!$M$101,5)","v":0}]
[{"$f":"$C$1&\".E30A.REM.CONSM.OS._INT.9.1_10_PERCT.TTL\"","v":{"$error":"#N/A"}},{"$f":"ROUND(PAGE6!$P$101,5)","v":0},{"$f":"ROUND(PAGE6!$R$101,5)","v":0}]
[{"$f":"$C$1&\".E30A.REM.FR.CONSM.OS._INT.10.1_11_PERCT\"","v":{"$error":"#N/A"}},{"$f":"ROUND(PAGE6!$C$102,5)","v":0},{"$f":"ROUND(PAGE6!$E$102,5)","v":0}]
[{"$f":"$C$1&\".E30A.REM.VAR.CONSM.OS._INT.10.1_11_PERCT\"","v":{"$error":"#N/A"}},{"$f":"ROUND(PAGE6!$G$102,5)","v":0},{"$f":"ROUND(PAGE6!$I$102,5)","v":0}]
[{"$f":"$C$1&\".E30A.REM.ADJ.CONSM.OS._INT.10.1_11_PERCT\"","v":{"$error":"#N/A"}},{"$f":"ROUND(PAGE6!$K$102,5)","v":0},{"$f":"ROUND(PAGE6!$M$102,5)","v":0}]
[{"$f":"$C$1&\".E30A.REM.CONSM.OS._INT.10.1_11_PERCT.TTL\"","v":{"$error":"#N/A"}},{"$f":"ROUND(PAGE6!$P$102,5)","v":0},{"$f":"ROUND(PAGE6!$R$102,5)","v":0}]
[{"$f":"$C$1&\".E30A.REM.FR.CONSM.OS._INT.11.1_12_PERCT\"","v":{"$error":"#N/A"}},{"$f":"ROUND(PAGE6!$C$103,5)","v":0},{"$f":"ROUND(PAGE6!$E$103,5)","v":0}]
[{"$f":"$C$1&\".E30A.REM.VAR.CONSM.OS._INT.11.1_12_PERCT\"","v":{"$error":"#N/A"}},{"$f":"ROUND(PAGE6!$G$103,5)","v":0},{"$f":"ROUND(PAGE6!$I$103,5)","v":0}]
[{"$f":"$C$1&\".E30A.REM.ADJ.CONSM.OS._INT.11.1_12_PERCT\"","v":{"$error":"#N/A"}},{"$f":"ROUND(PAGE6!$K$103,5)","v":0},{"$f":"ROUND(PAGE6!$M$103,5)","v":0}]
[{"$f":"$C$1&\".E30A.REM.CONSM.OS._INT.11.1_12_PERCT.TTL\"","v":{"$error":"#N/A"}},{"$f":"ROUND(PAGE6!$P$103,5)","v":0},{"$f":"ROUND(PAGE6!$R$103,5)","v":0}]
[{"$f":"$C$1&\".E30A.REM.FR.CONSM.OS._INT.12.1_13_PERCT\"","v":{"$error":"#N/A"}},{"$f":"ROUND(PAGE6!$C$104,5)","v":0},{"$f":"ROUND(PAGE6!$E$104,5)","v":0}]
[{"$f":"$C$1&\".E30A.REM.VAR.CONSM.OS._INT.12.1_13_PERCT\"","v":{"$error":"#N/A"}},{"$f":"ROUND(PAGE6!$G$104,5)","v":0},{"$f":"ROUND(PAGE6!$I$104,5)","v":0}]
[{"$f":"$C$1&\".E30A.REM.ADJ.CONSM.OS._INT.12.1_13_PERCT\"","v":{"$error":"#N/A"}},{"$f":"ROUND(PAGE6!$K$104,5)","v":0},{"$f":"ROUND(PAGE6!$M$104,5)","v":0}]
[{"$f":"$C$1&\".E30A.REM.CONSM.OS._INT.12.1_13_PERCT.TTL\"","v":{"$error":"#N/A"}},{"$f":"ROUND(PAGE6!$P$104,5)","v":0},{"$f":"ROUND(PAGE6!$R$104,5)","v":0}]
[{"$f":"$C$1&\".E30A.REM.FR.CONSM.OS._INT.13.1_14_PERCT\"","v":{"$error":"#N/A"}},{"$f":"ROUND(PAGE6!$C$105,5)","v":0},{"$f":"ROUND(PAGE6!$E$105,5)","v":0}]
[{"$f":"$C$1&\".E30A.REM.VAR.CONSM.OS._INT.13.1_14_PERCT\"","v":{"$error":"#N/A"}},{"$f":"ROUND(PAGE6!$G$105,5)","v":0},{"$f":"ROUND(PAGE6!$I$105,5)","v":0}]
[{"$f":"$C$1&\".E30A.REM.ADJ.CONSM.OS._INT.13.1_14_PERCT\"","v":{"$error":"#N/A"}},{"$f":"ROUND(PAGE6!$K$105,5)","v":0},{"$f":"ROUND(PAGE6!$M$105,5)","v":0}]
[{"$f":"$C$1&\".E30A.REM.CONSM.OS._INT.13.1_14_PERCT.TTL\"","v":{"$error":"#N/A"}},{"$f":"ROUND(PAGE6!$P$105,5)","v":0},{"$f":"ROUND(PAGE6!$R$105,5)","v":0}]
[{"$f":"$C$1&\".E30A.REM.FR.CONSM.OS._INT.14.1_15_PERCT\"","v":{"$error":"#N/A"}},{"$f":"ROUND(PAGE6!$C$106,5)","v":0},{"$f":"ROUND(PAGE6!$E$106,5)","v":0}]
[{"$f":"$C$1&\".E30A.REM.VAR.CONSM.OS._INT.14.1_15_PERCT\"","v":{"$error":"#N/A"}},{"$f":"ROUND(PAGE6!$G$106,5)","v":0},{"$f":"ROUND(PAGE6!$I$106,5)","v":0}]
[{"$f":"$C$1&\".E30A.REM.ADJ.CONSM.OS._INT.14.1_15_PERCT\"","v":{"$error":"#N/A"}},{"$f":"ROUND(PAGE6!$K$106,5)","v":0},{"$f":"ROUND(PAGE6!$M$106,5)","v":0}]
[{"$f":"$C$1&\".E30A.REM.CONSM.OS._INT.14.1_15_PERCT.TTL\"","v":{"$error":"#N/A"}},{"$f":"ROUND(PAGE6!$P$106,5)","v":0},{"$f":"ROUND(PAGE6!$R$106,5)","v":0}]
[{"$f":"$C$1&\".E30A.REM.FR.CONSM.OS._INT.OVR_15.1_PERCT\"","v":{"$error":"#N/A"}},{"$f":"ROUND(PAGE6!$C$107,5)","v":0},{"$f":"ROUND(PAGE6!$E$107,5)","v":0}]
[{"$f":"$C$1&\".E30A.REM.VAR.CONSM.OS._INT.OVR_15.1_PERCT\"","v":{"$error":"#N/A"}},{"$f":"ROUND(PAGE6!$G$107,5)","v":0},{"$f":"ROUND(PAGE6!$I$107,5)","v":0}]
[{"$f":"$C$1&\".E30A.REM.ADJ.CONSM.OS._INT.OVR_15.1_PERCT\"","v":{"$error":"#N/A"}},{"$f":"ROUND(PAGE6!$K$107,5)","v":0},{"$f":"ROUND(PAGE6!$M$107,5)","v":0}]
[{"$f":"$C$1&\".E30A.REM.CONSM.OS._INT.OVR_15.1_PERCT.TTL\"","v":{"$error":"#N/A"}},{"$f":"ROUND(PAGE6!$P$107,5)","v":0},{"$f":"ROUND(PAGE6!$R$107,5)","v":0}]
[{"$f":"$C$1&\".E30A.REM.FR.OS.TTL..\"","v":{"$error":"#N/A"}},{"$f":"ROUND(PAGE6!$C$111,5)","v":0},{"$f":"ROUND(PAGE6!$E$111,5)","v":0}]
[{"$f":"$C$1&\".E30A.REM.VAR.OS.TTL..\"","v":{"$error":"#N/A"}},{"$f":"ROUND(PAGE6!$G$111,5)","v":0},{"$f":"ROUND(PAGE6!$I$111,5)","v":0}]
[{"$f":"$C$1&\".E30A.REM.ADJ.OS.TTL..\"","v":{"$error":"#N/A"}},{"$f":"ROUND(PAGE6!$K$111,5)","v":0},{"$f":"ROUND(PAGE6!$M$111,5)","v":0}]
[{"$f":"$C$1&\".E30A.REM.OS.SEC_TYPE.AGG_TTL..\"","v":{"$error":"#N/A"}},{"$f":"ROUND(PAGE6!$P$111,5)","v":0},{"$f":"ROUND(PAGE6!$R$111,5)","v":0}]
["sect9","NUM","VAL"]
[{"$f":"$C$1&\".E30A.REM.FR..PER.5YRS.NEW\"","v":{"$error":"#N/A"}},{"$f":"ROUND(PAGE7!$C$14,5)","v":0},{"$f":"ROUND(PAGE7!$E$14,5)","v":0}]
[{"$f":"$C$1&\".E30A.REM.VAR..PER.5YRS.NEW\"","v":{"$error":"#N/A"}},{"$f":"ROUND(PAGE7!$G$14,5)","v":0},{"$f":"ROUND(PAGE7!$I$14,5)","v":0}]
[{"$f":"$C$1&\".E30A.REM.ADJ..PER.5YRS.NEW\"","v":{"$error":"#N/A"}},{"$f":"ROUND(PAGE7!$K$14,5)","v":0},{"$f":"ROUND(PAGE7!$M$14,5)","v":0}]
[{"$f":"$C$1&\".E30A.REM..PER.5YRS.NEW.TTL\"","v":{"$error":"#N/A"}},{"$f":"ROUND(PAGE7!$P$14,5)","v":0},{"$f":"ROUND(PAGE7!$R$14,5)","v":0}]
[{"$f":"$C$1&\".E30A.REM.FR.PER.5TO10YRS.NEW.\"","v":{"$error":"#N/A"}},{"$f":"ROUND(PAGE7!$C$16,5)","v":0},{"$f":"ROUND(PAGE7!$E$16,5)","v":0}]
[{"$f":"$C$1&\".E30A.REM.VAR.PER.5TO10YRS.NEW.\"","v":{"$error":"#N/A"}},{"$f":"ROUND(PAGE7!$G$16,5)","v":0},{"$f":"ROUND(PAGE7!$I$16,5)","v":0}]
[{"$f":"$C$1&\".E30A.REM.ADJ.PER.5TO10YRS.NEW.\"","v":{"$error":"#N/A"}},{"$f":"ROUND(PAGE7!$K$16,5)","v":0},{"$f":"ROUND(PAGE7!$M$16,5)","v":0}]
[{"$f":"$C$1&\".E30A.REM.PER.5TO10YRS.NEW.TTL.\"","v":{"$error":"#N/A"}},{"$f":"ROUND(PAGE7!$P$16,5)","v":0},{"$f":"ROUND(PAGE7!$R$16,5)","v":0}]
[{"$f":"$C$1&\".E30A.REM.FR.PER.10TO15YRS.NEW.\"","v":{"$error":"#N/A"}},{"$f":"ROUND(PAGE7!$C$18,5)","v":0},{"$f":"ROUND(PAGE7!$E$18,5)","v":0}]
[{"$f":"$C$1&\".E30A.REM.VAR.PER.10TO15YRS.NEW.\"","v":{"$error":"#N/A"}},{"$f":"ROUND(PAGE7!$G$18,5)","v":0},{"$f":"ROUND(PAGE7!$I$18,5)","v":0}]
[{"$f":"$C$1&\".E30A.REM.ADJ.PER.10TO15YRS.NEW.\"","v":{"$error":"#N/A"}},{"$f":"ROUND(PAGE7!$K$18,5)","v":0},{"$f":"ROUND(PAGE7!$M$18,5)","v":0}]
[{"$f":"$C$1&\".E30A.REM.PER.10TO15YRS.NEW.TTL.\"","v":{"$error":"#N/A"}},{"$f":"ROUND(PAGE7!$P$18,5)","v":0},{"$f":"ROUND(PAGE7!$R$18,5)","v":0}]
[{"$f":"$C$1&\".E30A.REM.FR.PER.15TO20YRS.NEW.\"","v":{"$error":"#N/A"}},{"$f":"ROUND(PAGE7!$C$20,5)","v":0},{"$f":"ROUND(PAGE7!$E$20,5)","v":0}]
[{"$f":"$C$1&\".E30A.REM.VAR.PER.15TO20YRS.NEW.\"","v":{"$error":"#N/A"}},{"$f":"ROUND(PAGE7!$G$20,5)","v":0},{"$f":"ROUND(PAGE7!$I$20,5)","v":0}]
[{"$f":"$C$1&\".E30A.REM.ADJ.PER.15TO20YRS.NEW.\"","v":{"$error":"#N/A"}},{"$f":"ROUND(PAGE7!$K$20,5)","v":0},{"$f":"ROUND(PAGE7!$M$20,5)","v":0}]
[{"$f":"$C$1&\".E30A.REM.PER.15TO20YRS.NEW.TTL.\"","v":{"$error":"#N/A"}},{"$f":"ROUND(PAGE7!$P$20,5)","v":0},{"$f":"ROUND(PAGE7!$R$20,5)","v":0}]
[{"$f":"$C$1&\".E30A.REM.FR.PER.20TO25YRS.NEW.\"","v":{"$error":"#N/A"}},{"$f":"ROUND(PAGE7!$C$22,5)","v":0},{"$f":"ROUND(PAGE7!$E$22,5)","v":0}]
[{"$f":"$C$1&\".E30A.REM.VAR.PER.20TO25YRS.NEW.\"","v":{"$error":"#N/A"}},{"$f":"ROUND(PAGE7!$G$22,5)","v":0},{"$f":"ROUND(PAGE7!$I$22,5)","v":0}]
[{"$f":"$C$1&\".E30A.REM.ADJ.PER.20TO25YRS.NEW.\"","v":{"$error":"#N/A"}},{"$f":"ROUND(PAGE7!$K$22,5)","v":0},{"$f":"ROUND(PAGE7!$M$22,5)","v":0}]
[{"$f":"$C$1&\".E30A.REM.PER.20TO25YRS.NEW.TTL.\"","v":{"$error":"#N/A"}},{"$f":"ROUND(PAGE7!$P$22,5)","v":0},{"$f":"ROUND(PAGE7!$R$22,5)","v":0}]
[{"$f":"$C$1&\".E30A.REM.FR.PER.25TO30YRS.NEW.\"","v":{"$error":"#N/A"}},{"$f":"ROUND(PAGE7!$C$24,5)","v":0},{"$f":"ROUND(PAGE7!$E$24,5)","v":0}]
[{"$f":"$C$1&\".E30A.REM.VAR.PER.25TO30YRS.NEW.\"","v":{"$error":"#N/A"}},{"$f":"ROUND(PAGE7!$G$24,5)","v":0},{"$f":"ROUND(PAGE7!$I$24,5)","v":0}]
[{"$f":"$C$1&\".E30A.REM.ADJ.PER.25TO30YRS.NEW.\"","v":{"$error":"#N/A"}},{"$f":"ROUND(PAGE7!$K$24,5)","v":0},{"$f":"ROUND(PAGE7!$M$24,5)","v":0}]
[{"$f":"$C$1&\".E30A.REM.PER.25TO30YRS.NEW.TTL.\"","v":{"$error":"#N/A"}},{"$f":"ROUND(PAGE7!$P$24,5)","v":0},{"$f":"ROUND(PAGE7!$R$24,5)","v":0}]
[{"$f":"$C$1&\".E30A.REM.FR.PER.OVR30YRS.NEW.\"","v":{"$error":"#N/A"}},{"$f":"ROUND(PAGE7!$C$26,5)","v":0},{"$f":"ROUND(PAGE7!$E$26,5)","v":0}]
[{"$f":"$C$1&\".E30A.REM.VAR.PER.OVR30YRS.NEW.\"","v":{"$error":"#N/A"}},{"$f":"ROUND(PAGE7!$G$26,5)","v":0},{"$f":"ROUND(PAGE7!$I$26,5)","v":0}]
[{"$f":"$C$1&\".E30A.REM.ADJ.PER.OVR30YRS.NEW.\"","v":{"$error":"#N/A"}},{"$f":"ROUND(PAGE7!$K$26,5)","v":0},{"$f":"ROUND(PAGE7!$M$26,5)","v":0}]
[{"$f":"$C$1&\".E30A.REM.PER.OVR30YRS.NEW.TTL.\"","v":{"$error":"#N/A"}},{"$f":"ROUND(PAGE7!$P$26,5)","v":0},{"$f":"ROUND(PAGE7!$R$26,5)","v":0}]
[{"$f":"$C$1&\".E30A.REM.FR.PER.MAX_PER.NEW.\"","v":{"$error":"#N/A"}},{"$f":"ROUND(PAGE7!$C$28,5)","v":0},{"$f":"ROUND(PAGE7!$E$28,5)","v":0}]
[{"$f":"$C$1&\".E30A.REM.VAR.PER.MAX_PER.NEW.\"","v":{"$error":"#N/A"}},{"$f":"ROUND(PAGE7!$G$28,5)","v":0},{"$f":"ROUND(PAGE7!$I$28,5)","v":0}]
[{"$f":"$C$1&\".E30A.REM.ADJ.PER.MAX_PER.NEW.\"","v":{"$error":"#N/A"}},{"$f":"ROUND(PAGE7!$K$28,5)","v":0},{"$f":"ROUND(PAGE7!$M$28,5)","v":0}]
[{"$f":"$C$1&\".E30A.REM.PER.MAX_PER.NEW.TTL.\"","v":{"$error":"#N/A"}},{"$f":"ROUND(PAGE7!$P$28,5)","v":0},{"$f":"ROUND(PAGE7!$R$28,5)","v":0}]
[{"$f":"$C$1&\".E30A.REM.FR.PER.UNSPEC.NEW.\"","v":{"$error":"#N/A"}},{"$f":"ROUND(PAGE7!$C$30,5)","v":0},{"$f":"ROUND(PAGE7!$E$30,5)","v":0}]
[{"$f":"$C$1&\".E30A.REM.VAR.PER.UNSPEC.NEW.\"","v":{"$error":"#N/A"}},{"$f":"ROUND(PAGE7!$G$30,5)","v":0},{"$f":"ROUND(PAGE7!$I$30,5)","v":0}]
[{"$f":"$C$1&\".E30A.REM.ADJ.PER.UNSPEC.NEW.\"","v":{"$error":"#N/A"}},{"$f":"ROUND(PAGE7!$K$30,5)","v":0},{"$f":"ROUND(PAGE7!$M$30,5)","v":0}]
[{"$f":"$C$1&\".E30A.REM.PER.UNSPEC.NEW.TTL.\"","v":{"$error":"#N/A"}},{"$f":"ROUND(PAGE7!$P$30,5)","v":0},{"$f":"ROUND(PAGE7!$R$30,5)","v":0}]
[{"$f":"$C$1&\".E30A.REM.FR.NEW.TTL..\"","v":{"$error":"#N/A"}},{"$f":"ROUND(PAGE7!C32,5)","v":0},{"$f":"ROUND(PAGE7!$E$32,5)","v":0}]
[{"$f":"$C$1&\".E30A.REM.VAR.NEW.TTL..\"","v":{"$error":"#N/A"}},{"$f":"ROUND(PAGE7!G32,5)","v":0},{"$f":"ROUND(PAGE7!$I$32,5)","v":0}]
[{"$f":"$C$1&\".E30A.REM.ADJ.NEW.TTL..\"","v":{"$error":"#N/A"}},{"$f":"ROUND(PAGE7!K32,5)","v":0},{"$f":"ROUND(PAGE7!$M$32,5)","v":0}]
["sect10","VAL"]
[{"$f":"$C$1&\".E30A.REM.NEW.AGG_TTL...\"","v":{"$error":"#N/A"}},{"$f":"ROUND(PAGE7!$R$32,5)","v":0}]
["sect11","RATE"]
[{"$f":"$C$1&\".E30A.REM.FR.PBSEC.APPR.L.\"","v":{"$error":"#N/A"}},{"$f":"ROUND(PAGE8!$C$19,5)","v":0}]
[{"$f":"$C$1&\".E30A.REM.FR.PBSEC.APPR.H.\"","v":{"$error":"#N/A"}},{"$f":"ROUND(PAGE8!$E$19,5)","v":0}]
[{"$f":"$C$1&\".E30A.REM.FR.PBSEC.APPR.L.M\"","v":{"$error":"#N/A"}},{"$f":"ROUND(PAGE8!$G$19,5)","v":0}]
[{"$f":"$C$1&\".E30A.REM.FR.PBSEC.APPR.H.M\"","v":{"$error":"#N/A"}},{"$f":"ROUND(PAGE8!$I$19,5)","v":0}]
[{"$f":"$C$1&\".E30A.REM.FR.PBSEC.DISB.L.\"","v":{"$error":"#N/A"}},{"$f":"ROUND(PAGE8!$K$19,5)","v":0}]
[{"$f":"$C$1&\".E30A.REM.FR.PBSEC.DISB.H.\"","v":{"$error":"#N/A"}},{"$f":"ROUND(PAGE8!$M$19,5)","v":0}]
[{"$f":"$C$1&\".E30A.REM.FR.PBSEC.DISB.L.M\"","v":{"$error":"#N/A"}},{"$f":"ROUND(PAGE8!$O$19,5)","v":0}]
[{"$f":"$C$1&\".E30A.REM.FR.PBSEC.DISB.H.M\"","v":{"$error":"#N/A"}},{"$f":"ROUND(PAGE8!$Q$19,5)","v":0}]
[{"$f":"$C$1&\".E30A.REM.FR.PBSEC.OS.L.\"","v":{"$error":"#N/A"}},{"$f":"ROUND(PAGE8!$S$19,5)","v":0}]
[{"$f":"$C$1&\".E30A.REM.FR.PBSEC.OS.H.\"","v":{"$error":"#N/A"}},{"$f":"ROUND(PAGE8!$U$19,5)","v":0}]
[{"$f":"$C$1&\".E30A.REM.FR.PBSEC.OS.L.M\"","v":{"$error":"#N/A"}},{"$f":"ROUND(PAGE8!$W$19,5)","v":0}]
[{"$f":"$C$1&\".E30A.REM.FR.PBSEC.OS.H.M\"","v":{"$error":"#N/A"}},{"$f":"ROUND(PAGE8!$Y$19,5)","v":0}]
[{"$f":"$C$1&\".E30A.REM.FR.PVFIN.APPR.L.\"","v":{"$error":"#N/A"}},{"$f":"ROUND(PAGE8!$C$22,5)","v":0}]
[{"$f":"$C$1&\".E30A.REM.FR.PVFIN.APPR.H.\"","v":{"$error":"#N/A"}},{"$f":"ROUND(PAGE8!$E$22,5)","v":0}]
[{"$f":"$C$1&\".E30A.REM.FR.PVFIN.APPR.L.M\"","v":{"$error":"#N/A"}},{"$f":"ROUND(PAGE8!$G$22,5)","v":0}]
[{"$f":"$C$1&\".E30A.REM.FR.PVFIN.APPR.H.M\"","v":{"$error":"#N/A"}},{"$f":"ROUND(PAGE8!$I$22,5)","v":0}]
[{"$f":"$C$1&\".E30A.REM.FR.PVFIN.DISB.L.\"","v":{"$error":"#N/A"}},{"$f":"ROUND(PAGE8!$K$22,5)","v":0}]
[{"$f":"$C$1&\".E30A.REM.FR.PVFIN.DISB.H.\"","v":{"$error":"#N/A"}},{"$f":"ROUND(PAGE8!$M$22,5)","v":0}]
[{"$f":"$C$1&\".E30A.REM.FR.PVFIN.DISB.L.M\"","v":{"$error":"#N/A"}},{"$f":"ROUND(PAGE8!$O$22,5)","v":0}]
[{"$f":"$C$1&\".E30A.REM.FR.PVFIN.DISB.H.M\"","v":{"$error":"#N/A"}},{"$f":"ROUND(PAGE8!$Q$22,5)","v":0}]
[{"$f":"$C$1&\".E30A.REM.FR.PVFIN.OS.L.\"","v":{"$error":"#N/A"}},{"$f":"ROUND(PAGE8!$S$22,5)","v":0}]
[{"$f":"$C$1&\".E30A.REM.FR.PVFIN.OS.H.\"","v":{"$error":"#N/A"}},{"$f":"ROUND(PAGE8!$U$22,5)","v":0}]
[{"$f":"$C$1&\".E30A.REM.FR.PVFIN.OS.L.M\"","v":{"$error":"#N/A"}},{"$f":"ROUND(PAGE8!$W$22,5)","v":0}]
[{"$f":"$C$1&\".E30A.REM.FR.PVFIN.OS.H.M\"","v":{"$error":"#N/A"}},{"$f":"ROUND(PAGE8!$Y$22,5)","v":0}]
[{"$f":"$C$1&\".E30A.REM.FR.IBUS.APPR.L.\"","v":{"$error":"#N/A"}},{"$f":"ROUND(PAGE8!$C$25,5)","v":0}]
[{"$f":"$C$1&\".E30A.REM.FR.IBUS.APPR.H.\"","v":{"$error":"#N/A"}},{"$f":"ROUND(PAGE8!$E$25,5)","v":0}]
[{"$f":"$C$1&\".E30A.REM.FR.IBUS.APPR.L.M\"","v":{"$error":"#N/A"}},{"$f":"ROUND(PAGE8!$G$25,5)","v":0}]
[{"$f":"$C$1&\".E30A.REM.FR.IBUS.APPR.H.M\"","v":{"$error":"#N/A"}},{"$f":"ROUND(PAGE8!$I$25,5)","v":0}]
[{"$f":"$C$1&\".E30A.REM.FR.IBUS.DISB.L.\"","v":{"$error":"#N/A"}},{"$f":"ROUND(PAGE8!$K$25,5)","v":0}]
[{"$f":"$C$1&\".E30A.REM.FR.IBUS.DISB.H.\"","v":{"$error":"#N/A"}},{"$f":"ROUND(PAGE8!$M$25,5)","v":0}]
[{"$f":"$C$1&\".E30A.REM.FR.IBUS.DISB.L.M\"","v":{"$error":"#N/A"}},{"$f":"ROUND(PAGE8!$O$25,5)","v":0}]
[{"$f":"$C$1&\".E30A.REM.FR.IBUS.DISB.H.M\"","v":{"$error":"#N/A"}},{"$f":"ROUND(PAGE8!$Q$25,5)","v":0}]
[{"$f":"$C$1&\".E30A.REM.FR.IBUS.OS.L.\"","v":{"$error":"#N/A"}},{"$f":"ROUND(PAGE8!$S$25,5)","v":0}]
[{"$f":"$C$1&\".E30A.REM.FR.IBUS.OS.H.\"","v":{"$error":"#N/A"}},{"$f":"ROUND(PAGE8!$U$25,5)","v":0}]
[{"$f":"$C$1&\".E30A.REM.FR.IBUS.OS.L.M\"","v":{"$error":"#N/A"}},{"$f":"ROUND(PAGE8!$W$25,5)","v":0}]
[{"$f":"$C$1&\".E30A.REM.FR.IBUS.OS.H.M\"","v":{"$error":"#N/A"}},{"$f":"ROUND(PAGE8!$Y$25,5)","v":0}]
[{"$f":"$C$1&\".E30A.REM.FR.UIBUS.APPR.L.\"","v":{"$error":"#N/A"}},{"$f":"ROUND(PAGE8!$C$28,5)","v":0}]
[{"$f":"$C$1&\".E30A.REM.FR.UIBUS.APPR.H.\"","v":{"$error":"#N/A"}},{"$f":"ROUND(PAGE8!$E$28,5)","v":0}]
[{"$f":"$C$1&\".E30A.REM.FR.UIBUS.APPR.L.M\"","v":{"$error":"#N/A"}},{"$f":"ROUND(PAGE8!$G$28,5)","v":0}]
[{"$f":"$C$1&\".E30A.REM.FR.UIBUS.APPR.H.M\"","v":{"$error":"#N/A"}},{"$f":"ROUND(PAGE8!$I$28,5)","v":0}]
[{"$f":"$C$1&\".E30A.REM.FR.UIBUS.DISB.L.\"","v":{"$error":"#N/A"}},{"$f":"ROUND(PAGE8!$K$28,5)","v":0}]
[{"$f":"$C$1&\".E30A.REM.FR.UIBUS.DISB.H.\"","v":{"$error":"#N/A"}},{"$f":"ROUND(PAGE8!$M$28,5)","v":0}]
[{"$f":"$C$1&\".E30A.REM.FR.UIBUS.DISB.L.M\"","v":{"$error":"#N/A"}},{"$f":"ROUND(PAGE8!$O$28,5)","v":0}]
[{"$f":"$C$1&\".E30A.REM.FR.UIBUS.DISB.H.M\"","v":{"$error":"#N/A"}},{"$f":"ROUND(PAGE8!$Q$28,5)","v":0}]
[{"$f":"$C$1&\".E30A.REM.FR.UIBUS.OS.L.\"","v":{"$error":"#N/A"}},{"$f":"ROUND(PAGE8!$S$28,5)","v":0}]
[{"$f":"$C$1&\".E30A.REM.FR.UIBUS.OS.H.\"","v":{"$error":"#N/A"}},{"$f":"ROUND(PAGE8!$U$28,5)","v":0}]
[{"$f":"$C$1&\".E30A.REM.FR.UIBUS.OS.L.M\"","v":{"$error":"#N/A"}},{"$f":"ROUND(PAGE8!$W$28,5)","v":0}]
[{"$f":"$C$1&\".E30A.REM.FR.UIBUS.OS.H.M\"","v":{"$error":"#N/A"}},{"$f":"ROUND(PAGE8!$Y$28,5)","v":0}]
[{"$f":"$C$1&\".E30A.REM.FR.CONSM.APPR.L.\"","v":{"$error":"#N/A"}},{"$f":"ROUND(PAGE8!$C$30,5)","v":0}]
[{"$f":"$C$1&\".E30A.REM.FR.CONSM.APPR.H.\"","v":{"$error":"#N/A"}},{"$f":"ROUND(PAGE8!$E$30,5)","v":0}]
[{"$f":"$C$1&\".E30A.REM.FR.CONSM.APPR.L.M\"","v":{"$error":"#N/A"}},{"$f":"ROUND(PAGE8!$G$30,5)","v":0}]
[{"$f":"$C$1&\".E30A.REM.FR.CONSM.APPR.H.M\"","v":{"$error":"#N/A"}},{"$f":"ROUND(PAGE8!$I$30,5)","v":0}]
[{"$f":"$C$1&\".E30A.REM.FR.CONSM.DISB.L.\"","v":{"$error":"#N/A"}},{"$f":"ROUND(PAGE8!$K$30,5)","v":0}]
[{"$f":"$C$1&\".E30A.REM.FR.CONSM.DISB.H.\"","v":{"$error":"#N/A"}},{"$f":"ROUND(PAGE8!$M$30,5)","v":0}]
[{"$f":"$C$1&\".E30A.REM.FR.CONSM.DISB.L.M\"","v":{"$error":"#N/A"}},{"$f":"ROUND(PAGE8!$O$30,5)","v":0}]
[{"$f":"$C$1&\".E30A.REM.FR.CONSM.DISB.H.M\"","v":{"$error":"#N/A"}},{"$f":"ROUND(PAGE8!$Q$30,5)","v":0}]
[{"$f":"$C$1&\".E30A.REM.FR.CONSM.OS.L.\"","v":{"$error":"#N/A"}},{"$f":"ROUND(PAGE8!$S$30,5)","v":0}]
[{"$f":"$C$1&\".E30A.REM.FR.CONSM.OS.H.\"","v":{"$error":"#N/A"}},{"$f":"ROUND(PAGE8!$U$30,5)","v":0}]
[{"$f":"$C$1&\".E30A.REM.FR.CONSM.OS.L.M\"","v":{"$error":"#N/A"}},{"$f":"ROUND(PAGE8!$W$30,5)","v":0}]
[{"$f":"$C$1&\".E30A.REM.FR.CONSM.OS.H.M\"","v":{"$error":"#N/A"}},{"$f":"ROUND(PAGE8!$Y$30,5)","v":0}]
[{"$f":"$C$1&\".E30A.REM.VR.PBSEC.APPR.L.\"","v":{"$error":"#N/A"}},{"$f":"ROUND(PAGE8!$C$40,5)","v":0}]
[{"$f":"$C$1&\".E30A.REM.VR.PBSEC.APPR.H.\"","v":{"$error":"#N/A"}},{"$f":"ROUND(PAGE8!$E$40,5)","v":0}]
[{"$f":"$C$1&\".E30A.REM.VR.PBSEC.APPR.L.M\"","v":{"$error":"#N/A"}},{"$f":"ROUND(PAGE8!$G$40,5)","v":0}]
[{"$f":"$C$1&\".E30A.REM.VR.PBSEC.APPR.H.M\"","v":{"$error":"#N/A"}},{"$f":"ROUND(PAGE8!$I$40,5)","v":0}]
[{"$f":"$C$1&\".E30A.REM.VR.PBSEC.DISB.L.\"","v":{"$error":"#N/A"}},{"$f":"ROUND(PAGE8!$K$40,5)","v":0}]
[{"$f":"$C$1&\".E30A.REM.VR.PBSEC.DISB.H.\"","v":{"$error":"#N/A"}},{"$f":"ROUND(PAGE8!$M$40,5)","v":0}]
[{"$f":"$C$1&\".E30A.REM.VR.PBSEC.DISB.L.M\"","v":{"$error":"#N/A"}},{"$f":"ROUND(PAGE8!$O$40,5)","v":0}]
[{"$f":"$C$1&\".E30A.REM.VR.PBSEC.DISB.H.M\"","v":{"$error":"#N/A"}},{"$f":"ROUND(PAGE8!$Q$40,5)","v":0}]
[{"$f":"$C$1&\".E30A.REM.VR.PBSEC.OS.L.\"","v":{"$error":"#N/A"}},{"$f":"ROUND(PAGE8!$S$40,5)","v":0}]
[{"$f":"$C$1&\".E30A.REM.VR.PBSEC.OS.H.\"","v":{"$error":"#N/A"}},{"$f":"ROUND(PAGE8!$U$40,5)","v":0}]
[{"$f":"$C$1&\".E30A.REM.VR.PBSEC.OS.L.M\"","v":{"$error":"#N/A"}},{"$f":"ROUND(PAGE8!$W$40,5)","v":0}]
[{"$f":"$C$1&\".E30A.REM.VR.PBSEC.OS.H.M\"","v":{"$error":"#N/A"}},{"$f":"ROUND(PAGE8!$Y$40,5)","v":0}]
[{"$f":"$C$1&\".E30A.REM.VR.PVFIN.APPR.L.\"","v":{"$error":"#N/A"}},{"$f":"ROUND(PAGE8!$C$43,5)","v":0}]
[{"$f":"$C$1&\".E30A.REM.VR.PVFIN.APPR.H.\"","v":{"$error":"#N/A"}},{"$f":"ROUND(PAGE8!$E$43,5)","v":0}]
[{"$f":"$C$1&\".E30A.REM.VR.PVFIN.APPR.L.M\"","v":{"$error":"#N/A"}},{"$f":"ROUND(PAGE8!$G$43,5)","v":0}]
[{"$f":"$C$1&\".E30A.REM.VR.PVFIN.APPR.H.M\"","v":{"$error":"#N/A"}},{"$f":"ROUND(PAGE8!$I$43,5)","v":0}]
[{"$f":"$C$1&\".E30A.REM.VR.PVFIN.DISB.L.\"","v":{"$error":"#N/A"}},{"$f":"ROUND(PAGE8!$K$43,5)","v":0}]
[{"$f":"$C$1&\".E30A.REM.VR.PVFIN.DISB.H.\"","v":{"$error":"#N/A"}},{"$f":"ROUND(PAGE8!$M$43,5)","v":0}]
[{"$f":"$C$1&\".E30A.REM.VR.PVFIN.DISB.L.M\"","v":{"$error":"#N/A"}},{"$f":"ROUND(PAGE8!$O$43,5)","v":0}]
[{"$f":"$C$1&\".E30A.REM.VR.PVFIN.DISB.H.M\"","v":{"$error":"#N/A"}},{"$f":"ROUND(PAGE8!$Q$43,5)","v":0}]
[{"$f":"$C$1&\".E30A.REM.VR.PVFIN.OS.L.\"","v":{"$error":"#N/A"}},{"$f":"ROUND(PAGE8!$S$43,5)","v":0}]
[{"$f":"$C$1&\".E30A.REM.VR.PVFIN.OS.H.\"","v":{"$error":"#N/A"}},{"$f":"ROUND(PAGE8!$U$43,5)","v":0}]
[{"$f":"$C$1&\".E30A.REM.VR.PVFIN.OS.L.M\"","v":{"$error":"#N/A"}},{"$f":"ROUND(PAGE8!$W$43,5)","v":0}]
[{"$f":"$C$1&\".E30A.REM.VR.PVFIN.OS.H.M\"","v":{"$error":"#N/A"}},{"$f":"ROUND(PAGE8!$Y$43,5)","v":0}]
[{"$f":"$C$1&\".E30A.REM.VR.IBUS.APPR.L.\"","v":{"$error":"#N/A"}},{"$f":"ROUND(PAGE8!$C$46,5)","v":0}]
[{"$f":"$C$1&\".E30A.REM.VR.IBUS.APPR.H.\"","v":{"$error":"#N/A"}},{"$f":"ROUND(PAGE8!$E$46,5)","v":0}]
[{"$f":"$C$1&\".E30A.REM.VR.IBUS.APPR.L.M\"","v":{"$error":"#N/A"}},{"$f":"ROUND(PAGE8!$G$46,5)","v":0}]
[{"$f":"$C$1&\".E30A.REM.VR.IBUS.APPR.H.M\"","v":{"$error":"#N/A"}},{"$f":"ROUND(PAGE8!$I$46,5)","v":0}]
[{"$f":"$C$1&\".E30A.REM.VR.IBUS.DISB.L.\"","v":{"$error":"#N/A"}},{"$f":"ROUND(PAGE8!$K$46,5)","v":0}]
[{"$f":"$C$1&\".E30A.REM.VR.IBUS.DISB.H.\"","v":{"$error":"#N/A"}},{"$f":"ROUND(PAGE8!$M$46,5)","v":0}]
[{"$f":"$C$1&\".E30A.REM.VR.IBUS.DISB.L.M\"","v":{"$error":"#N/A"}},{"$f":"ROUND(PAGE8!$O$46,5)","v":0}]
[{"$f":"$C$1&\".E30A.REM.VR.IBUS.DISB.H.M\"","v":{"$error":"#N/A"}},{"$f":"ROUND(PAGE8!$Q$46,5)","v":0}]
[{"$f":"$C$1&\".E30A.REM.VR.IBUS.OS.L.\"","v":{"$error":"#N/A"}},{"$f":"ROUND(PAGE8!$S$46,5)","v":0}]
[{"$f":"$C$1&\".E30A.REM.VR.IBUS.OS.H.\"","v":{"$error":"#N/A"}},{"$f":"ROUND(PAGE8!$U$46,5)","v":0}]
[{"$f":"$C$1&\".E30A.REM.VR.IBUS.OS.L.M\"","v":{"$error":"#N/A"}},{"$f":"ROUND(PAGE8!$W$46,5)","v":0}]
[{"$f":"$C$1&\".E30A.REM.VR.IBUS.OS.H.M\"","v":{"$error":"#N/A"}},{"$f":"ROUND(PAGE8!$Y$46,5)","v":0}]
[{"$f":"$C$1&\".E30A.REM.VR.UIBUS.APPR.L.\"","v":{"$error":"#N/A"}},{"$f":"ROUND(PAGE8!$C$49,5)","v":0}]
[{"$f":"$C$1&\".E30A.REM.VR.UIBUS.APPR.H.\"","v":{"$error":"#N/A"}},{"$f":"ROUND(PAGE8!$E$49,5)","v":0}]
[{"$f":"$C$1&\".E30A.REM.VR.UIBUS.APPR.L.M\"","v":{"$error":"#N/A"}},{"$f":"ROUND(PAGE8!$G$49,5)","v":0}]
[{"$f":"$C$1&\".E30A.REM.VR.UIBUS.APPR.H.M\"","v":{"$error":"#N/A"}},{"$f":"ROUND(PAGE8!$I$49,5)","v":0}]
[{"$f":"$C$1&\".E30A.REM.VR.UIBUS.DISB.L.\"","v":{"$error":"#N/A"}},{"$f":"ROUND(PAGE8!$K$49,5)","v":0}]
[{"$f":"$C$1&\".E30A.REM.VR.UIBUS.DISB.H.\"","v":{"$error":"#N/A"}},{"$f":"ROUND(PAGE8!$M$49,5)","v":0}]
[{"$f":"$C$1&\".E30A.REM.VR.UIBUS.DISB.L.M\"","v":{"$error":"#N/A"}},{"$f":"ROUND(PAGE8!$O$49,5)","v":0}]
[{"$f":"$C$1&\".E30A.REM.VR.UIBUS.DISB.H.M\"","v":{"$error":"#N/A"}},{"$f":"ROUND(PAGE8!$Q$49,5)","v":0}]
[{"$f":"$C$1&\".E30A.REM.VR.UIBUS.OS.L.\"","v":{"$error":"#N/A"}},{"$f":"ROUND(PAGE8!$S$49,5)","v":0}]
[{"$f":"$C$1&\".E30A.REM.VR.UIBUS.OS.H.\"","v":{"$error":"#N/A"}},{"$f":"ROUND(PAGE8!$U$49,5)","v":0}]
[{"$f":"$C$1&\".E30A.REM.VR.UIBUS.OS.L.M\"","v":{"$error":"#N/A"}},{"$f":"ROUND(PAGE8!$W$49,5)","v":0}]
[{"$f":"$C$1&\".E30A.REM.VR.UIBUS.OS.H.M\"","v":{"$error":"#N/A"}},{"$f":"ROUND(PAGE8!$Y$49,5)","v":0}]
[{"$f":"$C$1&\".E30A.REM.VR.CONSM.APPR.L.\"","v":{"$error":"#N/A"}},{"$f":"ROUND(PAGE8!$C$51,5)","v":0}]
[{"$f":"$C$1&\".E30A.REM.VR.CONSM.APPR.H.\"","v":{"$error":"#N/A"}},{"$f":"ROUND(PAGE8!$E$51,5)","v":0}]
[{"$f":"$C$1&\".E30A.REM.VR.CONSM.APPR.L.M\"","v":{"$error":"#N/A"}},{"$f":"ROUND(PAGE8!$G$51,5)","v":0}]
[{"$f":"$C$1&\".E30A.REM.VR.CONSM.APPR.H.M\"","v":{"$error":"#N/A"}},{"$f":"ROUND(PAGE8!$I$51,5)","v":0}]
[{"$f":"$C$1&\".E30A.REM.VR.CONSM.DISB.L.\"","v":{"$error":"#N/A"}},{"$f":"ROUND(PAGE8!$K$51,5)","v":0}]
[{"$f":"$C$1&\".E30A.REM.VR.CONSM.DISB.H.\"","v":{"$error":"#N/A"}},{"$f":"ROUND(PAGE8!$M$51,5)","v":0}]
[{"$f":"$C$1&\".E30A.REM.VR.CONSM.DISB.L.M\"","v":{"$error":"#N/A"}},{"$f":"ROUND(PAGE8!$O$51,5)","v":0}]
[{"$f":"$C$1&\".E30A.REM.VR.CONSM.DISB.H.M\"","v":{"$error":"#N/A"}},{"$f":"ROUND(PAGE8!$Q$51,5)","v":0}]
[{"$f":"$C$1&\".E30A.REM.VR.CONSM.OS.L.\"","v":{"$error":"#N/A"}},{"$f":"ROUND(PAGE8!$S$51,5)","v":0}]
[{"$f":"$C$1&\".E30A.REM.VR.CONSM.OS.H.\"","v":{"$error":"#N/A"}},{"$f":"ROUND(PAGE8!$U$51,5)","v":0}]
[{"$f":"$C$1&\".E30A.REM.VR.CONSM.OS.L.M\"","v":{"$error":"#N/A"}},{"$f":"ROUND(PAGE8!$W$51,5)","v":0}]
[{"$f":"$C$1&\".E30A.REM.VR.CONSM.OS.H.M\"","v":{"$error":"#N/A"}},{"$f":"ROUND(PAGE8!$Y$51,5)","v":0}]
[{"$f":"$C$1&\".E30A.REM.AR.PBSEC.APPR.L.\"","v":{"$error":"#N/A"}},{"$f":"ROUND(PAGE8!$C$61,5)","v":0}]
[{"$f":"$C$1&\".E30A.REM.AR.PBSEC.APPR.H.\"","v":{"$error":"#N/A"}},{"$f":"ROUND(PAGE8!$E$61,5)","v":0}]
[{"$f":"$C$1&\".E30A.REM.AR.PBSEC.APPR.L.M\"","v":{"$error":"#N/A"}},{"$f":"ROUND(PAGE8!$G$61,5)","v":0}]
[{"$f":"$C$1&\".E30A.REM.AR.PBSEC.APPR.H.M\"","v":{"$error":"#N/A"}},{"$f":"ROUND(PAGE8!$I$61,5)","v":0}]
[{"$f":"$C$1&\".E30A.REM.AR.PBSEC.DISB.L.\"","v":{"$error":"#N/A"}},{"$f":"ROUND(PAGE8!$K$61,5)","v":0}]
[{"$f":"$C$1&\".E30A.REM.AR.PBSEC.DISB.H.\"","v":{"$error":"#N/A"}},{"$f":"ROUND(PAGE8!$M$61,5)","v":0}]
[{"$f":"$C$1&\".E30A.REM.AR.PBSEC.DISB.L.M\"","v":{"$error":"#N/A"}},{"$f":"ROUND(PAGE8!$O$61,5)","v":0}]
[{"$f":"$C$1&\".E30A.REM.AR.PBSEC.DISB.H.M\"","v":{"$error":"#N/A"}},{"$f":"ROUND(PAGE8!$Q$61,5)","v":0}]
[{"$f":"$C$1&\".E30A.REM.AR.PBSEC.OS.L.\"","v":{"$error":"#N/A"}},{"$f":"ROUND(PAGE8!$S$61,5)","v":0}]
[{"$f":"$C$1&\".E30A.REM.AR.PBSEC.OS.H.\"","v":{"$error":"#N/A"}},{"$f":"ROUND(PAGE8!$U$61,5)","v":0}]
[{"$f":"$C$1&\".E30A.REM.AR.PBSEC.OS.L.M\"","v":{"$error":"#N/A"}},{"$f":"ROUND(PAGE8!$W$61,5)","v":0}]
[{"$f":"$C$1&\".E30A.REM.AR.PBSEC.OS.H.M\"","v":{"$error":"#N/A"}},{"$f":"ROUND(PAGE8!$Y$61,5)","v":0}]
[{"$f":"$C$1&\".E30A.REM.AR.PVFIN.APPR.L.\"","v":{"$error":"#N/A"}},{"$f":"ROUND(PAGE8!$C$64,5)","v":0}]
[{"$f":"$C$1&\".E30A.REM.AR.PVFIN.APPR.H.\"","v":{"$error":"#N/A"}},{"$f":"ROUND(PAGE8!$E$64,5)","v":0}]
[{"$f":"$C$1&\".E30A.REM.AR.PVFIN.APPR.L.M\"","v":{"$error":"#N/A"}},{"$f":"ROUND(PAGE8!$G$64,5)","v":0}]
[{"$f":"$C$1&\".E30A.REM.AR.PVFIN.APPR.H.M\"","v":{"$error":"#N/A"}},{"$f":"ROUND(PAGE8!$I$64,5)","v":0}]
[{"$f":"$C$1&\".E30A.REM.AR.PVFIN.DISB.L.\"","v":{"$error":"#N/A"}},{"$f":"ROUND(PAGE8!$K$64,5)","v":0}]
[{"$f":"$C$1&\".E30A.REM.AR.PVFIN.DISB.H.\"","v":{"$error":"#N/A"}},{"$f":"ROUND(PAGE8!$M$64,5)","v":0}]
[{"$f":"$C$1&\".E30A.REM.AR.PVFIN.DISB.L.M\"","v":{"$error":"#N/A"}},{"$f":"ROUND(PAGE8!$O$64,5)","v":0}]
[{"$f":"$C$1&\".E30A.REM.AR.PVFIN.DISB.H.M\"","v":{"$error":"#N/A"}},{"$f":"ROUND(PAGE8!$Q$64,5)","v":0}]
[{"$f":"$C$1&\".E30A.REM.AR.PVFIN.OS.L.\"","v":{"$error":"#N/A"}},{"$f":"ROUND(PAGE8!$S$64,5)","v":0}]
[{"$f":"$C$1&\".E30A.REM.AR.PVFIN.OS.H.\"","v":{"$error":"#N/A"}},{"$f":"ROUND(PAGE8!$U$64,5)","v":0}]
[{"$f":"$C$1&\".E30A.REM.AR.PVFIN.OS.L.M\"","v":{"$error":"#N/A"}},{"$f":"ROUND(PAGE8!$W$64,5)","v":0}]
[{"$f":"$C$1&\".E30A.REM.AR.PVFIN.OS.H.M\"","v":{"$error":"#N/A"}},{"$f":"ROUND(PAGE8!$Y$64,5)","v":0}]
[{"$f":"$C$1&\".E30A.REM.AR.IBUS.APPR.L.\"","v":{"$error":"#N/A"}},{"$f":"ROUND(PAGE8!$C$67,5)","v":0}]
[{"$f":"$C$1&\".E30A.REM.AR.IBUS.APPR.H.\"","v":{"$error":"#N/A"}},{"$f":"ROUND(PAGE8!$E$67,5)","v":0}]
[{"$f":"$C$1&\".E30A.REM.AR.IBUS.APPR.L.M\"","v":{"$error":"#N/A"}},{"$f":"ROUND(PAGE8!$G$67,5)","v":0}]
[{"$f":"$C$1&\".E30A.REM.AR.IBUS.APPR.H.M\"","v":{"$error":"#N/A"}},{"$f":"ROUND(PAGE8!$I$67,5)","v":0}]
[{"$f":"$C$1&\".E30A.REM.AR.IBUS.DISB.L.\"","v":{"$error":"#N/A"}},{"$f":"ROUND(PAGE8!$K$67,5)","v":0}]
[{"$f":"$C$1&\".E30A.REM.AR.IBUS.DISB.H.\"","v":{"$error":"#N/A"}},{"$f":"ROUND(PAGE8!$M$67,5)","v":0}]
[{"$f":"$C$1&\".E30A.REM.AR.IBUS.DISB.L.M\"","v":{"$error":"#N/A"}},{"$f":"ROUND(PAGE8!$O$67,5)","v":0}]
[{"$f":"$C$1&\".E30A.REM.AR.IBUS.DISB.H.M\"","v":{"$error":"#N/A"}},{"$f":"ROUND(PAGE8!$Q$67,5)","v":0}]
[{"$f":"$C$1&\".E30A.REM.AR.IBUS.OS.L.\"","v":{"$error":"#N/A"}},{"$f":"ROUND(PAGE8!$S$67,5)","v":0}]
[{"$f":"$C$1&\".E30A.REM.AR.IBUS.OS.H.\"","v":{"$error":"#N/A"}},{"$f":"ROUND(PAGE8!$U$67,5)","v":0}]
[{"$f":"$C$1&\".E30A.REM.AR.IBUS.OS.L.M\"","v":{"$error":"#N/A"}},{"$f":"ROUND(PAGE8!$W$67,5)","v":0}]
[{"$f":"$C$1&\".E30A.REM.AR.IBUS.OS.H.M\"","v":{"$error":"#N/A"}},{"$f":"ROUND(PAGE8!$Y$67,5)","v":0}]
[{"$f":"$C$1&\".E30A.REM.AR.UIBUS.APPR.L.\"","v":{"$error":"#N/A"}},{"$f":"ROUND(PAGE8!$C$70,5)","v":0}]
[{"$f":"$C$1&\".E30A.REM.AR.UIBUS.APPR.H.\"","v":{"$error":"#N/A"}},{"$f":"ROUND(PAGE8!$E$70,5)","v":0}]
[{"$f":"$C$1&\".E30A.REM.AR.UIBUS.APPR.L.M\"","v":{"$error":"#N/A"}},{"$f":"ROUND(PAGE8!$G$70,5)","v":0}]
[{"$f":"$C$1&\".E30A.REM.AR.UIBUS.APPR.H.M\"","v":{"$error":"#N/A"}},{"$f":"ROUND(PAGE8!$I$70,5)","v":0}]
[{"$f":"$C$1&\".E30A.REM.AR.UIBUS.DISB.L.\"","v":{"$error":"#N/A"}},{"$f":"ROUND(PAGE8!$K$70,5)","v":0}]
[{"$f":"$C$1&\".E30A.REM.AR.UIBUS.DISB.H.\"","v":{"$error":"#N/A"}},{"$f":"ROUND(PAGE8!$M$70,5)","v":0}]
[{"$f":"$C$1&\".E30A.REM.AR.UIBUS.DISB.L.M\"","v":{"$error":"#N/A"}},{"$f":"ROUND(PAGE8!$O$70,5)","v":0}]
[{"$f":"$C$1&\".E30A.REM.AR.UIBUS.DISB.H.M\"","v":{"$error":"#N/A"}},{"$f":"ROUND(PAGE8!$Q$70,5)","v":0}]
[{"$f":"$C$1&\".E30A.REM.AR.UIBUS.OS.L.\"","v":{"$error":"#N/A"}},{"$f":"ROUND(PAGE8!$S$70,5)","v":0}]
[{"$f":"$C$1&\".E30A.REM.AR.UIBUS.OS.H.\"","v":{"$error":"#N/A"}},{"$f":"ROUND(PAGE8!$U$70,5)","v":0}]
[{"$f":"$C$1&\".E30A.REM.AR.UIBUS.OS.L.M\"","v":{"$error":"#N/A"}},{"$f":"ROUND(PAGE8!$W$70,5)","v":0}]
[{"$f":"$C$1&\".E30A.REM.AR.UIBUS.OS.H.M\"","v":{"$error":"#N/A"}},{"$f":"ROUND(PAGE8!$Y$70,5)","v":0}]
[{"$f":"$C$1&\".E30A.REM.AR.CONSM.APPR.L.\"","v":{"$error":"#N/A"}},{"$f":"ROUND(PAGE8!$C$72,5)","v":0}]
[{"$f":"$C$1&\".E30A.REM.AR.CONSM.APPR.H.\"","v":{"$error":"#N/A"}},{"$f":"ROUND(PAGE8!$E$72,5)","v":0}]
[{"$f":"$C$1&\".E30A.REM.AR.CONSM.APPR.L.M\"","v":{"$error":"#N/A"}},{"$f":"ROUND(PAGE8!$G$72,5)","v":0}]
[{"$f":"$C$1&\".E30A.REM.AR.CONSM.APPR.H.M\"","v":{"$error":"#N/A"}},{"$f":"ROUND(PAGE8!$I$72,5)","v":0}]
[{"$f":"$C$1&\".E30A.REM.AR.CONSM.DISB.L.\"","v":{"$error":"#N/A"}},{"$f":"ROUND(PAGE8!$K$72,5)","v":0}]
[{"$f":"$C$1&\".E30A.REM.AR.CONSM.DISB.H.\"","v":{"$error":"#N/A"}},{"$f":"ROUND(PAGE8!$M$72,5)","v":0}]
[{"$f":"$C$1&\".E30A.REM.AR.CONSM.DISB.L.M\"","v":{"$error":"#N/A"}},{"$f":"ROUND(PAGE8!$O$72,5)","v":0}]
[{"$f":"$C$1&\".E30A.REM.AR.CONSM.DISB.H.M\"","v":{"$error":"#N/A"}},{"$f":"ROUND(PAGE8!$Q$72,5)","v":0}]
[{"$f":"$C$1&\".E30A.REM.AR.CONSM.OS.L.\"","v":{"$error":"#N/A"}},{"$f":"ROUND(PAGE8!$S$72,5)","v":0}]
[{"$f":"$C$1&\".E30A.REM.AR.CONSM.OS.H.\"","v":{"$error":"#N/A"}},{"$f":"ROUND(PAGE8!$U$72,5)","v":0}]
[{"$f":"$C$1&\".E30A.REM.AR.CONSM.OS.L.M\"","v":{"$error":"#N/A"}},{"$f":"ROUND(PAGE8!$W$72,5)","v":0}]
[{"$f":"$C$1&\".E30A.REM.AR.CONSM.OS.H.M\"","v":{"$error":"#N/A"}},{"$f":"ROUND(PAGE8!$Y$72,5)","v":0}]
["sect12","VAL"]
[{"$f":"$C$1&\".E30A.TR_FNDS.RE_MRTG_LNS_NRES..\"","v":{"$error":"#N/A"}},{"$f":"ROUND(PAGE9!$I$17,5)","v":0}]
[{"$f":"$C$1&\".E30A.TR_FNDS.RE_MRTG_LNS_RES..\"","v":{"$error":"#N/A"}},{"$f":"ROUND(PAGE9!$I$15,5)","v":0}]
[{"$f":"$C$1&\".E30A.TR_FNDS.RE_MRTG_LNS_TTL..\"","v":{"$error":"#N/A"}},{"$f":"ROUND(PAGE9!$I$13,5)","v":0}]

{"sheet":"ASCII2","index":4,"n_rows":1253,"n_cols":4,"rows_kept":1253,"cut":false,"hidden":true,"merged":[]}
["hdr","cb30A",{"$f":"VLOOKUP('COVER PAGE'!C7,Controls!$B$4:$C$28,2,FALSE)","v":{"$error":"#N/A"}},"3an"]
[{"$f":"VLOOKUP('COVER PAGE'!F9,Controls!$H$4:$I$147,2,FALSE)","v":9}]
[{"$f":"PAGE1!$C$16","v":24}]
["sect1","NUM","VAL"]
[{"$f":"$C$1&\".E30A.REM.PBSEC.APPR.LT450..\"","v":{"$error":"#N/A"}},{"$f":"ROUND(PAGE1!$G$26,5)","v":0},{"$f":"ROUND(PAGE1!$I$26,5)","v":0}]
[{"$f":"$C$1&\".E30A.REM.PBSEC.DISB.LT450..\"","v":{"$error":"#N/A"}},{"$f":"ROUND(PAGE1!$K$26,5)","v":0},{"$f":"ROUND(PAGE1!$M$26,5)","v":0}]
[{"$f":"$C$1&\".E30A.REM.PBSEC.OS.LT450..\"","v":{"$error":"#N/A"}},{"$f":"ROUND(PAGE1!$O$26,5)","v":0},{"$f":"ROUND(PAGE1!$Q$26,5)","v":0}]
[{"$f":"$C$1&\".E30A.REM.PBSEC.APPR.450TO750..\"","v":{"$error":"#N/A"}},{"$f":"ROUND(PAGE1!$G$27,5)","v":0},{"$f":"ROUND(PAGE1!$I$27,5)","v":0}]
[{"$f":"$C$1&\".E30A.REM.PBSEC.DISB.450TO750..\"","v":{"$error":"#N/A"}},{"$f":"ROUND(PAGE1!$K$27,5)","v":0},{"$f":"ROUND(PAGE1!$M$27,5)","v":0}]
[{"$f":"$C$1&\".E30A.REM.PBSEC.OS.450TO750..\"","v":{"$error":"#N/A"}},{"$f":"ROUND(PAGE1!$O$27,5)","v":0},{"$f":"ROUND(PAGE1!$Q$27,5)","v":0}]
[{"$f":"$C$1&\".E30A.REM.PBSEC.APPR.750TO1000..\"","v":{"$error":"#N/A"}},{"$f":"ROUND(PAGE1!$G$28,5)","v":0},{"$f":"ROUND(PAGE1!$I$28,5)","v":0}]
[{"$f":"$C$1&\".E30A.REM.PBSEC.DISB.750TO1000..\"","v":{"$error":"#N/A"}},{"$f":"ROUND(PAGE1!$K$28,5)","v":0},{"$f":"ROUND(PAGE1!$M$28,5)","v":0}]
[{"$f":"$C$1&\".E30A.REM.PBSEC.OS.750TO1000..\"","v":{"$error":"#N/A"}},{"$f":"ROUND(PAGE1!$O$28,5)","v":0},{"$f":"ROUND(PAGE1!$Q$28,5)","v":0}]
[{"$f":"$C$1&\".E30A.REM.PBSEC.APPR.1000TO1250..\"","v":{"$error":"#N/A"}},{"$f":"ROUND(PAGE1!$G$29,5)","v":0},{"$f":"ROUND(PAGE1!$I$29,5)","v":0}]
[{"$f":"$C$1&\".E30A.REM.PBSEC.DISB.1000TO1250..\"","v":{"$error":"#N/A"}},{"$f":"ROUND(PAGE1!$K$29,5)","v":0},{"$f":"ROUND(PAGE1!$M$29,5)","v":0}]
[{"$f":"$C$1&\".E30A.REM.PBSEC.OS.1000TO1250..\"","v":{"$error":"#N/A"}},{"$f":"ROUND(PAGE1!$O$29,5)","v":0},{"$f":"ROUND(PAGE1!$Q$29,5)","v":0}]
[{"$f":"$C$1&\".E30A.REM.PBSEC.APPR.1250TO1500..\"","v":{"$error":"#N/A"}},{"$f":"ROUND(PAGE1!$G$30,5)","v":0},{"$f":"ROUND(PAGE1!$I$30,5)","v":0}]
[{"$f":"$C$1&\".E30A.REM.PBSEC.DISB.1250TO1500..\"","v":{"$error":"#N/A"}},{"$f":"ROUND(PAGE1!$K$30,5)","v":0},{"$f":"ROUND(PAGE1!$M$30,5)","v":0}]
[{"$f":"$C$1&\".E30A.REM.PBSEC.OS.1250TO1500..\"","v":{"$error":"#N/A"}},{"$f":"ROUND(PAGE1!$O$30,5)","v":0},{"$f":"ROUND(PAGE1!$Q$30,5)","v":0}]
[{"$f":"$C$1&\".E30A.REM.PBSEC.APPR.1500TO1750..\"","v":{"$error":"#N/A"}},{"$f":"ROUND(PAGE1!$G$31,5)","v":0},{"$f":"ROUND(PAGE1!$I$31,5)","v":0}]
[{"$f":"$C$1&\".E30A.REM.PBSEC.DISB.1500TO1750..\"","v":{"$error":"#N/A"}},{"$f":"ROUND(PAGE1!$K$31,5)","v":0},{"$f":"ROUND(PAGE1!$M$31,5)","v":0}]
[{"$f":"$C$1&\".E30A.REM.PBSEC.OS.1500TO1750..\"","v":{"$error":"#N/A"}},{"$f":"ROUND(PAGE1!$O$31,5)","v":0},{"$f":"ROUND(PAGE1!$Q$31,5)","v":0}]
[{"$f":"$C$1&\".E30A.REM.PBSEC.APPR.1750TO2000..\"","v":{"$error":"#N/A"}},{"$f":"ROUND(PAGE1!$G$32,5)","v":0},{"$f":"ROUND(PAGE1!$I$32,5)","v":0}]
[{"$f":"$C$1&\".E30A.REM.PBSEC.DISB.1750TO2000..\"","v":{"$error":"#N/A"}},{"$f":"ROUND(PAGE1!$K$32,5)","v":0},{"$f":"ROUND(PAGE1!$M$32,5)","v":0}]
[{"$f":"$C$1&\".E30A.REM.PBSEC.OS.1750TO2000..\"","v":{"$error":"#N/A"}},{"$f":"ROUND(PAGE1!$O$32,5)","v":0},{"$f":"ROUND(PAGE1!$Q$32,5)","v":0}]
[{"$f":"$C$1&\".E30A.REM.PBSEC.APPR.2000TO2250..\"","v":{"$error":"#N/A"}},{"$f":"ROUND(PAGE1!$G$33,5)","v":0},{"$f":"ROUND(PAGE1!$I$33,5)","v":0}]
[{"$f":"$C$1&\".E30A.REM.PBSEC.DISB.2000TO2250..\"","v":{"$error":"#N/A"}},{"$f":"ROUND(PAGE1!$K$33,5)","v":0},{"$f":"ROUND(PAGE1!$M$33,5)","v":0}]
[{"$f":"$C$1&\".E30A.REM.PBSEC.OS.2000TO2250..\"","v":{"$error":"#N/A"}},{"$f":"ROUND(PAGE1!$O$33,5)","v":0},{"$f":"ROUND(PAGE1!$Q$33,5)","v":0}]
[{"$f":"$C$1&\".E30A.REM.PBSEC.APPR.2250TO2500..\"","v":{"$error":"#N/A"}},{"$f":"ROUND(PAGE1!$G$34,5)","v":0},{"$f":"ROUND(PAGE1!$I$34,5)","v":0}]
[{"$f":"$C$1&\".E30A.REM.PBSEC.DISB.2250TO2500..\"","v":{"$error":"#N/A"}},{"$f":"ROUND(PAGE1!$K$34,5)","v":0},{"$f":"ROUND(PAGE1!$M$34,5)","v":0}]
[{"$f":"$C$1&\".E30A.REM.PBSEC.OS.2250TO2500..\"","v":{"$error":"#N/A"}},{"$f":"ROUND(PAGE1!$O$34,5)","v":0},{"$f":"ROUND(PAGE1!$Q$34,5)","v":0}]
[{"$f":"$C$1&\".E30A.REM.PBSEC.APPR.2500TO2750..\"","v":{"$error":"#N/A"}},{"$f":"ROUND(PAGE1!$G$35,5)","v":0},{"$f":"ROUND(PAGE1!$I$35,5)","v":0}]
[{"$f":"$C$1&\".E30A.REM.PBSEC.DISB.2500TO2750..\"","v":{"$error":"#N/A"}},{"$f":"ROUND(PAGE1!$K$35,5)","v":0},{"$f":"ROUND(PAGE1!$M$35,5)","v":0}]
[{"$f":"$C$1&\".E30A.REM.PBSEC.OS.2500TO2750..\"","v":{"$error":"#N/A"}},{"$f":"ROUND(PAGE1!$O$35,5)","v":0},{"$f":"ROUND(PAGE1!$Q$35,5)","v":0}]
[{"$f":"$C$1&\".E30A.REM.PBSEC.APPR.2750TO3000..\"","v":{"$error":"#N/A"}},{"$f":"ROUND(PAGE1!$G$36,5)","v":0},{"$f":"ROUND(PAGE1!$I$36,5)","v":0}]
[{"$f":"$C$1&\".E30A.REM.PBSEC.DISB.2750TO3000..\"","v":{"$error":"#N/A"}},{"$f":"ROUND(PAGE1!$K$36,5)","v":0},{"$f":"ROUND(PAGE1!$M$36,5)","v":0}]
[{"$f":"$C$1&\".E30A.REM.PBSEC.OS.2750TO3000..\"","v":{"$error":"#N/A"}},{"$f":"ROUND(PAGE1!$O$36,5)","v":0},{"$f":"ROUND(PAGE1!$Q$36,5)","v":0}]
[{"$f":"$C$1&\".E30A.REM.PBSEC.APPR.OVR3000..\"","v":{"$error":"#N/A"}},{"$f":"ROUND(PAGE1!$G$37,5)","v":0},{"$f":"ROUND(PAGE1!$I$37,5)","v":0}]
[{"$f":"$C$1&\".E30A.REM.PBSEC.DISB.OVR3000..\"","v":{"$error":"#N/A"}},{"$f":"ROUND(PAGE1!$K$37,5)","v":0},{"$f":"ROUND(PAGE1!$M$37,5)","v":0}]
[{"$f":"$C$1&\".E30A.REM.PBSEC.OS.OVR3000..\"","v":{"$error":"#N/A"}},{"$f":"ROUND(PAGE1!$O$37,5)","v":0},{"$f":"ROUND(PAGE1!$Q$37,5)","v":0}]
[{"$f":"$C$1&\".E30A.REM.PBSEC.APPR.TTL..\"","v":{"$error":"#N/A"}},{"$f":"ROUND(PAGE1!$G$25,5)","v":0},{"$f":"ROUND(PAGE1!$I$25,5)","v":0}]
[{"$f":"$C$1&\".E30A.REM.PBSEC.DISB.TTL..\"","v":{"$error":"#N/A"}},{"$f":"ROUND(PAGE1!$K$25,5)","v":0},{"$f":"ROUND(PAGE1!$M$25,5)","v":0}]
[{"$f":"$C$1&\".E30A.REM.PBSEC.OS.TTL..\"","v":{"$error":"#N/A"}},{"$f":"ROUND(PAGE1!$O$25,5)","v":0},{"$f":"ROUND(PAGE1!$Q$25,5)","v":0}]
[{"$f":"$C$1&\".E30A.REM.PVFIN.APPR.LT450..\"","v":{"$error":"#N/A"}},{"$f":"ROUND(PAGE1!$G$41,5)","v":0},{"$f":"ROUND(PAGE1!$I$41,5)","v":0}]
[{"$f":"$C$1&\".E30A.REM.PVFIN.DISB.LT450..\"","v":{"$error":"#N/A"}},{"$f":"ROUND(PAGE1!$K$41,5)","v":0},{"$f":"ROUND(PAGE1!$M$41,5)","v":0}]
[{"$f":"$C$1&\".E30A.REM.PVFIN.OS.LT450..\"","v":{"$error":"#N/A"}},{"$f":"ROUND(PAGE1!$O$41,5)","v":0},{"$f":"ROUND(PAGE1!$Q$41,5)","v":0}]
[{"$f":"$C$1&\".E30A.REM.PVFIN.APPR.450TO750..\"","v":{"$error":"#N/A"}},{"$f":"ROUND(PAGE1!$G$42,5)","v":0},{"$f":"ROUND(PAGE1!$I$42,5)","v":0}]
[{"$f":"$C$1&\".E30A.REM.PVFIN.DISB.450TO750..\"","v":{"$error":"#N/A"}},{"$f":"ROUND(PAGE1!$K$42,5)","v":0},{"$f":"ROUND(PAGE1!$M$42,5)","v":0}]
[{"$f":"$C$1&\".E30A.REM.PVFIN.OS.450TO750..\"","v":{"$error":"#N/A"}},{"$f":"ROUND(PAGE1!$O$42,5)","v":0},{"$f":"ROUND(PAGE1!$Q$42,5)","v":0}]
[{"$f":"$C$1&\".E30A.REM.PVFIN.APPR.750TO1000..\"","v":{"$error":"#N/A"}},{"$f":"ROUND(PAGE1!$G$43,5)","v":0},{"$f":"ROUND(PAGE1!$I$43,5)","v":0}]
[{"$f":"$C$1&\".E30A.REM.PVFIN.DISB.750TO1000..\"","v":{"$error":"#N/A"}},{"$f":"ROUND(PAGE1!$K$43,5)","v":0},{"$f":"ROUND(PAGE1!$M$43,5)","v":0}]
[{"$f":"$C$1&\".E30A.REM.PVFIN.OS.750TO1000..\"","v":{"$error":"#N/A"}},{"$f":"ROUND(PAGE1!$O$43,5)","v":0},{"$f":"ROUND(PAGE1!$Q$43,5)","v":0}]
[{"$f":"$C$1&\".E30A.REM.PVFIN.APPR.1000TO1250..\"","v":{"$error":"#N/A"}},{"$f":"ROUND(PAGE1!$G$44,5)","v":0},{"$f":"ROUND(PAGE1!$I$44,5)","v":0}]
[{"$f":"$C$1&\".E30A.REM.PVFIN.DISB.1000TO1250..\"","v":{"$error":"#N/A"}},{"$f":"ROUND(PAGE1!$K$44,5)","v":0},{"$f":"ROUND(PAGE1!$M$44,5)","v":0}]
[{"$f":"$C$1&\".E30A.REM.PVFIN.OS.1000TO1250..\"","v":{"$error":"#N/A"}},{"$f":"ROUND(PAGE1!$O$44,5)","v":0},{"$f":"ROUND(PAGE1!$Q$44,5)","v":0}]
[{"$f":"$C$1&\".E30A.REM.PVFIN.APPR.1250TO1500..\"","v":{"$error":"#N/A"}},{"$f":"ROUND(PAGE1!$G$45,5)","v":0},{"$f":"ROUND(PAGE1!$I$45,5)","v":0}]
[{"$f":"$C$1&\".E30A.REM.PVFIN.DISB.1250TO1500..\"","v":{"$error":"#N/A"}},{"$f":"ROUND(PAGE1!$K$45,5)","v":0},{"$f":"ROUND(PAGE1!$M$45,5)","v":0}]
[{"$f":"$C$1&\".E30A.REM.PVFIN.OS.1250TO1500..\"","v":{"$error":"#N/A"}},{"$f":"ROUND(PAGE1!$O$45,5)","v":0},{"$f":"ROUND(PAGE1!$Q$45,5)","v":0}]
[{"$f":"$C$1&\".E30A.REM.PVFIN.APPR.1500TO1750..\"","v":{"$error":"#N/A"}},{"$f":"ROUND(PAGE1!$G$46,5)","v":0},{"$f":"ROUND(PAGE1!$I$46,5)","v":0}]
[{"$f":"$C$1&\".E30A.REM.PVFIN.DISB.1500TO1750..\"","v":{"$error":"#N/A"}},{"$f":"ROUND(PAGE1!$K$46,5)","v":0},{"$f":"ROUND(PAGE1!$M$46,5)","v":0}]
[{"$f":"$C$1&\".E30A.REM.PVFIN.OS.1500TO1750..\"","v":{"$error":"#N/A"}},{"$f":"ROUND(PAGE1!$O$46,5)","v":0},{"$f":"ROUND(PAGE1!$Q$46,5)","v":0}]
[{"$f":"$C$1&\".E30A.REM.PVFIN.APPR.1750TO2000..\"","v":{"$error":"#N/A"}},{"$f":"ROUND(PAGE1!$G$47,5)","v":0},{"$f":"ROUND(PAGE1!$I$47,5)","v":0}]
[{"$f":"$C$1&\".E30A.REM.PVFIN.DISB.1750TO2000..\"","v":{"$error":"#N/A"}},{"$f":"ROUND(PAGE1!$K$47,5)","v":0},{"$f":"ROUND(PAGE1!$M$47,5)","v":0}]
[{"$f":"$C$1&\".E30A.REM.PVFIN.OS.1750TO2000..\"","v":{"$error":"#N/A"}},{"$f":"ROUND(PAGE1!$O$47,5)","v":0},{"$f":"ROUND(PAGE1!$Q$47,5)","v":0}]
[{"$f":"$C$1&\".E30A.REM.PVFIN.APPR.2000TO2250..\"","v":{"$error":"#N/A"}},{"$f":"ROUND(PAGE1!$G$48,5)","v":0},{"$f":"ROUND(PAGE1!$I$48,5)","v":0}]
[{"$f":"$C$1&\".E30A.REM.PVFIN.DISB.2000TO2250..\"","v":{"$error":"#N/A"}},{"$f":"ROUND(PAGE1!$K$48,5)","v":0},{"$f":"ROUND(PAGE1!$M$48,5)","v":0}]
[{"$f":"$C$1&\".E30A.REM.PVFIN.OS.2000TO2250..\"","v":{"$error":"#N/A"}},{"$f":"ROUND(PAGE1!$O$48,5)","v":0},{"$f":"ROUND(PAGE1!$Q$48,5)","v":0}]
[{"$f":"$C$1&\".E30A.REM.PVFIN.APPR.2250TO2500..\"","v":{"$error":"#N/A"}},{"$f":"ROUND(PAGE1!$G$49,5)","v":0},{"$f":"ROUND(PAGE1!$I$49,5)","v":0}]
[{"$f":"$C$1&\".E30A.REM.PVFIN.DISB.2250TO2500..\"","v":{"$error":"#N/A"}},{"$f":"ROUND(PAGE1!$K$49,5)","v":0},{"$f":"ROUND(PAGE1!$M$49,5)","v":0}]
[{"$f":"$C$1&\".E30A.REM.PVFIN.OS.2250TO2500..\"","v":{"$error":"#N/A"}},{"$f":"ROUND(PAGE1!$O$49,5)","v":0},{"$f":"ROUND(PAGE1!$Q$49,5)","v":0}]
[{"$f":"$C$1&\".E30A.REM.PVFIN.APPR.2500TO2750..\"","v":{"$error":"#N/A"}},{"$f":"ROUND(PAGE1!$G$50,5)","v":0},{"$f":"ROUND(PAGE1!$I$50,5)","v":0}]
[{"$f":"$C$1&\".E30A.REM.PVFIN.DISB.2500TO2750..\"","v":{"$error":"#N/A"}},{"$f":"ROUND(PAGE1!$K$50,5)","v":0},{"$f":"ROUND(PAGE1!$M$50,5)","v":0}]
[{"$f":"$C$1&\".E30A.REM.PVFIN.OS.2500TO2750..\"","v":{"$error":"#N/A"}},{"$f":"ROUND(PAGE1!$O$50,5)","v":0},{"$f":"ROUND(PAGE1!$Q$50,5)","v":0}]
[{"$f":"$C$1&\".E30A.REM.PVFIN.APPR.2750TO3000..\"","v":{"$error":"#N/A"}},{"$f":"ROUND(PAGE1!$G$51,5)","v":0},{"$f":"ROUND(PAGE1!$I$51,5)","v":0}]
[{"$f":"$C$1&\".E30A.REM.PVFIN.DISB.2750TO3000..\"","v":{"$error":"#N/A"}},{"$f":"ROUND(PAGE1!$K$51,5)","v":0},{"$f":"ROUND(PAGE1!$M$51,5)","v":0}]
[{"$f":"$C$1&\".E30A.REM.PVFIN.OS.2750TO3000..\"","v":{"$error":"#N/A"}},{"$f":"ROUND(PAGE1!$O$51,5)","v":0},{"$f":"ROUND(PAGE1!$Q$51,5)","v":0}]
[{"$f":"$C$1&\".E30A.REM.PVFIN.APPR.OVR3000..\"","v":{"$error":"#N/A"}},{"$f":"ROUND(PAGE1!$G$52,5)","v":0},{"$f":"ROUND(PAGE1!$I$52,5)","v":0}]
[{"$f":"$C$1&\".E30A.REM.PVFIN.DISB.OVR3000..\"","v":{"$error":"#N/A"}},{"$f":"ROUND(PAGE1!$K$52,5)","v":0},{"$f":"ROUND(PAGE1!$M$52,5)","v":0}]
[{"$f":"$C$1&\".E30A.REM.PVFIN.OS.OVR3000..\"","v":{"$error":"#N/A"}},{"$f":"ROUND(PAGE1!$O$52,5)","v":0},{"$f":"ROUND(PAGE1!$Q$52,5)","v":0}]
[{"$f":"$C$1&\".E30A.REM.PVFIN.APPR.TTL..\"","v":{"$error":"#N/A"}},{"$f":"ROUND(PAGE1!$G$40,5)","v":0},{"$f":"ROUND(PAGE1!$I$40,5)","v":0}]
[{"$f":"$C$1&\".E30A.REM.PVFIN.DISB.TTL..\"","v":{"$error":"#N/A"}},{"$f":"ROUND(PAGE1!$K$40,5)","v":0},{"$f":"ROUND(PAGE1!$M$40,5)","v":0}]
[{"$f":"$C$1&\".E30A.REM.PVFIN.OS.TTL..\"","v":{"$error":"#N/A"}},{"$f":"ROUND(PAGE1!$O$40,5)","v":0},{"$f":"ROUND(PAGE1!$Q$40,5)","v":0}]
[{"$f":"$C$1&\".E30A.REM.IBUS.APPR.LT450..\"","v":{"$error":"#N/A"}},{"$f":"ROUND(PAGE1!$G$56,5)","v":0},{"$f":"ROUND(PAGE1!$I$56,5)","v":0}]
[{"$f":"$C$1&\".E30A.REM.IBUS.DISB.LT450..\"","v":{"$error":"#N/A"}},{"$f":"ROUND(PAGE1!$K$56,5)","v":0},{"$f":"ROUND(PAGE1!$M$56,5)","v":0}]
[{"$f":"$C$1&\".E30A.REM.IBUS.OS.LT450..\"","v":{"$error":"#N/A"}},{"$f":"ROUND(PAGE1!$O$56,5)","v":0},{"$f":"ROUND(PAGE1!$Q$56,5)","v":0}]
[{"$f":"$C$1&\".E30A.REM.IBUS.APPR.450TO750..\"","v":{"$error":"#N/A"}},{"$f":"ROUND(PAGE1!$G$57,5)","v":0},{"$f":"ROUND(PAGE1!$I$57,5)","v":0}]
[{"$f":"$C$1&\".E30A.REM.IBUS.DISB.450TO750..\"","v":{"$error":"#N/A"}},{"$f":"ROUND(PAGE1!$K$57,5)","v":0},{"$f":"ROUND(PAGE1!$M$57,5)","v":0}]
[{"$f":"$C$1&\".E30A.REM.IBUS.OS.450TO750..\"","v":{"$error":"#N/A"}},{"$f":"ROUND(PAGE1!$O$57,5)","v":0},{"$f":"ROUND(PAGE1!$Q$57,5)","v":0}]
[{"$f":"$C$1&\".E30A.REM.IBUS.APPR.750TO1000..\"","v":{"$error":"#N/A"}},{"$f":"ROUND(PAGE1!$G$58,5)","v":0},{"$f":"ROUND(PAGE1!$I$58,5)","v":0}]
[{"$f":"$C$1&\".E30A.REM.IBUS.DISB.750TO1000..\"","v":{"$error":"#N/A"}},{"$f":"ROUND(PAGE1!$K$58,5)","v":0},{"$f":"ROUND(PAGE1!$M$58,5)","v":0}]
[{"$f":"$C$1&\".E30A.REM.IBUS.OS.750TO1000..\"","v":{"$error":"#N/A"}},{"$f":"ROUND(PAGE1!$O$58,5)","v":0},{"$f":"ROUND(PAGE1!$Q$58,5)","v":0}]
[{"$f":"$C$1&\".E30A.REM.IBUS.APPR.1000TO1250..\"","v":{"$error":"#N/A"}},{"$f":"ROUND(PAGE1!$G$59,5)","v":0},{"$f":"ROUND(PAGE1!$I$59,5)","v":0}]
[{"$f":"$C$1&\".E30A.REM.IBUS.DISB.1000TO1250..\"","v":{"$error":"#N/A"}},{"$f":"ROUND(PAGE1!$K$59,5)","v":0},{"$f":"ROUND(PAGE1!$M$59,5)","v":0}]
[{"$f":"$C$1&\".E30A.REM.IBUS.OS.1000TO1250..\"","v":{"$error":"#N/A"}},{"$f":"ROUND(PAGE1!$O$59,5)","v":0},{"$f":"ROUND(PAGE1!$Q$59,5)","v":0}]
[{"$f":"$C$1&\".E30A.REM.IBUS.APPR.1250TO1500..\"","v":{"$error":"#N/A"}},{"$f":"ROUND(PAGE1!$G$60,5)","v":0},{"$f":"ROUND(PAGE1!$I$60,5)","v":0}]
[{"$f":"$C$1&\".E30A.REM.IBUS.DISB.1250TO1500..\"","v":{"$error":"#N/A"}},{"$f":"ROUND(PAGE1!$K$60,5)","v":0},{"$f":"ROUND(PAGE1!$M$60,5)","v":0}]
[{"$f":"$C$1&\".E30A.REM.IBUS.OS.1250TO1500..\"","v":{"$error":"#N/A"}},{"$f":"ROUND(PAGE1!$O$60,5)","v":0},{"$f":"ROUND(PAGE1!$Q$60,5)","v":0}]
[{"$f":"$C$1&\".E30A.REM.IBUS.APPR.1500TO1750..\"","v":{"$error":"#N/A"}},{"$f":"ROUND(PAGE1!$G$61,5)","v":0},{"$f":"ROUND(PAGE1!$I$61,5)","v":0}]
[{"$f":"$C$1&\".E30A.REM.IBUS.DISB.1500TO1750..\"","v":{"$error":"#N/A"}},{"$f":"ROUND(PAGE1!$K$61,5)","v":0},{"$f":"ROUND(PAGE1!$M$61,5)","v":0}]
[{"$f":"$C$1&\".E30A.REM.IBUS.OS.1500TO1750..\"","v":{"$error":"#N/A"}},{"$f":"ROUND(PAGE1!$O$61,5)","v":0},{"$f":"ROUND(PAGE1!$Q$61,5)","v":0}]
[{"$f":"$C$1&\".E30A.REM.IBUS.APPR.1750TO2000..\"","v":{"$error":"#N/A"}},{"$f":"ROUND(PAGE1!$G$62,5)","v":0},{"$f":"ROUND(PAGE1!$I$62,5)","v":0}]
[{"$f":"$C$1&\".E30A.REM.IBUS.DISB.1750TO2000..\"","v":{"$error":"#N/A"}},{"$f":"ROUND(PAGE1!$K$62,5)","v":0},{"$f":"ROUND(PAGE1!$M$62,5)","v":0}]
[{"$f":"$C$1&\".E30A.REM.IBUS.OS.1750TO2000..\"","v":{"$error":"#N/A"}},{"$f":"ROUND(PAGE1!$O$62,5)","v":0},{"$f":"ROUND(PAGE1!$Q$62,5)","v":0}]
[{"$f":"$C$1&\".E30A.REM.IBUS.APPR.2000TO2250..\"","v":{"$error":"#N/A"}},{"$f":"ROUND(PAGE1!$G$63,5)","v":0},{"$f":"ROUND(PAGE1!$I$63,5)","v":0}]
[{"$f":"$C$1&\".E30A.REM.IBUS.DISB.2000TO2250..\"","v":{"$error":"#N/A"}},{"$f":"ROUND(PAGE1!$K$63,5)","v":0},{"$f":"ROUND(PAGE1!$M$63,5)","v":0}]
[{"$f":"$C$1&\".E30A.REM.IBUS.OS.2000TO2250..\"","v":{"$error":"#N/A"}},{"$f":"ROUND(PAGE1!$O$63,5)","v":0},{"$f":"ROUND(PAGE1!$Q$63,5)","v":0}]
[{"$f":"$C$1&\".E30A.REM.IBUS.APPR.2250TO2500..\"","v":{"$error":"#N/A"}},{"$f":"ROUND(PAGE1!$G$64,5)","v":0},{"$f":"ROUND(PAGE1!$I$64,5)","v":0}]
[{"$f":"$C$1&\".E30A.REM.IBUS.DISB.2250TO2500..\"","v":{"$error":"#N/A"}},{"$f":"ROUND(PAGE1!$K$64,5)","v":0},{"$f":"ROUND(PAGE1!$M$64,5)","v":0}]
[{"$f":"$C$1&\".E30A.REM.IBUS.OS.2250TO2500..\"","v":{"$error":"#N/A"}},{"$f":"ROUND(PAGE1!$O$64,5)","v":0},{"$f":"ROUND(PAGE1!$Q$64,5)","v":0}]
[{"$f":"$C$1&\".E30A.REM.IBUS.APPR.2500TO2750..\"","v":{"$error":"#N/A"}},{"$f":"ROUND(PAGE1!$G$65,5)","v":0},{"$f":"ROUND(PAGE1!$I$65,5)","v":0}]
[{"$f":"$C$1&\".E30A.REM.IBUS.DISB.2500TO2750..\"","v":{"$error":"#N/A"}},{"$f":"ROUND(PAGE1!$K$65,5)","v":0},{"$f":"ROUND(PAGE1!$M$65,5)","v":0}]
[{"$f":"$C$1&\".E30A.REM.IBUS.OS.2500TO2750..\"","v":{"$error":"#N/A"}},{"$f":"ROUND(PAGE1!$O$65,5)","v":0},{"$f":"ROUND(PAGE1!$Q$65,5)","v":0}]
[{"$f":"$C$1&\".E30A.REM.IBUS.APPR.2750TO3000..\"","v":{"$error":"#N/A"}},{"$f":"ROUND(PAGE1!$G$66,5)","v":0},{"$f":"ROUND(PAGE1!$I$66,5)","v":0}]
[{"$f":"$C$1&\".E30A.REM.IBUS.DISB.2750TO3000..\"","v":{"$error":"#N/A"}},{"$f":"ROUND(PAGE1!$K$66,5)","v":0},{"$f":"ROUND(PAGE1!$M$66,5)","v":0}]
[{"$f":"$C$1&\".E30A.REM.IBUS.OS.2750TO3000..\"","v":{"$error":"#N/A"}},{"$f":"ROUND(PAGE1!$O$66,5)","v":0},{"$f":"ROUND(PAGE1!$Q$66,5)","v":0}]
[{"$f":"$C$1&\".E30A.REM.IBUS.APPR.OVR3000..\"","v":{"$error":"#N/A"}},{"$f":"ROUND(PAGE1!$G$67,5)","v":0},{"$f":"ROUND(PAGE1!$I$67,5)","v":0}]
[{"$f":"$C$1&\".E30A.REM.IBUS.DISB.OVR3000..\"","v":{"$error":"#N/A"}},{"$f":"ROUND(PAGE1!$K$67,5)","v":0},{"$f":"ROUND(PAGE1!$M$67,5)","v":0}]
[{"$f":"$C$1&\".E30A.REM.IBUS.OS.OVR3000..\"","v":{"$error":"#N/A"}},{"$f":"ROUND(PAGE1!$O$67,5)","v":0},{"$f":"ROUND(PAGE1!$Q$67,5)","v":0}]
[{"$f":"$C$1&\".E30A.REM.IBUS.APPR.TTL..\"","v":{"$error":"#N/A"}},{"$f":"ROUND(PAGE1!$G$55,5)","v":0},{"$f":"ROUND(PAGE1!$I$55,5)","v":0}]
[{"$f":"$C$1&\".E30A.REM.IBUS.DISB.TTL..\"","v":{"$error":"#N/A"}},{"$f":"ROUND(PAGE1!$K$55,5)","v":0},{"$f":"ROUND(PAGE1!$M$55,5)","v":0}]
[{"$f":"$C$1&\".E30A.REM.IBUS.OS.TTL..\"","v":{"$error":"#N/A"}},{"$f":"ROUND(PAGE1!$O$55,5)","v":0},{"$f":"ROUND(PAGE1!$Q$55,5)","v":0}]
[{"$f":"$C$1&\".E30A.REM.UIBUS.APPR.LT450..\"","v":{"$error":"#N/A"}},{"$f":"ROUND(PAGE1!$G$71,5)","v":0},{"$f":"ROUND(PAGE1!$I$71,5)","v":0}]
[{"$f":"$C$1&\".E30A.REM.UIBUS.DISB.LT450..\"","v":{"$error":"#N/A"}},{"$f":"ROUND(PAGE1!$K$71,5)","v":0},{"$f":"ROUND(PAGE1!$M$71,5)","v":0}]
[{"$f":"$C$1&\".E30A.REM.UIBUS.OS.LT450..\"","v":{"$error":"#N/A"}},{"$f":"ROUND(PAGE1!$O$71,5)","v":0},{"$f":"ROUND(PAGE1!$Q$71,5)","v":0}]
[{"$f":"$C$1&\".E30A.REM.UIBUS.APPR.450TO750..\"","v":{"$error":"#N/A"}},{"$f":"ROUND(PAGE1!$G$72,5)","v":0},{"$f":"ROUND(PAGE1!$I$72,5)","v":0}]
[{"$f":"$C$1&\".E30A.REM.UIBUS.DISB.450TO750..\"","v":{"$error":"#N/A"}},{"$f":"ROUND(PAGE1!$K$72,5)","v":0},{"$f":"ROUND(PAGE1!$M$72,5)","v":0}]
[{"$f":"$C$1&\".E30A.REM.UIBUS.OS.450TO750..\"","v":{"$error":"#N/A"}},{"$f":"ROUND(PAGE1!$O$72,5)","v":0},{"$f":"ROUND(PAGE1!$Q$72,5)","v":0}]
[{"$f":"$C$1&\".E30A.REM.UIBUS.APPR.750TO1000..\"","v":{"$error":"#N/A"}},{"$f":"ROUND(PAGE1!$G$73,5)","v":0},{"$f":"ROUND(PAGE1!$I$73,5)","v":0}]
[{"$f":"$C$1&\".E30A.REM.UIBUS.DISB.750TO1000..\"","v":{"$error":"#N/A"}},{"$f":"ROUND(PAGE1!$K$73,5)","v":0},{"$f":"ROUND(PAGE1!$M$73,5)","v":0}]
[{"$f":"$C$1&\".E30A.REM.UIBUS.OS.750TO1000..\"","v":{"$error":"#N/A"}},{"$f":"ROUND(PAGE1!$O$73,5)","v":0},{"$f":"ROUND(PAGE1!$Q$73,5)","v":0}]
[{"$f":"$C$1&\".E30A.REM.UIBUS.APPR.1000TO1250..\"","v":{"$error":"#N/A"}},{"$f":"ROUND(PAGE1!$G$74,5)","v":0},{"$f":"ROUND(PAGE1!$I$74,5)","v":0}]
[{"$f":"$C$1&\".E30A.REM.UIBUS.DISB.1000TO1250..\"","v":{"$error":"#N/A"}},{"$f":"ROUND(PAGE1!$K$74,5)","v":0},{"$f":"ROUND(PAGE1!$M$74,5)","v":0}]
[{"$f":"$C$1&\".E30A.REM.UIBUS.OS.1000TO1250..\"","v":{"$error":"#N/A"}},{"$f":"ROUND(PAGE1!$O$74,5)","v":0},{"$f":"ROUND(PAGE1!$Q$74,5)","v":0}]
[{"$f":"$C$1&\".E30A.REM.UIBUS.APPR.1250TO1500..\"","v":{"$error":"#N/A"}},{"$f":"ROUND(PAGE1!$G$75,5)","v":0},{"$f":"ROUND(PAGE1!$I$75,5)","v":0}]
[{"$f":"$C$1&\".E30A.REM.UIBUS.DISB.1250TO1500..\"","v":{"$error":"#N/A"}},{"$f":"ROUND(PAGE1!$K$75,5)","v":0},{"$f":"ROUND(PAGE1!$M$75,5)","v":0}]
[{"$f":"$C$1&\".E30A.REM.UIBUS.OS.1250TO1500..\"","v":{"$error":"#N/A"}},{"$f":"ROUND(PAGE1!$O$75,5)","v":0},{"$f":"ROUND(PAGE1!$Q$75,5)","v":0}]
[{"$f":"$C$1&\".E30A.REM.UIBUS.APPR.1500TO1750..\"","v":{"$error":"#N/A"}},{"$f":"ROUND(PAGE1!$G$76,5)","v":0},{"$f":"ROUND(PAGE1!$I$76,5)","v":0}]
[{"$f":"$C$1&\".E30A.REM.UIBUS.DISB.1500TO1750..\"","v":{"$error":"#N/A"}},{"$f":"ROUND(PAGE1!$K$76,5)","v":0},{"$f":"ROUND(PAGE1!$M$76,5)","v":0}]
[{"$f":"$C$1&\".E30A.REM.UIBUS.OS.1500TO1750..\"","v":{"$error":"#N/A"}},{"$f":"ROUND(PAGE1!$O$76,5)","v":0},{"$f":"ROUND(PAGE1!$Q$76,5)","v":0}]
[{"$f":"$C$1&\".E30A.REM.UIBUS.APPR.1750TO2000..\"","v":{"$error":"#N/A"}},{"$f":"ROUND(PAGE1!$G$77,5)","v":0},{"$f":"ROUND(PAGE1!$I$77,5)","v":0}]
[{"$f":"$C$1&\".E30A.REM.UIBUS.DISB.1750TO2000..\"","v":{"$error":"#N/A"}},{"$f":"ROUND(PAGE1!$K$77,5)","v":0},{"$f":"ROUND(PAGE1!$M$77,5)","v":0}]
[{"$f":"$C$1&\".E30A.REM.UIBUS.OS.1750TO2000..\"","v":{"$error":"#N/A"}},{"$f":"ROUND(PAGE1!$O$77,5)","v":0},{"$f":"ROUND(PAGE1!$Q$77,5)","v":0}]
[{"$f":"$C$1&\".E30A.REM.UIBUS.APPR.2000TO2250..\"","v":{"$error":"#N/A"}},{"$f":"ROUND(PAGE1!$G$78,5)","v":0},{"$f":"ROUND(PAGE1!$I$78,5)","v":0}]
[{"$f":"$C$1&\".E30A.REM.UIBUS.DISB.2000TO2250..\"","v":{"$error":"#N/A"}},{"$f":"ROUND(PAGE1!$K$78,5)","v":0},{"$f":"ROUND(PAGE1!$M$78,5)","v":0}]
[{"$f":"$C$1&\".E30A.REM.UIBUS.OS.2000TO2250..\"","v":{"$error":"#N/A"}},{"$f":"ROUND(PAGE1!$O$78,5)","v":0},{"$f":"ROUND(PAGE1!$Q$78,5)","v":0}]
[{"$f":"$C$1&\".E30A.REM.UIBUS.APPR.2250TO2500..\"","v":{"$error":"#N/A"}},{"$f":"ROUND(PAGE1!$G$79,5)","v":0},{"$f":"ROUND(PAGE1!$I$79,5)","v":0}]
[{"$f":"$C$1&\".E30A.REM.UIBUS.DISB.2250TO2500..\"","v":{"$error":"#N/A"}},{"$f":"ROUND(PAGE1!$K$79,5)","v":0},{"$f":"ROUND(PAGE1!$M$79,5)","v":0}]
[{"$f":"$C$1&\".E30A.REM.UIBUS.OS.2250TO2500..\"","v":{"$error":"#N/A"}},{"$f":"ROUND(PAGE1!$O$79,5)","v":0},{"$f":"ROUND(PAGE1!$Q$79,5)","v":0}]
[{"$f":"$C$1&\".E30A.REM.UIBUS.APPR.2500TO2750..\"","v":{"$error":"#N/A"}},{"$f":"ROUND(PAGE1!$G$80,5)","v":0},{"$f":"ROUND(PAGE1!$I$80,5)","v":0}]
[{"$f":"$C$1&\".E30A.REM.UIBUS.DISB.2500TO2750..\"","v":{"$error":"#N/A"}},{"$f":"ROUND(PAGE1!$K$80,5)","v":0},{"$f":"ROUND(PAGE1!$M$80,5)","v":0}]
[{"$f":"$C$1&\".E30A.REM.UIBUS.OS.2500TO2750..\"","v":{"$error":"#N/A"}},{"$f":"ROUND(PAGE1!$O$80,5)","v":0},{"$f":"ROUND(PAGE1!$Q$80,5)","v":0}]
[{"$f":"$C$1&\".E30A.REM.UIBUS.APPR.2750TO3000..\"","v":{"$error":"#N/A"}},{"$f":"ROUND(PAGE1!$G$81,5)","v":0},{"$f":"ROUND(PAGE1!$I$81,5)","v":0}]
[{"$f":"$C$1&\".E30A.REM.UIBUS.DISB.2750TO3000..\"","v":{"$error":"#N/A"}},{"$f":"ROUND(PAGE1!$K$81,5)","v":0},{"$f":"ROUND(PAGE1!$M$81,5)","v":0}]
[{"$f":"$C$1&\".E30A.REM.UIBUS.OS.2750TO3000..\"","v":{"$error":"#N/A"}},{"$f":"ROUND(PAGE1!$O$81,5)","v":0},{"$f":"ROUND(PAGE1!$Q$81,5)","v":0}]
[{"$f":"$C$1&\".E30A.REM.UIBUS.APPR.OVR3000..\"","v":{"$error":"#N/A"}},{"$f":"ROUND(PAGE1!$G$82,5)","v":0},{"$f":"ROUND(PAGE1!$I$82,5)","v":0}]
[{"$f":"$C$1&\".E30A.REM.UIBUS.DISB.OVR3000..\"","v":{"$error":"#N/A"}},{"$f":"ROUND(PAGE1!$K$82,5)","v":0},{"$f":"ROUND(PAGE1!$M$82,5)","v":0}]
[{"$f":"$C$1&\".E30A.REM.UIBUS.OS.OVR3000..\"","v":{"$error":"#N/A"}},{"$f":"ROUND(PAGE1!$O$82,5)","v":0},{"$f":"ROUND(PAGE1!$Q$82,5)","v":0}]
[{"$f":"$C$1&\".E30A.REM.UIBUS.APPR.TTL..\"","v":{"$error":"#N/A"}},{"$f":"ROUND(PAGE1!$G$70,5)","v":0},{"$f":"ROUND(PAGE1!$I$70,5)","v":0}]
[{"$f":"$C$1&\".E30A.REM.UIBUS.DISB.TTL..\"","v":{"$error":"#N/A"}},{"$f":"ROUND(PAGE1!$K$70,5)","v":0},{"$f":"ROUND(PAGE1!$M$70,5)","v":0}]
[{"$f":"$C$1&\".E30A.REM.UIBUS.OS.TTL..\"","v":{"$error":"#N/A"}},{"$f":"ROUND(PAGE1!$O$70,5)","v":0},{"$f":"ROUND(PAGE1!$Q$70,5)","v":0}]
[{"$f":"$C$1&\".E30A.REM.CONSM.APPR.LT450..\"","v":{"$error":"#N/A"}},{"$f":"ROUND(PAGE1!$G$85,5)","v":0},{"$f":"ROUND(PAGE1!$I$85,5)","v":0}]
[{"$f":"$C$1&\".E30A.REM.CONSM.DISB.LT450..\"","v":{"$error":"#N/A"}},{"$f":"ROUND(PAGE1!$K$85,5)","v":0},{"$f":"ROUND(PAGE1!$M$85,5)","v":0}]
[{"$f":"$C$1&\".E30A.REM.CONSM.OS.LT450..\"","v":{"$error":"#N/A"}},{"$f":"ROUND(PAGE1!$O$85,5)","v":0},{"$f":"ROUND(PAGE1!$Q$85,5)","v":0}]
[{"$f":"$C$1&\".E30A.REM.CONSM.APPR.450TO750..\"","v":{"$error":"#N/A"}},{"$f":"ROUND(PAGE1!$G$86,5)","v":0},{"$f":"ROUND(PAGE1!$I$86,5)","v":0}]
[{"$f":"$C$1&\".E30A.REM.CONSM.DISB.450TO750..\"","v":{"$error":"#N/A"}},{"$f":"ROUND(PAGE1!$K$86,5)","v":0},{"$f":"ROUND(PAGE1!$M$86,5)","v":0}]
[{"$f":"$C$1&\".E30A.REM.CONSM.OS.450TO750..\"","v":{"$error":"#N/A"}},{"$f":"ROUND(PAGE1!$O$86,5)","v":0},{"$f":"ROUND(PAGE1!$Q$86,5)","v":0}]
[{"$f":"$C$1&\".E30A.REM.CONSM.APPR.750TO1000..\"","v":{"$error":"#N/A"}},{"$f":"ROUND(PAGE1!$G$87,5)","v":0},{"$f":"ROUND(PAGE1!$I$87,5)","v":0}]
[{"$f":"$C$1&\".E30A.REM.CONSM.DISB.750TO1000..\"","v":{"$error":"#N/A"}},{"$f":"ROUND(PAGE1!$K$87,5)","v":0},{"$f":"ROUND(PAGE1!$M$87,5)","v":0}]
[{"$f":"$C$1&\".E30A.REM.CONSM.OS.750TO1000..\"","v":{"$error":"#N/A"}},{"$f":"ROUND(PAGE1!$O$87,5)","v":0},{"$f":"ROUND(PAGE1!$Q$87,5)","v":0}]
[{"$f":"$C$1&\".E30A.REM.CONSM.APPR.1000TO1250..\"","v":{"$error":"#N/A"}},{"$f":"ROUND(PAGE1!$G$88,5)","v":0},{"$f":"ROUND(PAGE1!$I$88,5)","v":0}]
[{"$f":"$C$1&\".E30A.REM.CONSM.DISB.1000TO1250..\"","v":{"$error":"#N/A"}},{"$f":"ROUND(PAGE1!$K$88,5)","v":0},{"$f":"ROUND(PAGE1!$M$88,5)","v":0}]
[{"$f":"$C$1&\".E30A.REM.CONSM.OS.1000TO1250..\"","v":{"$error":"#N/A"}},{"$f":"ROUND(PAGE1!$O$88,5)","v":0},{"$f":"ROUND(PAGE1!$Q$88,5)","v":0}]
[{"$f":"$C$1&\".E30A.REM.CONSM.APPR.1250TO1500..\"","v":{"$error":"#N/A"}},{"$f":"ROUND(PAGE1!$G$89,5)","v":0},{"$f":"ROUND(PAGE1!$I$89,5)","v":0}]
[{"$f":"$C$1&\".E30A.REM.CONSM.DISB.1250TO1500..\"","v":{"$error":"#N/A"}},{"$f":"ROUND(PAGE1!$K$89,5)","v":0},{"$f":"ROUND(PAGE1!$M$89,5)","v":0}]
[{"$f":"$C$1&\".E30A.REM.CONSM.OS.1250TO1500..\"","v":{"$error":"#N/A"}},{"$f":"ROUND(PAGE1!$O$89,5)","v":0},{"$f":"ROUND(PAGE1!$Q$89,5)","v":0}]
[{"$f":"$C$1&\".E30A.REM.CONSM.APPR.1500TO1750..\"","v":{"$error":"#N/A"}},{"$f":"ROUND(PAGE1!$G$90,5)","v":0},{"$f":"ROUND(PAGE1!$I$90,5)","v":0}]
[{"$f":"$C$1&\".E30A.REM.CONSM.DISB.1500TO1750..\"","v":{"$error":"#N/A"}},{"$f":"ROUND(PAGE1!$K$90,5)","v":0},{"$f":"ROUND(PAGE1!$M$90,5)","v":0}]
[{"$f":"$C$1&\".E30A.REM.CONSM.OS.1500TO1750..\"","v":{"$error":"#N/A"}},{"$f":"ROUND(PAGE1!$O$90,5)","v":0},{"$f":"ROUND(PAGE1!$Q$90,5)","v":0}]
[{"$f":"$C$1&\".E30A.REM.CONSM.APPR.1750TO2000..\"","v":{"$error":"#N/A"}},{"$f":"ROUND(PAGE1!$G$91,5)","v":0},{"$f":"ROUND(PAGE1!$I$91,5)","v":0}]
[{"$f":"$C$1&\".E30A.REM.CONSM.DISB.1750TO2000..\"","v":{"$error":"#N/A"}},{"$f":"ROUND(PAGE1!$K$91,5)","v":0},{"$f":"ROUND(PAGE1!$M$91,5)","v":0}]
[{"$f":"$C$1&\".E30A.REM.CONSM.OS.1750TO2000..\"","v":{"$error":"#N/A"}},{"$f":"ROUND(PAGE1!$O$91,5)","v":0},{"$f":"ROUND(PAGE1!$Q$91,5)","v":0}]
[{"$f":"$C$1&\".E30A.REM.CONSM.APPR.2000TO2250..\"","v":{"$error":"#N/A"}},{"$f":"ROUND(PAGE1!$G$92,5)","v":0},{"$f":"ROUND(PAGE1!$I$92,5)","v":0}]
[{"$f":"$C$1&\".E30A.REM.CONSM.DISB.2000TO2250..\"","v":{"$error":"#N/A"}},{"$f":"ROUND(PAGE1!$K$92,5)","v":0},{"$f":"ROUND(PAGE1!$M$92,5)","v":0}]
[{"$f":"$C$1&\".E30A.REM.CONSM.OS.2000TO2250..\"","v":{"$error":"#N/A"}},{"$f":"ROUND(PAGE1!$O$92,5)","v":0},{"$f":"ROUND(PAGE1!$Q$92,5)","v":0}]
[{"$f":"$C$1&\".E30A.REM.CONSM.APPR.2250TO2500..\"","v":{"$error":"#N/A"}},{"$f":"ROUND(PAGE1!$G$93,5)","v":0},{"$f":"ROUND(PAGE1!$I$93,5)","v":0}]
[{"$f":"$C$1&\".E30A.REM.CONSM.DISB.2250TO2500..\"","v":{"$error":"#N/A"}},{"$f":"ROUND(PAGE1!$K$93,5)","v":0},{"$f":"ROUND(PAGE1!$M$93,5)","v":0}]
[{"$f":"$C$1&\".E30A.REM.CONSM.OS.2250TO2500..\"","v":{"$error":"#N/A"}},{"$f":"ROUND(PAGE1!$O$93,5)","v":0},{"$f":"ROUND(PAGE1!$Q$93,5)","v":0}]
[{"$f":"$C$1&\".E30A.REM.CONSM.APPR.2500TO2750..\"","v":{"$error":"#N/A"}},{"$f":"ROUND(PAGE1!$G$94,5)","v":0},{"$f":"ROUND(PAGE1!$I$94,5)","v":0}]
[{"$f":"$C$1&\".E30A.REM.CONSM.DISB.2500TO2750..\"","v":{"$error":"#N/A"}},{"$f":"ROUND(PAGE1!$K$94,5)","v":0},{"$f":"ROUND(PAGE1!$M$94,5)","v":0}]
[{"$f":"$C$1&\".E30A.REM.CONSM.OS.2500TO2750..\"","v":{"$error":"#N/A"}},{"$f":"ROUND(PAGE1!$O$94,5)","v":0},{"$f":"ROUND(PAGE1!$Q$94,5)","v":0}]
[{"$f":"$C$1&\".E30A.REM.CONSM.APPR.2750TO3000..\"","v":{"$error":"#N/A"}},{"$f":"ROUND(PAGE1!$G$95,5)","v":0},{"$f":"ROUND(PAGE1!$I$95,5)","v":0}]
[{"$f":"$C$1&\".E30A.REM.CONSM.DISB.2750TO3000..\"","v":{"$error":"#N/A"}},{"$f":"ROUND(PAGE1!$K$95,5)","v":0},{"$f":"ROUND(PAGE1!$M$95,5)","v":0}]
[{"$f":"$C$1&\".E30A.REM.CONSM.OS.2750TO3000..\"","v":{"$error":"#N/A"}},{"$f":"ROUND(PAGE1!$O$95,5)","v":0},{"$f":"ROUND(PAGE1!$Q$95,5)","v":0}]
[{"$f":"$C$1&\".E30A.REM.CONSM.APPR.OVR3000..\"","v":{"$error":"#N/A"}},{"$f":"ROUND(PAGE1!$G$96,5)","v":0},{"$f":"ROUND(PAGE1!$I$96,5)","v":0}]
[{"$f":"$C$1&\".E30A.REM.CONSM.DISB.OVR3000..\"","v":{"$error":"#N/A"}},{"$f":"ROUND(PAGE1!$K$96,5)","v":0},{"$f":"ROUND(PAGE1!$M$96,5)","v":0}]
[{"$f":"$C$1&\".E30A.REM.CONSM.OS.OVR3000..\"","v":{"$error":"#N/A"}},{"$f":"ROUND(PAGE1!$O$96,5)","v":0},{"$f":"ROUND(PAGE1!$Q$96,5)","v":0}]
[{"$f":"$C$1&\".E30A.REM.CONSM.APPR.TTL..\"","v":{"$error":"#N/A"}},{"$f":"ROUND(PAGE1!$G$84,5)","v":0},{"$f":"ROUND(PAGE1!$I$84,5)","v":0}]
[{"$f":"$C$1&\".E30A.REM.CONSM.DISB.TTL..\"","v":{"$error":"#N/A"}},{"$f":"ROUND(PAGE1!$K$84,5)","v":0},{"$f":"ROUND(PAGE1!$M$84,5)","v":0}]
[{"$f":"$C$1&\".E30A.REM.CONSM.OS.TTL..\"","v":{"$error":"#N/A"}},{"$f":"ROUND(PAGE1!$O$84,5)","v":0},{"$f":"ROUND(PAGE1!$Q$84,5)","v":0}]
[{"$f":"$C$1&\".E30A.REM.APPR.AGG_TTL...\"","v":{"$error":"#N/A"}},{"$f":"ROUND(PAGE1!$G$98,5)","v":0},{"$f":"ROUND(PAGE1!$I$98,5)","v":0}]
[{"$f":"$C$1&\".E30A.REM.DISB.AGG_TTL...\"","v":{"$error":"#N/A"}},{"$f":"ROUND(PAGE1!$K$98,5)","v":0},{"$f":"ROUND(PAGE1!$M$98,5)","v":0}]
[{"$f":"$C$1&\".E30A.REM.OS.AGG_TTL...\"","v":{"$error":"#N/A"}},{"$f":"ROUND(PAGE1!$O$98,5)","v":0},{"$f":"ROUND(PAGE1!$Q$98,5)","v":0}]
["sect2","NUM","VAL"]
[{"$f":"$C$1&\".E30A.REM.PBSEC._INT.0_3_PERCT.APPR.\"","v":{"$error":"#N/A"}},{"$f":"ROUND(PAGE2!$G$21,5)","v":0},{"$f":"ROUND(PAGE2!$I$21,5)","v":0}]
[{"$f":"$C$1&\".E30A.REM.PBSEC._INT.0_3_PERCT.OS.\"","v":{"$error":"#N/A"}},{"$f":"ROUND(PAGE2!$L$21,5)","v":0},{"$f":"ROUND(PAGE2!$N$21,5)","v":0}]
[{"$f":"$C$1&\".E30A.REM.PBSEC._INT.3.1_4_PERCT.APPR.\"","v":{"$error":"#N/A"}},{"$f":"ROUND(PAGE2!$G$22,5)","v":0},{"$f":"ROUND(PAGE2!$I$22,5)","v":0}]
[{"$f":"$C$1&\".E30A.REM.PBSEC._INT.3.1_4_PERCT.OS.\"","v":{"$error":"#N/A"}},{"$f":"ROUND(PAGE2!$L$22,5)","v":0},{"$f":"ROUND(PAGE2!$N$22,5)","v":0}]
[{"$f":"$C$1&\".E30A.REM.PBSEC._INT.4.1_5_PERCT.APPR.\"","v":{"$error":"#N/A"}},{"$f":"ROUND(PAGE2!$G$23,5)","v":0},{"$f":"ROUND(PAGE2!$I$23,5)","v":0}]
[{"$f":"$C$1&\".E30A.REM.PBSEC._INT.4.1_5_PERCT.OS.\"","v":{"$error":"#N/A"}},{"$f":"ROUND(PAGE2!$L$23,5)","v":0},{"$f":"ROUND(PAGE2!$N$23,5)","v":0}]
[{"$f":"$C$1&\".E30A.REM.PBSEC._INT.5.1_6_PERCT.APPR.\"","v":{"$error":"#N/A"}},{"$f":"ROUND(PAGE2!$G$24,5)","v":0},{"$f":"ROUND(PAGE2!$I$24,5)","v":0}]
[{"$f":"$C$1&\".E30A.REM.PBSEC._INT.5.1_6_PERCT.OS.\"","v":{"$error":"#N/A"}},{"$f":"ROUND(PAGE2!$L$24,5)","v":0},{"$f":"ROUND(PAGE2!$N$24,5)","v":0}]
[{"$f":"$C$1&\".E30A.REM.PBSEC._INT.6.1_7_PERCT.APPR.\"","v":{"$error":"#N/A"}},{"$f":"ROUND(PAGE2!$G$25,5)","v":0},{"$f":"ROUND(PAGE2!$I$25,5)","v":0}]
[{"$f":"$C$1&\".E30A.REM.PBSEC._INT.6.1_7_PERCT.OS.\"","v":{"$error":"#N/A"}},{"$f":"ROUND(PAGE2!$L$25,5)","v":0},{"$f":"ROUND(PAGE2!$N$25,5)","v":0}]
[{"$f":"$C$1&\".E30A.REM.PBSEC._INT.7.1_8_PERCT.APPR.\"","v":{"$error":"#N/A"}},{"$f":"ROUND(PAGE2!$G$26,5)","v":0},{"$f":"ROUND(PAGE2!$I$26,5)","v":0}]
[{"$f":"$C$1&\".E30A.REM.PBSEC._INT.7.1_8_PERCT.OS.\"","v":{"$error":"#N/A"}},{"$f":"ROUND(PAGE2!$L$26,5)","v":0},{"$f":"ROUND(PAGE2!$N$26,5)","v":0}]
[{"$f":"$C$1&\".E30A.REM.PBSEC._INT.8.1_9_PERCT.APPR.\"","v":{"$error":"#N/A"}},{"$f":"ROUND(PAGE2!$G$27,5)","v":0},{"$f":"ROUND(PAGE2!$I$27,5)","v":0}]
[{"$f":"$C$1&\".E30A.REM.PBSEC._INT.8.1_9_PERCT.OS.\"","v":{"$error":"#N/A"}},{"$f":"ROUND(PAGE2!$L$27,5)","v":0},{"$f":"ROUND(PAGE2!$N$27,5)","v":0}]
[{"$f":"$C$1&\".E30A.REM.PBSEC._INT.9.1_10_PERCT.APPR.\"","v":{"$error":"#N/A"}},{"$f":"ROUND(PAGE2!$G$28,5)","v":0},{"$f":"ROUND(PAGE2!$I$28,5)","v":0}]
[{"$f":"$C$1&\".E30A.REM.PBSEC._INT.9.1_10_PERCT.OS.\"","v":{"$error":"#N/A"}},{"$f":"ROUND(PAGE2!$L$28,5)","v":0},{"$f":"ROUND(PAGE2!$N$28,5)","v":0}]
[{"$f":"$C$1&\".E30A.REM.PBSEC._INT.10.1_11_PERCT.APPR.\"","v":{"$error":"#N/A"}},{"$f":"ROUND(PAGE2!$G$29,5)","v":0},{"$f":"ROUND(PAGE2!$I$29,5)","v":0}]
[{"$f":"$C$1&\".E30A.REM.PBSEC._INT.10.1_11_PERCT.OS.\"","v":{"$error":"#N/A"}},{"$f":"ROUND(PAGE2!$L$29,5)","v":0},{"$f":"ROUND(PAGE2!$N$29,5)","v":0}]
[{"$f":"$C$1&\".E30A.REM.PBSEC._INT.11.1_12_PERCT.APPR.\"","v":{"$error":"#N/A"}},{"$f":"ROUND(PAGE2!$G$30,5)","v":0},{"$f":"ROUND(PAGE2!$I$30,5)","v":0}]
[{"$f":"$C$1&\".E30A.REM.PBSEC._INT.11.1_12_PERCT.OS.\"","v":{"$error":"#N/A"}},{"$f":"ROUND(PAGE2!$L$30,5)","v":0},{"$f":"ROUND(PAGE2!$N$30,5)","v":0}]
[{"$f":"$C$1&\".E30A.REM.PBSEC._INT.12.1_13_PERCT.APPR.\"","v":{"$error":"#N/A"}},{"$f":"ROUND(PAGE2!$G$31,5)","v":0},{"$f":"ROUND(PAGE2!$I$31,5)","v":0}]
[{"$f":"$C$1&\".E30A.REM.PBSEC._INT.12.1_13_PERCT.OS.\"","v":{"$error":"#N/A"}},{"$f":"ROUND(PAGE2!$L$31,5)","v":0},{"$f":"ROUND(PAGE2!$N$31,5)","v":0}]
[{"$f":"$C$1&\".E30A.REM.PBSEC._INT.13.1_14_PERCT.APPR.\"","v":{"$error":"#N/A"}},{"$f":"ROUND(PAGE2!$G$32,5)","v":0},{"$f":"ROUND(PAGE2!$I$32,5)","v":0}]
[{"$f":"$C$1&\".E30A.REM.PBSEC._INT.13.1_14_PERCT.OS.\"","v":{"$error":"#N/A"}},{"$f":"ROUND(PAGE2!$L$32,5)","v":0},{"$f":"ROUND(PAGE2!$N$32,5)","v":0}]
[{"$f":"$C$1&\".E30A.REM.PBSEC._INT.14.1_15_PERCT.APPR.\"","v":{"$error":"#N/A"}},{"$f":"ROUND(PAGE2!$G$33,5)","v":0},{"$f":"ROUND(PAGE2!$I$33,5)","v":0}]
[{"$f":"$C$1&\".E30A.REM.PBSEC._INT.14.1_15_PERCT.OS.\"","v":{"$error":"#N/A"}},{"$f":"ROUND(PAGE2!$L$33,5)","v":0},{"$f":"ROUND(PAGE2!$N$33,5)","v":0}]
[{"$f":"$C$1&\".E30A.REM.PBSEC._INT.OVR_15_PERCT.APPR.\"","v":{"$error":"#N/A"}},{"$f":"ROUND(PAGE2!$G$34,5)","v":0},{"$f":"ROUND(PAGE2!$I$34,5)","v":0}]
[{"$f":"$C$1&\".E30A.REM.PBSEC._INT.OVR_15_PERCT.OS.\"","v":{"$error":"#N/A"}},{"$f":"ROUND(PAGE2!$L$34,5)","v":0},{"$f":"ROUND(PAGE2!$N$34,5)","v":0}]
[{"$f":"$C$1&\".E30A.REM.PBSEC.APPR.TTL..\"","v":{"$error":"#N/A"}},{"$f":"ROUND(PAGE2!G20,5)","v":0},{"$f":"ROUND(PAGE2!I20,5)","v":0}]
[{"$f":"$C$1&\".E30A.REM.PBSEC.OS.TTL..\"","v":{"$error":"#N/A"}},{"$f":"ROUND(PAGE2!L20,5)","v":0},{"$f":"ROUND(PAGE2!N20,5)","v":0}]
[{"$f":"$C$1&\".E30A.REM.PVFIN._INT.0_3_PERCT.APPR.\"","v":{"$error":"#N/A"}},{"$f":"ROUND(PAGE2!$G$39,5)","v":0},{"$f":"ROUND(PAGE2!$I$39,5)","v":0}]
[{"$f":"$C$1&\".E30A.REM.PVFIN._INT.0_3_PERCT.OS.\"","v":{"$error":"#N/A"}},{"$f":"ROUND(PAGE2!$L$39,5)","v":0},{"$f":"ROUND(PAGE2!$N$39,5)","v":0}]
[{"$f":"$C$1&\".E30A.REM.PVFIN._INT.3.1_4_PERCT.APPR.\"","v":{"$error":"#N/A"}},{"$f":"ROUND(PAGE2!$G$40,5)","v":0},{"$f":"ROUND(PAGE2!$I$40,5)","v":0}]
[{"$f":"$C$1&\".E30A.REM.PVFIN._INT.3.1_4_PERCT.OS.\"","v":{"$error":"#N/A"}},{"$f":"ROUND(PAGE2!$L$40,5)","v":0},{"$f":"ROUND(PAGE2!$N$40,5)","v":0}]
[{"$f":"$C$1&\".E30A.REM.PVFIN._INT.4.1_5_PERCT.APPR.\"","v":{"$error":"#N/A"}},{"$f":"ROUND(PAGE2!$G$41,5)","v":0},{"$f":"ROUND(PAGE2!$I$41,5)","v":0}]
[{"$f":"$C$1&\".E30A.REM.PVFIN._INT.4.1_5_PERCT.OS.\"","v":{"$error":"#N/A"}},{"$f":"ROUND(PAGE2!$L$41,5)","v":0},{"$f":"ROUND(PAGE2!$N$41,5)","v":0}]
[{"$f":"$C$1&\".E30A.REM.PVFIN._INT.5.1_6_PERCT.APPR.\"","v":{"$error":"#N/A"}},{"$f":"ROUND(PAGE2!$G$42,5)","v":0},{"$f":"ROUND(PAGE2!$I$42,5)","v":0}]
[{"$f":"$C$1&\".E30A.REM.PVFIN._INT.5.1_6_PERCT.OS.\"","v":{"$error":"#N/A"}},{"$f":"ROUND(PAGE2!$L$42,5)","v":0},{"$f":"ROUND(PAGE2!$N$42,5)","v":0}]
[{"$f":"$C$1&\".E30A.REM.PVFIN._INT.6.1_7_PERCT.APPR.\"","v":{"$error":"#N/A"}},{"$f":"ROUND(PAGE2!$G$43,5)","v":0},{"$f":"ROUND(PAGE2!$I$43,5)","v":0}]
[{"$f":"$C$1&\".E30A.REM.PVFIN._INT.6.1_7_PERCT.OS.\"","v":{"$error":"#N/A"}},{"$f":"ROUND(PAGE2!$L$43,5)","v":0},{"$f":"ROUND(PAGE2!$N$43,5)","v":0}]
[{"$f":"$C$1&\".E30A.REM.PVFIN._INT.7.1_8_PERCT.APPR.\"","v":{"$error":"#N/A"}},{"$f":"ROUND(PAGE2!$G$44,5)","v":0},{"$f":"ROUND(PAGE2!$I$44,5)","v":0}]
[{"$f":"$C$1&\".E30A.REM.PVFIN._INT.7.1_8_PERCT.OS.\"","v":{"$error":"#N/A"}},{"$f":"ROUND(PAGE2!$L$44,5)","v":0},{"$f":"ROUND(PAGE2!$N$44,5)","v":0}]
[{"$f":"$C$1&\".E30A.REM.PVFIN._INT.8.1_9_PERCT.APPR.\"","v":{"$error":"#N/A"}},{"$f":"ROUND(PAGE2!$G$45,5)","v":0},{"$f":"ROUND(PAGE2!$I$45,5)","v":0}]
[{"$f":"$C$1&\".E30A.REM.PVFIN._INT.8.1_9_PERCT.OS.\"","v":{"$error":"#N/A"}},{"$f":"ROUND(PAGE2!$L$45,5)","v":0},{"$f":"ROUND(PAGE2!$N$45,5)","v":0}]
[{"$f":"$C$1&\".E30A.REM.PVFIN._INT.9.1_10_PERCT.APPR.\"","v":{"$error":"#N/A"}},{"$f":"ROUND(PAGE2!$G$46,5)","v":0},{"$f":"ROUND(PAGE2!$I$46,5)","v":0}]
[{"$f":"$C$1&\".E30A.REM.PVFIN._INT.9.1_10_PERCT.OS.\"","v":{"$error":"#N/A"}},{"$f":"ROUND(PAGE2!$L$46,5)","v":0},{"$f":"ROUND(PAGE2!$N$46,5)","v":0}]
[{"$f":"$C$1&\".E30A.REM.PVFIN._INT.10.1_11_PERCT.APPR.\"","v":{"$error":"#N/A"}},{"$f":"ROUND(PAGE2!$G$47,5)","v":0},{"$f":"ROUND(PAGE2!$I$47,5)","v":0}]
[{"$f":"$C$1&\".E30A.REM.PVFIN._INT.10.1_11_PERCT.OS.\"","v":{"$error":"#N/A"}},{"$f":"ROUND(PAGE2!$L$47,5)","v":0},{"$f":"ROUND(PAGE2!$N$47,5)","v":0}]
[{"$f":"$C$1&\".E30A.REM.PVFIN._INT.11.1_12_PERCT.APPR.\"","v":{"$error":"#N/A"}},{"$f":"ROUND(PAGE2!$G$48,5)","v":0},{"$f":"ROUND(PAGE2!$I$48,5)","v":0}]
[{"$f":"$C$1&\".E30A.REM.PVFIN._INT.11.1_12_PERCT.OS.\"","v":{"$error":"#N/A"}},{"$f":"ROUND(PAGE2!$L$48,5)","v":0},{"$f":"ROUND(PAGE2!$N$48,5)","v":0}]
[{"$f":"$C$1&\".E30A.REM.PVFIN._INT.12.1_13_PERCT.APPR.\"","v":{"$error":"#N/A"}},{"$f":"ROUND(PAGE2!$G$49,5)","v":0},{"$f":"ROUND(PAGE2!$I$49,5)","v":0}]
[{"$f":"$C$1&\".E30A.REM.PVFIN._INT.12.1_13_PERCT.OS.\"","v":{"$error":"#N/A"}},{"$f":"ROUND(PAGE2!$L$49,5)","v":0},{"$f":"ROUND(PAGE2!$N$49,5)","v":0}]
[{"$f":"$C$1&\".E30A.REM.PVFIN._INT.13.1_14_PERCT.APPR.\"","v":{"$error":"#N/A"}},{"$f":"ROUND(PAGE2!$G$50,5)","v":0},{"$f":"ROUND(PAGE2!$I$50,5)","v":0}]
[{"$f":"$C$1&\".E30A.REM.PVFIN._INT.13.1_14_PERCT.OS.\"","v":{"$error":"#N/A"}},{"$f":"ROUND(PAGE2!$L$50,5)","v":0},{"$f":"ROUND(PAGE2!$N$50,5)","v":0}]
[{"$f":"$C$1&\".E30A.REM.PVFIN._INT.14.1_15_PERCT.APPR.\"","v":{"$error":"#N/A"}},{"$f":"ROUND(PAGE2!$G$51,5)","v":0},{"$f":"ROUND(PAGE2!$I$51,5)","v":0}]
[{"$f":"$C$1&\".E30A.REM.PVFIN._INT.14.1_15_PERCT.OS.\"","v":{"$error":"#N/A"}},{"$f":"ROUND(PAGE2!$L$51,5)","v":0},{"$f":"ROUND(PAGE2!$N$51,5)","v":0}]
[{"$f":"$C$1&\".E30A.REM.PVFIN._INT.OVR_15_PERCT.APPR.\"","v":{"$error":"#N/A"}},{"$f":"ROUND(PAGE2!$G$52,5)","v":0},{"$f":"ROUND(PAGE2!$I$52,5)","v":0}]
[{"$f":"$C$1&\".E30A.REM.PVFIN._INT.OVR_15_PERCT.OS.\"","v":{"$error":"#N/A"}},{"$f":"ROUND(PAGE2!$L$52,5)","v":0},{"$f":"ROUND(PAGE2!$N$52,5)","v":0}]
[{"$f":"$C$1&\".E30A.REM.PVFIN.APPR.TTL..\"","v":{"$error":"#N/A"}},{"$f":"ROUND(PAGE2!G38,5)","v":0},{"$f":"ROUND(PAGE2!I38,5)","v":0}]
[{"$f":"$C$1&\".E30A.REM.PVFIN.OS.TTL..\"","v":{"$error":"#N/A"}},{"$f":"ROUND(PAGE2!L38,5)","v":0},{"$f":"ROUND(PAGE2!N38,5)","v":0}]
[{"$f":"$C$1&\".E30A.REM.IBUS._INT.0_3_PERCT.APPR.\"","v":{"$error":"#N/A"}},{"$f":"ROUND(PAGE2!$G$57,5)","v":0},{"$f":"ROUND(PAGE2!$I$57,5)","v":0}]
[{"$f":"$C$1&\".E30A.REM.IBUS._INT.0_3_PERCT.OS.\"","v":{"$error":"#N/A"}},{"$f":"ROUND(PAGE2!$L$57,5)","v":0},{"$f":"ROUND(PAGE2!$N$57,5)","v":0}]
[{"$f":"$C$1&\".E30A.REM.IBUS._INT.3.1_4_PERCT.APPR.\"","v":{"$error":"#N/A"}},{"$f":"ROUND(PAGE2!$G$58,5)","v":0},{"$f":"ROUND(PAGE2!$I$58,5)","v":0}]
[{"$f":"$C$1&\".E30A.REM.IBUS._INT.3.1_4_PERCT.OS.\"","v":{"$error":"#N/A"}},{"$f":"ROUND(PAGE2!$L$58,5)","v":0},{"$f":"ROUND(PAGE2!$N$58,5)","v":0}]
[{"$f":"$C$1&\".E30A.REM.IBUS._INT.4.1_5_PERCT.APPR.\"","v":{"$error":"#N/A"}},{"$f":"ROUND(PAGE2!$G$59,5)","v":0},{"$f":"ROUND(PAGE2!$I$59,5)","v":0}]
[{"$f":"$C$1&\".E30A.REM.IBUS._INT.4.1_5_PERCT.OS.\"","v":{"$error":"#N/A"}},{"$f":"ROUND(PAGE2!$L$59,5)","v":0},{"$f":"ROUND(PAGE2!$N$59,5)","v":0}]
[{"$f":"$C$1&\".E30A.REM.IBUS._INT.5.1_6_PERCT.APPR.\"","v":{"$error":"#N/A"}},{"$f":"ROUND(PAGE2!$G$60,5)","v":0},{"$f":"ROUND(PAGE2!$I$60,5)","v":0}]
[{"$f":"$C$1&\".E30A.REM.IBUS._INT.5.1_6_PERCT.OS.\"","v":{"$error":"#N/A"}},{"$f":"ROUND(PAGE2!$L$60,5)","v":0},{"$f":"ROUND(PAGE2!$N$60,5)","v":0}]
[{"$f":"$C$1&\".E30A.REM.IBUS._INT.6.1_7_PERCT.APPR.\"","v":{"$error":"#N/A"}},{"$f":"ROUND(PAGE2!$G$61,5)","v":0},{"$f":"ROUND(PAGE2!$I$61,5)","v":0}]
[{"$f":"$C$1&\".E30A.REM.IBUS._INT.6.1_7_PERCT.OS.\"","v":{"$error":"#N/A"}},{"$f":"ROUND(PAGE2!$L$61,5)","v":0},{"$f":"ROUND(PAGE2!$N$61,5)","v":0}]
[{"$f":"$C$1&\".E30A.REM.IBUS._INT.7.1_8_PERCT.APPR.\"","v":{"$error":"#N/A"}},{"$f":"ROUND(PAGE2!$G$62,5)","v":0},{"$f":"ROUND(PAGE2!$I$62,5)","v":0}]
[{"$f":"$C$1&\".E30A.REM.IBUS._INT.7.1_8_PERCT.OS.\"","v":{"$error":"#N/A"}},{"$f":"ROUND(PAGE2!$L$62,5)","v":0},{"$f":"ROUND(PAGE2!$N$62,5)","v":0}]
[{"$f":"$C$1&\".E30A.REM.IBUS._INT.8.1_9_PERCT.APPR.\"","v":{"$error":"#N/A"}},{"$f":"ROUND(PAGE2!$G$63,5)","v":0},{"$f":"ROUND(PAGE2!$I$63,5)","v":0}]
[{"$f":"$C$1&\".E30A.REM.IBUS._INT.8.1_9_PERCT.OS.\"","v":{"$error":"#N/A"}},{"$f":"ROUND(PAGE2!$L$63,5)","v":0},{"$f":"ROUND(PAGE2!$N$63,5)","v":0}]
[{"$f":"$C$1&\".E30A.REM.IBUS._INT.9.1_10_PERCT.APPR.\"","v":{"$error":"#N/A"}},{"$f":"ROUND(PAGE2!$G$64,5)","v":0},{"$f":"ROUND(PAGE2!$I$64,5)","v":0}]
[{"$f":"$C$1&\".E30A.REM.IBUS._INT.9.1_10_PERCT.OS.\"","v":{"$error":"#N/A"}},{"$f":"ROUND(PAGE2!$L$64,5)","v":0},{"$f":"ROUND(PAGE2!$N$64,5)","v":0}]
[{"$f":"$C$1&\".E30A.REM.IBUS._INT.10.1_11_PERCT.APPR.\"","v":{"$error":"#N/A"}},{"$f":"ROUND(PAGE2!$G$65,5)","v":0},{"$f":"ROUND(PAGE2!$I$65,5)","v":0}]
[{"$f":"$C$1&\".E30A.REM.IBUS._INT.10.1_11_PERCT.OS.\"","v":{"$error":"#N/A"}},{"$f":"ROUND(PAGE2!$L$65,5)","v":0},{"$f":"ROUND(PAGE2!$N$65,5)","v":0}]
[{"$f":"$C$1&\".E30A.REM.IBUS._INT.11.1_12_PERCT.APPR.\"","v":{"$error":"#N/A"}},{"$f":"ROUND(PAGE2!$G$66,5)","v":0},{"$f":"ROUND(PAGE2!$I$66,5)","v":0}]
[{"$f":"$C$1&\".E30A.REM.IBUS._INT.11.1_12_PERCT.OS.\"","v":{"$error":"#N/A"}},{"$f":"ROUND(PAGE2!$L$66,5)","v":0},{"$f":"ROUND(PAGE2!$N$66,5)","v":0}]
[{"$f":"$C$1&\".E30A.REM.IBUS._INT.12.1_13_PERCT.APPR.\"","v":{"$error":"#N/A"}},{"$f":"ROUND(PAGE2!$G$67,5)","v":0},{"$f":"ROUND(PAGE2!$I$67,5)","v":0}]
[{"$f":"$C$1&\".E30A.REM.IBUS._INT.12.1_13_PERCT.OS.\"","v":{"$error":"#N/A"}},{"$f":"ROUND(PAGE2!$L$67,5)","v":0},{"$f":"ROUND(PAGE2!$N$67,5)","v":0}]
[{"$f":"$C$1&\".E30A.REM.IBUS._INT.13.1_14_PERCT.APPR.\"","v":{"$error":"#N/A"}},{"$f":"ROUND(PAGE2!$G$68,5)","v":0},{"$f":"ROUND(PAGE2!$I$68,5)","v":0}]
[{"$f":"$C$1&\".E30A.REM.IBUS._INT.13.1_14_PERCT.OS.\"","v":{"$error":"#N/A"}},{"$f":"ROUND(PAGE2!$L$68,5)","v":0},{"$f":"ROUND(PAGE2!$N$68,5)","v":0}]
[{"$f":"$C$1&\".E30A.REM.IBUS._INT.14.1_15_PERCT.APPR.\"","v":{"$error":"#N/A"}},{"$f":"ROUND(PAGE2!$G$69,5)","v":0},{"$f":"ROUND(PAGE2!$I$69,5)","v":0}]
[{"$f":"$C$1&\".E30A.REM.IBUS._INT.14.1_15_PERCT.OS.\"","v":{"$error":"#N/A"}},{"$f":"ROUND(PAGE2!$L$69,5)","v":0},{"$f":"ROUND(PAGE2!$N$69,5)","v":0}]
[{"$f":"$C$1&\".E30A.REM.IBUS._INT.OVR_15_PERCT.APPR.\"","v":{"$error":"#N/A"}},{"$f":"ROUND(PAGE2!$G$70,5)","v":0},{"$f":"ROUND(PAGE2!$I$70,5)","v":0}]
[{"$f":"$C$1&\".E30A.REM.IBUS._INT.OVR_15_PERCT.OS.\"","v":{"$error":"#N/A"}},{"$f":"ROUND(PAGE2!$L$70,5)","v":0},{"$f":"ROUND(PAGE2!$N$70,5)","v":0}]
[{"$f":"$C$1&\".E30A.REM.IBUS.APPR.TTL..\"","v":{"$error":"#N/A"}},{"$f":"ROUND(PAGE2!G56,5)","v":0},{"$f":"ROUND(PAGE2!I56,5)","v":0}]
[{"$f":"$C$1&\".E30A.REM.IBUS.OS.TTL..\"","v":{"$error":"#N/A"}},{"$f":"ROUND(PAGE2!L56,5)","v":0},{"$f":"ROUND(PAGE2!N56,5)","v":0}]
[{"$f":"$C$1&\".E30A.REM.UIBUS._INT.0_3_PERCT.APPR.\"","v":{"$error":"#N/A"}},{"$f":"ROUND(PAGE2!$G$75,5)","v":0},{"$f":"ROUND(PAGE2!$I$75,5)","v":0}]
[{"$f":"$C$1&\".E30A.REM.UIBUS._INT.0_3_PERCT.OS.\"","v":{"$error":"#N/A"}},{"$f":"ROUND(PAGE2!$L$75,5)","v":0},{"$f":"ROUND(PAGE2!$N$75,5)","v":0}]
[{"$f":"$C$1&\".E30A.REM.UIBUS._INT.3.1_4_PERCT.APPR.\"","v":{"$error":"#N/A"}},{"$f":"ROUND(PAGE2!$G$76,5)","v":0},{"$f":"ROUND(PAGE2!$I$76,5)","v":0}]
[{"$f":"$C$1&\".E30A.REM.UIBUS._INT.3.1_4_PERCT.OS.\"","v":{"$error":"#N/A"}},{"$f":"ROUND(PAGE2!$L$76,5)","v":0},{"$f":"ROUND(PAGE2!$N$76,5)","v":0}]
[{"$f":"$C$1&\".E30A.REM.UIBUS._INT.4.1_5_PERCT.APPR.\"","v":{"$error":"#N/A"}},{"$f":"ROUND(PAGE2!$G$77,5)","v":0},{"$f":"ROUND(PAGE2!$I$77,5)","v":0}]
[{"$f":"$C$1&\".E30A.REM.UIBUS._INT.4.1_5_PERCT.OS.\"","v":{"$error":"#N/A"}},{"$f":"ROUND(PAGE2!$L$77,5)","v":0},{"$f":"ROUND(PAGE2!$N$77,5)","v":0}]
[{"$f":"$C$1&\".E30A.REM.UIBUS._INT.5.1_6_PERCT.APPR.\"","v":{"$error":"#N/A"}},{"$f":"ROUND(PAGE2!$G$78,5)","v":0},{"$f":"ROUND(PAGE2!$I$78,5)","v":0}]
[{"$f":"$C$1&\".E30A.REM.UIBUS._INT.5.1_6_PERCT.OS.\"","v":{"$error":"#N/A"}},{"$f":"ROUND(PAGE2!$L$78,5)","v":0},{"$f":"ROUND(PAGE2!$N$78,5)","v":0}]
[{"$f":"$C$1&\".E30A.REM.UIBUS._INT.6.1_7_PERCT.APPR.\"","v":{"$error":"#N/A"}},{"$f":"ROUND(PAGE2!$G$79,5)","v":0},{"$f":"ROUND(PAGE2!$I$79,5)","v":0}]
[{"$f":"$C$1&\".E30A.REM.UIBUS._INT.6.1_7_PERCT.OS.\"","v":{"$error":"#N/A"}},{"$f":"ROUND(PAGE2!$L$79,5)","v":0},{"$f":"ROUND(PAGE2!$N$79,5)","v":0}]
[{"$f":"$C$1&\".E30A.REM.UIBUS._INT.7.1_8_PERCT.APPR.\"","v":{"$error":"#N/A"}},{"$f":"ROUND(PAGE2!$G$80,5)","v":0},{"$f":"ROUND(PAGE2!$I$80,5)","v":0}]
[{"$f":"$C$1&\".E30A.REM.UIBUS._INT.7.1_8_PERCT.OS.\"","v":{"$error":"#N/A"}},{"$f":"ROUND(PAGE2!$L$80,5)","v":0},{"$f":"ROUND(PAGE2!$N$80,5)","v":0}]
[{"$f":"$C$1&\".E30A.REM.UIBUS._INT.8.1_9_PERCT.APPR.\"","v":{"$error":"#N/A"}},{"$f":"ROUND(PAGE2!$G$81,5)","v":0},{"$f":"ROUND(PAGE2!$I$81,5)","v":0}]
[{"$f":"$C$1&\".E30A.REM.UIBUS._INT.8.1_9_PERCT.OS.\"","v":{"$error":"#N/A"}},{"$f":"ROUND(PAGE2!$L$81,5)","v":0},{"$f":"ROUND(PAGE2!$N$81,5)","v":0}]
[{"$f":"$C$1&\".E30A.REM.UIBUS._INT.9.1_10_PERCT.APPR.\"","v":{"$error":"#N/A"}},{"$f":"ROUND(PAGE2!$G$82,5)","v":0},{"$f":"ROUND(PAGE2!$I$82,5)","v":0}]
[{"$f":"$C$1&\".E30A.REM.UIBUS._INT.9.1_10_PERCT.OS.\"","v":{"$error":"#N/A"}},{"$f":"ROUND(PAGE2!$L$82,5)","v":0},{"$f":"ROUND(PAGE2!$N$82,5)","v":0}]
[{"$f":"$C$1&\".E30A.REM.UIBUS._INT.10.1_11_PERCT.APPR.\"","v":{"$error":"#N/A"}},{"$f":"ROUND(PAGE2!$G$83,5)","v":0},{"$f":"ROUND(PAGE2!$I$83,5)","v":0}]
[{"$f":"$C$1&\".E30A.REM.UIBUS._INT.10.1_11_PERCT.OS.\"","v":{"$error":"#N/A"}},{"$f":"ROUND(PAGE2!$L$83,5)","v":0},{"$f":"ROUND(PAGE2!$N$83,5)","v":0}]
[{"$f":"$C$1&\".E30A.REM.UIBUS._INT.11.1_12_PERCT.APPR.\"","v":{"$error":"#N/A"}},{"$f":"ROUND(PAGE2!$G$84,5)","v":0},{"$f":"ROUND(PAGE2!$I$84,5)","v":0}]
[{"$f":"$C$1&\".E30A.REM.UIBUS._INT.11.1_12_PERCT.OS.\"","v":{"$error":"#N/A"}},{"$f":"ROUND(PAGE2!$L$84,5)","v":0},{"$f":"ROUND(PAGE2!$N$84,5)","v":0}]
[{"$f":"$C$1&\".E30A.REM.UIBUS._INT.12.1_13_PERCT.APPR.\"","v":{"$error":"#N/A"}},{"$f":"ROUND(PAGE2!$G$85,5)","v":0},{"$f":"ROUND(PAGE2!$I$85,5)","v":0}]
[{"$f":"$C$1&\".E30A.REM.UIBUS._INT.12.1_13_PERCT.OS.\"","v":{"$error":"#N/A"}},{"$f":"ROUND(PAGE2!$L$85,5)","v":0},{"$f":"ROUND(PAGE2!$N$85,5)","v":0}]
[{"$f":"$C$1&\".E30A.REM.UIBUS._INT.13.1_14_PERCT.APPR.\"","v":{"$error":"#N/A"}},{"$f":"ROUND(PAGE2!$G$86,5)","v":0},{"$f":"ROUND(PAGE2!$I$86,5)","v":0}]
[{"$f":"$C$1&\".E30A.REM.UIBUS._INT.13.1_14_PERCT.OS.\"","v":{"$error":"#N/A"}},{"$f":"ROUND(PAGE2!$L$86,5)","v":0},{"$f":"ROUND(PAGE2!$N$86,5)","v":0}]
[{"$f":"$C$1&\".E30A.REM.UIBUS._INT.14.1_15_PERCT.APPR.\"","v":{"$error":"#N/A"}},{"$f":"ROUND(PAGE2!$G$87,5)","v":0},{"$f":"ROUND(PAGE2!$I$87,5)","v":0}]
[{"$f":"$C$1&\".E30A.REM.UIBUS._INT.14.1_15_PERCT.OS.\"","v":{"$error":"#N/A"}},{"$f":"ROUND(PAGE2!$L$87,5)","v":0},{"$f":"ROUND(PAGE2!$N$87,5)","v":0}]
[{"$f":"$C$1&\".E30A.REM.UIBUS._INT.OVR_15_PERCT.APPR.\"","v":{"$error":"#N/A"}},{"$f":"ROUND(PAGE2!$G$88,5)","v":0},{"$f":"ROUND(PAGE2!$I$88,5)","v":0}]
[{"$f":"$C$1&\".E30A.REM.UIBUS._INT.OVR_15_PERCT.OS.\"","v":{"$error":"#N/A"}},{"$f":"ROUND(PAGE2!$L$88,5)","v":0},{"$f":"ROUND(PAGE2!$N$88,5)","v":0}]
[{"$f":"$C$1&\".E30A.REM.UIBUS.APPR.TTL..\"","v":{"$error":"#N/A"}},{"$f":"ROUND(PAGE2!G74,5)","v":0},{"$f":"ROUND(PAGE2!I74,5)","v":0}]
[{"$f":"$C$1&\".E30A.REM.UIBUS.OS.TTL..\"","v":{"$error":"#N/A"}},{"$f":"ROUND(PAGE2!L74,5)","v":0},{"$f":"ROUND(PAGE2!N74,5)","v":0}]
[{"$f":"$C$1&\".E30A.REM.CONSM._INT.0_3_PERCT.APPR.\"","v":{"$error":"#N/A"}},{"$f":"ROUND(PAGE2!$G$92,5)","v":0},{"$f":"ROUND(PAGE2!$I$92,5)","v":0}]
[{"$f":"$C$1&\".E30A.REM.CONSM._INT.0_3_PERCT.OS.\"","v":{"$error":"#N/A"}},{"$f":"ROUND(PAGE2!$L$92,5)","v":0},{"$f":"ROUND(PAGE2!$N$92,5)","v":0}]
[{"$f":"$C$1&\".E30A.REM.CONSM._INT.3.1_4_PERCT.APPR.\"","v":{"$error":"#N/A"}},{"$f":"ROUND(PAGE2!$G$93,5)","v":0},{"$f":"ROUND(PAGE2!$I$93,5)","v":0}]
[{"$f":"$C$1&\".E30A.REM.CONSM._INT.3.1_4_PERCT.OS.\"","v":{"$error":"#N/A"}},{"$f":"ROUND(PAGE2!$L$93,5)","v":0},{"$f":"ROUND(PAGE2!$N$93,5)","v":0}]
[{"$f":"$C$1&\".E30A.REM.CONSM._INT.4.1_5_PERCT.APPR.\"","v":{"$error":"#N/A"}},{"$f":"ROUND(PAGE2!$G$94,5)","v":0},{"$f":"ROUND(PAGE2!$I$94,5)","v":0}]
[{"$f":"$C$1&\".E30A.REM.CONSM._INT.4.1_5_PERCT.OS.\"","v":{"$error":"#N/A"}},{"$f":"ROUND(PAGE2!$L$94,5)","v":0},{"$f":"ROUND(PAGE2!$N$94,5)","v":0}]
[{"$f":"$C$1&\".E30A.REM.CONSM._INT.5.1_6_PERCT.APPR.\"","v":{"$error":"#N/A"}},{"$f":"ROUND(PAGE2!$G$95,5)","v":0},{"$f":"ROUND(PAGE2!$I$95,5)","v":0}]
[{"$f":"$C$1&\".E30A.REM.CONSM._INT.5.1_6_PERCT.OS.\"","v":{"$error":"#N/A"}},{"$f":"ROUND(PAGE2!$L$95,5)","v":0},{"$f":"ROUND(PAGE2!$N$95,5)","v":0}]
[{"$f":"$C$1&\".E30A.REM.CONSM._INT.6.1_7_PERCT.APPR.\"","v":{"$error":"#N/A"}},{"$f":"ROUND(PAGE2!$G$96,5)","v":0},{"$f":"ROUND(PAGE2!$I$96,5)","v":0}]
[{"$f":"$C$1&\".E30A.REM.CONSM._INT.6.1_7_PERCT.OS.\"","v":{"$error":"#N/A"}},{"$f":"ROUND(PAGE2!$L$96,5)","v":0},{"$f":"ROUND(PAGE2!$N$96,5)","v":0}]
[{"$f":"$C$1&\".E30A.REM.CONSM._INT.7.1_8_PERCT.APPR.\"","v":{"$error":"#N/A"}},{"$f":"ROUND(PAGE2!$G$97,5)","v":0},{"$f":"ROUND(PAGE2!$I$97,5)","v":0}]
[{"$f":"$C$1&\".E30A.REM.CONSM._INT.7.1_8_PERCT.OS.\"","v":{"$error":"#N/A"}},{"$f":"ROUND(PAGE2!$L$97,5)","v":0},{"$f":"ROUND(PAGE2!$N$97,5)","v":0}]
[{"$f":"$C$1&\".E30A.REM.CONSM._INT.8.1_9_PERCT.APPR.\"","v":{"$error":"#N/A"}},{"$f":"ROUND(PAGE2!$G$98,5)","v":0},{"$f":"ROUND(PAGE2!$I$98,5)","v":0}]
[{"$f":"$C$1&\".E30A.REM.CONSM._INT.8.1_9_PERCT.OS.\"","v":{"$error":"#N/A"}},{"$f":"ROUND(PAGE2!$L$98,5)","v":0},{"$f":"ROUND(PAGE2!$N$98,5)","v":0}]
[{"$f":"$C$1&\".E30A.REM.CONSM._INT.9.1_10_PERCT.APPR.\"","v":{"$error":"#N/A"}},{"$f":"ROUND(PAGE2!$G$99,5)","v":0},{"$f":"ROUND(PAGE2!$I$99,5)","v":0}]
[{"$f":"$C$1&\".E30A.REM.CONSM._INT.9.1_10_PERCT.OS.\"","v":{"$error":"#N/A"}},{"$f":"ROUND(PAGE2!$L$99,5)","v":0},{"$f":"ROUND(PAGE2!$N$99,5)","v":0}]
[{"$f":"$C$1&\".E30A.REM.CONSM._INT.10.1_11_PERCT.APPR.\"","v":{"$error":"#N/A"}},{"$f":"ROUND(PAGE2!$G$100,5)","v":0},{"$f":"ROUND(PAGE2!$I$100,5)","v":0}]
[{"$f":"$C$1&\".E30A.REM.CONSM._INT.10.1_11_PERCT.OS.\"","v":{"$error":"#N/A"}},{"$f":"ROUND(PAGE2!$L$100,5)","v":0},{"$f":"ROUND(PAGE2!$N$100,5)","v":0}]
[{"$f":"$C$1&\".E30A.REM.CONSM._INT.11.1_12_PERCT.APPR.\"","v":{"$error":"#N/A"}},{"$f":"ROUND(PAGE2!$G$101,5)","v":0},{"$f":"ROUND(PAGE2!$I$101,5)","v":0}]
[{"$f":"$C$1&\".E30A.REM.CONSM._INT.11.1_12_PERCT.OS.\"","v":{"$error":"#N/A"}},{"$f":"ROUND(PAGE2!$L$101,5)","v":0},{"$f":"ROUND(PAGE2!$N$101,5)","v":0}]
[{"$f":"$C$1&\".E30A.REM.CONSM._INT.12.1_13_PERCT.APPR.\"","v":{"$error":"#N/A"}},{"$f":"ROUND(PAGE2!$G$102,5)","v":0},{"$f":"ROUND(PAGE2!$I$102,5)","v":0}]
[{"$f":"$C$1&\".E30A.REM.CONSM._INT.12.1_13_PERCT.OS.\"","v":{"$error":"#N/A"}},{"$f":"ROUND(PAGE2!$L$102,5)","v":0},{"$f":"ROUND(PAGE2!$N$102,5)","v":0}]
[{"$f":"$C$1&\".E30A.REM.CONSM._INT.13.1_14_PERCT.APPR.\"","v":{"$error":"#N/A"}},{"$f":"ROUND(PAGE2!$G$103,5)","v":0},{"$f":"ROUND(PAGE2!$I$103,5)","v":0}]
[{"$f":"$C$1&\".E30A.REM.CONSM._INT.13.1_14_PERCT.OS.\"","v":{"$error":"#N/A"}},{"$f":"ROUND(PAGE2!$L$103,5)","v":0},{"$f":"ROUND(PAGE2!$N$103,5)","v":0}]
[{"$f":"$C$1&\".E30A.REM.CONSM._INT.14.1_15_PERCT.APPR.\"","v":{"$error":"#N/A"}},{"$f":"ROUND(PAGE2!$G$104,5)","v":0},{"$f":"ROUND(PAGE2!$I$104,5)","v":0}]
[{"$f":"$C$1&\".E30A.REM.CONSM._INT.14.1_15_PERCT.OS.\"","v":{"$error":"#N/A"}},{"$f":"ROUND(PAGE2!$L$104,5)","v":0},{"$f":"ROUND(PAGE2!$N$104,5)","v":0}]
[{"$f":"$C$1&\".E30A.REM.CONSM._INT.OVR_15.1_PERCT.APPR.\"","v":{"$error":"#N/A"}},{"$f":"ROUND(PAGE2!$G$105,5)","v":0},{"$f":"ROUND(PAGE2!$I$105,5)","v":0}]
[{"$f":"$C$1&\".E30A.REM.CONSM._INT.OVR_15.1_PERCT.OS.\"","v":{"$error":"#N/A"}},{"$f":"ROUND(PAGE2!$L$105,5)","v":0},{"$f":"ROUND(PAGE2!$N$105,5)","v":0}]
[{"$f":"$C$1&\".E30A.REM.CONSM.APPR.TTL..\"","v":{"$error":"#N/A"}},{"$f":"ROUND(PAGE2!G91,5)","v":0},{"$f":"ROUND(PAGE2!I91,5)","v":0}]
[{"$f":"$C$1&\".E30A.REM.CONSM.OS.TTL..\"","v":{"$error":"#N/A"}},{"$f":"ROUND(PAGE2!L91,5)","v":0},{"$f":"ROUND(PAGE2!N91,5)","v":0}]
[{"$f":"$C$1&\".E30A.REM.APPR.SEC.AGG_TTL..\"","v":{"$error":"#N/A"}},{"$f":"ROUND(PAGE2!$G$107,5)","v":0},{"$f":"ROUND(PAGE2!$I$107,5)","v":0}]
[{"$f":"$C$1&\".E30A.REM.OS.SEC.AGG_TTL..\"","v":{"$error":"#N/A"}},{"$f":"ROUND(PAGE2!$L$107,5)","v":0},{"$f":"ROUND(PAGE2!$N$107,5)","v":0}]
["sect3","NUM","VAL"]
[{"$f":"$C$1&\".E30A.REM.RES._INT.0_3_PERCT.DISB.\"","v":{"$error":"#N/A"}},{"$f":"ROUND(PAGE3!$G$21,5)","v":0},{"$f":"ROUND(PAGE3!$I$21,5)","v":0}]
[{"$f":"$C$1&\".E30A.REM.RES._INT.0_3_PERCT.OS.\"","v":{"$error":"#N/A"}},{"$f":"ROUND(PAGE3!$L$21,5)","v":0},{"$f":"ROUND(PAGE3!$N$21,5)","v":0}]
[{"$f":"$C$1&\".E30A.REM.RES._INT.3.1_4_PERCT.DISB.\"","v":{"$error":"#N/A"}},{"$f":"ROUND(PAGE3!$G$22,5)","v":0},{"$f":"ROUND(PAGE3!$I$22,5)","v":0}]
[{"$f":"$C$1&\".E30A.REM.RES._INT.3.1_4_PERCT.OS.\"","v":{"$error":"#N/A"}},{"$f":"ROUND(PAGE3!$L$22,5)","v":0},{"$f":"ROUND(PAGE3!$N$22,5)","v":0}]
[{"$f":"$C$1&\".E30A.REM.RES._INT.4.1_5_PERCT.DISB.\"","v":{"$error":"#N/A"}},{"$f":"ROUND(PAGE3!$G$23,5)","v":0},{"$f":"ROUND(PAGE3!$I$23,5)","v":0}]
[{"$f":"$C$1&\".E30A.REM.RES._INT.4.1_5_PERCT.OS.\"","v":{"$error":"#N/A"}},{"$f":"ROUND(PAGE3!$L$23,5)","v":0},{"$f":"ROUND(PAGE3!$N$23,5)","v":0}]
[{"$f":"$C$1&\".E30A.REM.RES._INT.5.1_6_PERCT.DISB.\"","v":{"$error":"#N/A"}},{"$f":"ROUND(PAGE3!$G$24,5)","v":0},{"$f":"ROUND(PAGE3!$I$24,5)","v":0}]
[{"$f":"$C$1&\".E30A.REM.RES._INT.5.1_6_PERCT.OS.\"","v":{"$error":"#N/A"}},{"$f":"ROUND(PAGE3!$L$24,5)","v":0},{"$f":"ROUND(PAGE3!$N$24,5)","v":0}]
[{"$f":"$C$1&\".E30A.REM.RES._INT.6.1_7_PERCT.DISB.\"","v":{"$error":"#N/A"}},{"$f":"ROUND(PAGE3!$G$25,5)","v":0},{"$f":"ROUND(PAGE3!$I$25,5)","v":0}]
[{"$f":"$C$1&\".E30A.REM.RES._INT.6.1_7_PERCT.OS.\"","v":{"$error":"#N/A"}},{"$f":"ROUND(PAGE3!$L$25,5)","v":0},{"$f":"ROUND(PAGE3!$N$25,5)","v":0}]
[{"$f":"$C$1&\".E30A.REM.RES._INT.7.1_8_PERCT.DISB.\"","v":{"$error":"#N/A"}},{"$f":"ROUND(PAGE3!$G$26,5)","v":0},{"$f":"ROUND(PAGE3!$I$26,5)","v":0}]
[{"$f":"$C$1&\".E30A.REM.RES._INT.7.1_8_PERCT.OS.\"","v":{"$error":"#N/A"}},{"$f":"ROUND(PAGE3!$L$26,5)","v":0},{"$f":"ROUND(PAGE3!$N$26,5)","v":0}]
[{"$f":"$C$1&\".E30A.REM.RES._INT.8.1_9_PERCT.DISB.\"","v":{"$error":"#N/A"}},{"$f":"ROUND(PAGE3!$G$27,5)","v":0},{"$f":"ROUND(PAGE3!$I$27,5)","v":0}]
[{"$f":"$C$1&\".E30A.REM.RES._INT.8.1_9_PERCT.OS.\"","v":{"$error":"#N/A"}},{"$f":"ROUND(PAGE3!$L$27,5)","v":0},{"$f":"ROUND(PAGE3!$N$27,5)","v":0}]
[{"$f":"$C$1&\".E30A.REM.RES._INT.9.1_10_PERCT.DISB.\"","v":{"$error":"#N/A"}},{"$f":"ROUND(PAGE3!$G$28,5)","v":0},{"$f":"ROUND(PAGE3!$I$28,5)","v":0}]
[{"$f":"$C$1&\".E30A.REM.RES._INT.9.1_10_PERCT.OS.\"","v":{"$error":"#N/A"}},{"$f":"ROUND(PAGE3!$L$28,5)","v":0},{"$f":"ROUND(PAGE3!$N$28,5)","v":0}]
[{"$f":"$C$1&\".E30A.REM.RES._INT.10.1_11_PERCT.DISB.\"","v":{"$error":"#N/A"}},{"$f":"ROUND(PAGE3!$G$29,5)","v":0},{"$f":"ROUND(PAGE3!$I$29,5)","v":0}]
[{"$f":"$C$1&\".E30A.REM.RES._INT.10.1_11_PERCT.OS.\"","v":{"$error":"#N/A"}},{"$f":"ROUND(PAGE3!$L$29,5)","v":0},{"$f":"ROUND(PAGE3!$N$29,5)","v":0}]
[{"$f":"$C$1&\".E30A.REM.RES._INT.11.1_12_PERCT.DISB.\"","v":{"$error":"#N/A"}},{"$f":"ROUND(PAGE3!$G$30,5)","v":0},{"$f":"ROUND(PAGE3!$I$30,5)","v":0}]
[{"$f":"$C$1&\".E30A.REM.RES._INT.11.1_12_PERCT.OS.\"","v":{"$error":"#N/A"}},{"$f":"ROUND(PAGE3!$L$30,5)","v":0},{"$f":"ROUND(PAGE3!$N$30,5)","v":0}]
[{"$f":"$C$1&\".E30A.REM.RES._INT.12.1_13_PERCT.DISB.\"","v":{"$error":"#N/A"}},{"$f":"ROUND(PAGE3!$G$31,5)","v":0},{"$f":"ROUND(PAGE3!$I$31,5)","v":0}]
[{"$f":"$C$1&\".E30A.REM.RES._INT.12.1_13_PERCT.OS.\"","v":{"$error":"#N/A"}},{"$f":"ROUND(PAGE3!$L$31,5)","v":0},{"$f":"ROUND(PAGE3!$N$31,5)","v":0}]
[{"$f":"$C$1&\".E30A.REM.RES._INT.13.1_14_PERCT.DISB.\"","v":{"$error":"#N/A"}},{"$f":"ROUND(PAGE3!$G$32,5)","v":0},{"$f":"ROUND(PAGE3!$I$32,5)","v":0}]
[{"$f":"$C$1&\".E30A.REM.RES._INT.13.1_14_PERCT.OS.\"","v":{"$error":"#N/A"}},{"$f":"ROUND(PAGE3!$L$32,5)","v":0},{"$f":"ROUND(PAGE3!$N$32,5)","v":0}]
[{"$f":"$C$1&\".E30A.REM.RES._INT.14.1_15_PERCT.DISB.\"","v":{"$error":"#N/A"}},{"$f":"ROUND(PAGE3!$G$33,5)","v":0},{"$f":"ROUND(PAGE3!$I$33,5)","v":0}]
[{"$f":"$C$1&\".E30A.REM.RES._INT.14.1_15_PERCT.OS.\"","v":{"$error":"#N/A"}},{"$f":"ROUND(PAGE3!$L$33,5)","v":0},{"$f":"ROUND(PAGE3!$N$33,5)","v":0}]
[{"$f":"$C$1&\".E30A.REM.RES._INT.OVR_15_PERCT.DISB.\"","v":{"$error":"#N/A"}},{"$f":"ROUND(PAGE3!$G$34,5)","v":0},{"$f":"ROUND(PAGE3!$I$34,5)","v":0}]
[{"$f":"$C$1&\".E30A.REM.RES._INT.OVR_15_PERCT.OS.\"","v":{"$error":"#N/A"}},{"$f":"ROUND(PAGE3!$L$34,5)","v":0},{"$f":"ROUND(PAGE3!$N$34,5)","v":0}]
[{"$f":"$C$1&\".E30A.REM.NRES._INT.0_3_PERCT.DISB.\"","v":{"$error":"#N/A"}},{"$f":"ROUND(PAGE3!$G$40,5)","v":0},{"$f":"ROUND(PAGE3!$I$40,5)","v":0}]
[{"$f":"$C$1&\".E30A.REM.NRES._INT.0_3_PERCT.OS.\"","v":{"$error":"#N/A"}},{"$f":"ROUND(PAGE3!$L$40,5)","v":0},{"$f":"ROUND(PAGE3!$N$40,5)","v":0}]
[{"$f":"$C$1&\".E30A.REM.NRES._INT.3.1_4_PERCT.DISB.\"","v":{"$error":"#N/A"}},{"$f":"ROUND(PAGE3!$G$41,5)","v":0},{"$f":"ROUND(PAGE3!$I$41,5)","v":0}]
[{"$f":"$C$1&\".E30A.REM.NRES._INT.3.1_4_PERCT.OS.\"","v":{"$error":"#N/A"}},{"$f":"ROUND(PAGE3!$L$41,5)","v":0},{"$f":"ROUND(PAGE3!$N$41,5)","v":0}]
[{"$f":"$C$1&\".E30A.REM.NRES._INT.4.1_5_PERCT.DISB.\"","v":{"$error":"#N/A"}},{"$f":"ROUND(PAGE3!$G$42,5)","v":0},{"$f":"ROUND(PAGE3!$I$42,5)","v":0}]
[{"$f":"$C$1&\".E30A.REM.NRES._INT.4.1_5_PERCT.OS.\"","v":{"$error":"#N/A"}},{"$f":"ROUND(PAGE3!$L$42,5)","v":0},{"$f":"ROUND(PAGE3!$N$42,5)","v":0}]
[{"$f":"$C$1&\".E30A.REM.NRES._INT.5.1_6_PERCT.DISB.\"","v":{"$error":"#N/A"}},{"$f":"ROUND(PAGE3!$G$43,5)","v":0},{"$f":"ROUND(PAGE3!$I$43,5)","v":0}]
[{"$f":"$C$1&\".E30A.REM.NRES._INT.5.1_6_PERCT.OS.\"","v":{"$error":"#N/A"}},{"$f":"ROUND(PAGE3!$L$43,5)","v":0},{"$f":"ROUND(PAGE3!$N$43,5)","v":0}]
[{"$f":"$C$1&\".E30A.REM.NRES._INT.6.1_7_PERCT.DISB.\"","v":{"$error":"#N/A"}},{"$f":"ROUND(PAGE3!$G$44,5)","v":0},{"$f":"ROUND(PAGE3!$I$44,5)","v":0}]
[{"$f":"$C$1&\".E30A.REM.NRES._INT.6.1_7_PERCT.OS.\"","v":{"$error":"#N/A"}},{"$f":"ROUND(PAGE3!$L$44,5)","v":0},{"$f":"ROUND(PAGE3!$N$44,5)","v":0}]
[{"$f":"$C$1&\".E30A.REM.NRES._INT.7.1_8_PERCT.DISB.\"","v":{"$error":"#N/A"}},{"$f":"ROUND(PAGE3!$G$45,5)","v":0},{"$f":"ROUND(PAGE3!$I$45,5)","v":0}]
[{"$f":"$C$1&\".E30A.REM.NRES._INT.7.1_8_PERCT.OS.\"","v":{"$error":"#N/A"}},{"$f":"ROUND(PAGE3!$L$45,5)","v":0},{"$f":"ROUND(PAGE3!$N$45,5)","v":0}]
[{"$f":"$C$1&\".E30A.REM.NRES._INT.8.1_9_PERCT.DISB.\"","v":{"$error":"#N/A"}},{"$f":"ROUND(PAGE3!$G$46,5)","v":0},{"$f":"ROUND(PAGE3!$I$46,5)","v":0}]
[{"$f":"$C$1&\".E30A.REM.NRES._INT.8.1_9_PERCT.OS.\"","v":{"$error":"#N/A"}},{"$f":"ROUND(PAGE3!$L$46,5)","v":0},{"$f":"ROUND(PAGE3!$N$46,5)","v":0}]
[{"$f":"$C$1&\".E30A.REM.NRES._INT.9.1_10_PERCT.DISB.\"","v":{"$error":"#N/A"}},{"$f":"ROUND(PAGE3!$G$47,5)","v":0},{"$f":"ROUND(PAGE3!$I$47,5)","v":0}]
[{"$f":"$C$1&\".E30A.REM.NRES._INT.9.1_10_PERCT.OS.\"","v":{"$error":"#N/A"}},{"$f":"ROUND(PAGE3!$L$47,5)","v":0},{"$f":"ROUND(PAGE3!$N$47,5)","v":0}]
[{"$f":"$C$1&\".E30A.REM.NRES._INT.10.1_11_PERCT.DISB.\"","v":{"$error":"#N/A"}},{"$f":"ROUND(PAGE3!$G$48,5)","v":0},{"$f":"ROUND(PAGE3!$I$48,5)","v":0}]
[{"$f":"$C$1&\".E30A.REM.NRES._INT.10.1_11_PERCT.OS.\"","v":{"$error":"#N/A"}},{"$f":"ROUND(PAGE3!$L$48,5)","v":0},{"$f":"ROUND(PAGE3!$N$48,5)","v":0}]
[{"$f":"$C$1&\".E30A.REM.NRES._INT.11.1_12_PERCT.DISB.\"","v":{"$error":"#N/A"}},{"$f":"ROUND(PAGE3!$G$49,5)","v":0},{"$f":"ROUND(PAGE3!$I$49,5)","v":0}]
[{"$f":"$C$1&\".E30A.REM.NRES._INT.11.1_12_PERCT.OS.\"","v":{"$error":"#N/A"}},{"$f":"ROUND(PAGE3!$L$49,5)","v":0},{"$f":"ROUND(PAGE3!$N$49,5)","v":0}]
[{"$f":"$C$1&\".E30A.REM.NRES._INT.12.1_13_PERCT.DISB.\"","v":{"$error":"#N/A"}},{"$f":"ROUND(PAGE3!$G$50,5)","v":0},{"$f":"ROUND(PAGE3!$I$50,5)","v":0}]
[{"$f":"$C$1&\".E30A.REM.NRES._INT.12.1_13_PERCT.OS.\"","v":{"$error":"#N/A"}},{"$f":"ROUND(PAGE3!$L$50,5)","v":0},{"$f":"ROUND(PAGE3!$N$50,5)","v":0}]
[{"$f":"$C$1&\".E30A.REM.NRES._INT.13.1_14_PERCT.DISB.\"","v":{"$error":"#N/A"}},{"$f":"ROUND(PAGE3!$G$51,5)","v":0},{"$f":"ROUND(PAGE3!$I$51,5)","v":0}]
[{"$f":"$C$1&\".E30A.REM.NRES._INT.13.1_14_PERCT.OS.\"","v":{"$error":"#N/A"}},{"$f":"ROUND(PAGE3!$L$51,5)","v":0},{"$f":"ROUND(PAGE3!$N$51,5)","v":0}]
[{"$f":"$C$1&\".E30A.REM.NRES._INT.14.1_15_PERCT.DISB.\"","v":{"$error":"#N/A"}},{"$f":"ROUND(PAGE3!$G$52,5)","v":0},{"$f":"ROUND(PAGE3!$I$52,5)","v":0}]
[{"$f":"$C$1&\".E30A.REM.NRES._INT.14.1_15_PERCT.OS.\"","v":{"$error":"#N/A"}},{"$f":"ROUND(PAGE3!$L$52,5)","v":0},{"$f":"ROUND(PAGE3!$N$52,5)","v":0}]
[{"$f":"$C$1&\".E30A.REM.NRES._INT.OVR_15.1_PERCT.DISB.\"","v":{"$error":"#N/A"}},{"$f":"ROUND(PAGE3!$G$53,5)","v":0},{"$f":"ROUND(PAGE3!$I$53,5)","v":0}]
[{"$f":"$C$1&\".E30A.REM.NRES._INT.OVR_15.1_PERCT.OS.\"","v":{"$error":"#N/A"}},{"$f":"ROUND(PAGE3!$L$53,5)","v":0},{"$f":"ROUND(PAGE3!$N$53,5)","v":0}]
[{"$f":"$C$1&\".E30A.REM.RES.DISB.TTL..\"","v":{"$error":"#N/A"}},{"$f":"ROUND(PAGE3!$G$36,5)","v":0},{"$f":"ROUND(PAGE3!$I$36,5)","v":0}]
[{"$f":"$C$1&\".E30A.REM.RES.OS.TTL..\"","v":{"$error":"#N/A"}},{"$f":"ROUND(PAGE3!$L$36,5)","v":0},{"$f":"ROUND(PAGE3!$N$36,5)","v":0}]
[{"$f":"$C$1&\".E30A.REM.NRES.DISB.TTL..\"","v":{"$error":"#N/A"}},{"$f":"ROUND(PAGE3!$G$55,5)","v":0},{"$f":"ROUND(PAGE3!$I$55,5)","v":0}]
[{"$f":"$C$1&\".E30A.REM.NRES.OS.TTL..\"","v":{"$error":"#N/A"}},{"$f":"ROUND(PAGE3!$L$55,5)","v":0},{"$f":"ROUND(PAGE3!$N$55,5)","v":0}]
[{"$f":"$C$1&\".E30A.REM.DISB.PTYPE.AGG_TTL..\"","v":{"$error":"#N/A"}},{"$f":"ROUND(PAGE3!$G$58,5)","v":0},{"$f":"ROUND(PAGE3!$I$58,5)","v":0}]
[{"$f":"$C$1&\".E30A.REM.OS.PTYPE.AGG_TTL..\"","v":{"$error":"#N/A"}},{"$f":"ROUND(PAGE3!$L$58,5)","v":0},{"$f":"ROUND(PAGE3!$N$58,5)","v":0}]
["sect4","NUM","VAL"]
[{"$f":"$C$1&\".E30A.REM.RENOV.APPR...\"","v":{"$error":"#N/A"}},{"$f":"ROUND('PAGE4 '!$G$20,5)","v":0},{"$f":"ROUND('PAGE4 '!$I$20,5)","v":0}]
[{"$f":"$C$1&\".E30A.REM.RENOV.DISB...\"","v":{"$error":"#N/A"}},{"$f":"ROUND('PAGE4 '!$K$20,5)","v":0},{"$f":"ROUND('PAGE4 '!$M$20,5)","v":0}]
[{"$f":"$C$1&\".E30A.REM.RENOV.OS...\"","v":{"$error":"#N/A"}},{"$f":"ROUND('PAGE4 '!$O$20,5)","v":0},{"$f":"ROUND('PAGE4 '!$Q$20,5)","v":0}]
[{"$f":"$C$1&\".E30A.REM.NEW_HOUSE.APPR...\"","v":{"$error":"#N/A"}},{"$f":"ROUND('PAGE4 '!$G$24,5)","v":0},{"$f":"ROUND('PAGE4 '!$I$24,5)","v":0}]
[{"$f":"$C$1&\".E30A.REM.NEW_HOUSE.DISB...\"","v":{"$error":"#N/A"}},{"$f":"ROUND('PAGE4 '!$K$24,5)","v":0},{"$f":"ROUND('PAGE4 '!$M$24,5)","v":0}]
[{"$f":"$C$1&\".E30A.REM.NEW_HOUSE.OS...\"","v":{"$error":"#N/A"}},{"$f":"ROUND('PAGE4 '!$O$24,5)","v":0},{"$f":"ROUND('PAGE4 '!$Q$24,5)","v":0}]
[{"$f":"$C$1&\".E30A.REM.EXIST_HOUSE.APPR...\"","v":{"$error":"#N/A"}},{"$f":"ROUND('PAGE4 '!$G$27,5)","v":0},{"$f":"ROUND('PAGE4 '!$I$27,5)","v":0}]
[{"$f":"$C$1&\".E30A.REM.EXIST_HOUSE.DISB...\"","v":{"$error":"#N/A"}},{"$f":"ROUND('PAGE4 '!$K$27,5)","v":0},{"$f":"ROUND('PAGE4 '!$M$27,5)","v":0}]
[{"$f":"$C$1&\".E30A.REM.EXIST_HOUSE.OS...\"","v":{"$error":"#N/A"}},{"$f":"ROUND('PAGE4 '!$O$27,5)","v":0},{"$f":"ROUND('PAGE4 '!$Q$27,5)","v":0}]
[{"$f":"$C$1&\".E30A.REM.LAND.APPR..\"","v":{"$error":"#N/A"}},{"$f":"ROUND('PAGE4 '!$G$29,5)","v":0},{"$f":"ROUND('PAGE4 '!$I$29,5)","v":0}]
[{"$f":"$C$1&\".E30A.REM.LAND.DISB...\"","v":{"$error":"#N/A"}},{"$f":"ROUND('PAGE4 '!$K$29,5)","v":0},{"$f":"ROUND('PAGE4 '!$M$29,5)","v":0}]
[{"$f":"$C$1&\".E30A.REM.LAND.OS..\"","v":{"$error":"#N/A"}},{"$f":"ROUND('PAGE4 '!$O$29,5)","v":0},{"$f":"ROUND('PAGE4 '!$Q$29,5)","v":0}]
[{"$f":"$C$1&\".E30A.REM.LNS.RESCH...\"","v":{"$error":"#N/A"}},{"$f":"ROUND('PAGE4 '!$O$35,5)","v":0},{"$f":"ROUND('PAGE4 '!$Q$35,5)","v":0}]
[{"$f":"$C$1&\".E30A.REM.APPR.AGG_TTL…\"","v":{"$error":"#N/A"}},{"$f":"ROUND('PAGE4 '!G39,5)","v":0},{"$f":"ROUND('PAGE4 '!I39,5)","v":0}]
[{"$f":"$C$1&\".E30A.REM.DISB.AGG_TTL…\"","v":{"$error":"#N/A"}},{"$f":"ROUND('PAGE4 '!K39,5)","v":0},{"$f":"ROUND('PAGE4 '!M39,5)","v":0}]
[{"$f":"$C$1&\".E30A.REM.OS.AGG_TTL…\"","v":{"$error":"#N/A"}},{"$f":"ROUND('PAGE4 '!O39,5)","v":0},{"$f":"ROUND('PAGE4 '!Q39,5)","v":0}]
["sect5","NUM"]
[{"$f":"$C$1&\".E30A.REM.LN_APP.REC.NRES..\"","v":{"$error":"#N/A"}},{"$f":"ROUND('PAGE4 '!$C$47,5)","v":0}]
[{"$f":"$C$1&\".E30A.REM.LN_APP.REC.RES..\"","v":{"$error":"#N/A"}},{"$f":"ROUND('PAGE4 '!$C$45,5)","v":0}]
["sect6","RATE"]
[{"$f":"$C$1&\".E30A.REM.LTV_PERCT.RES.LAND..\"","v":{"$error":"#N/A"}},{"$f":"ROUND('PAGE4 '!$C$53,5)","v":0}]
[{"$f":"$C$1&\".E30A.REM.LTV_PERCT.RES.LAND_HOUSE..\"","v":{"$error":"#N/A"}},{"$f":"ROUND('PAGE4 '!$I$53,5)","v":0}]
[{"$f":"$C$1&\".E30A.REM.LTV_PERCT.NRES.LAND..\"","v":{"$error":"#N/A"}},{"$f":"ROUND('PAGE4 '!$C$55,5)","v":0}]
[{"$f":"$C$1&\".E30A.REM.LTV_PERCT.NRES.LAND_BLDG..\"","v":{"$error":"#N/A"}},{"$f":"ROUND('PAGE4 '!$I$55,5)","v":0}]
[{"$f":"$C$1&\".E30A.REM.LN_DISC.DISTR.FR.RES.\"","v":{"$error":"#N/A"}},{"$f":"ROUND('PAGE4 '!$I$62,5)","v":0}]
[{"$f":"$C$1&\".E30A.REM.LN_DISC.DISTR.VR.RES.\"","v":{"$error":"#N/A"}},{"$f":"ROUND('PAGE4 '!$I$64,5)","v":0}]
[{"$f":"$C$1&\".E30A.REM.LN_DISC.DISTR.AR.RES.\"","v":{"$error":"#N/A"}},{"$f":"ROUND('PAGE4 '!$I$66,5)","v":0}]
["sect7","NUM","VAL"]
[{"$f":"$C$1&\".E30A.REM.FR.PBSEC.DISB._INT.0_3_PERCT.\"","v":{"$error":"#N/A"}},{"$f":"ROUND(PAGE5!$C$20,5)","v":0},{"$f":"ROUND(PAGE5!$E$20,5)","v":0}]
[{"$f":"$C$1&\".E30A.REM.VAR.PBSEC.DISB._INT.0_3_PERCT.\"","v":{"$error":"#N/A"}},{"$f":"ROUND(PAGE5!$G$20,5)","v":0},{"$f":"ROUND(PAGE5!$I$20,5)","v":0}]
[{"$f":"$C$1&\".E30A.REM.ADJ.PBSEC.DISB._INT.0_3_PERCT.\"","v":{"$error":"#N/A"}},{"$f":"ROUND(PAGE5!$K$20,5)","v":0},{"$f":"ROUND(PAGE5!$M$20,5)","v":0}]
[{"$f":"$C$1&\".E30A.REM.PBSEC.DISB._INT.0_3_PERCT.TTL.\"","v":{"$error":"#N/A"}},{"$f":"ROUND(PAGE5!$P$20,5)","v":0},{"$f":"ROUND(PAGE5!$R$20,5)","v":0}]
[{"$f":"$C$1&\".E30A.REM.FR.PBSEC.DISB._INT.3.1_4_PERCT.\"","v":{"$error":"#N/A"}},{"$f":"ROUND(PAGE5!$C$21,5)","v":0},{"$f":"ROUND(PAGE5!$E$21,5)","v":0}]
[{"$f":"$C$1&\".E30A.REM.VAR.PBSEC.DISB._INT.3.1_4_PERCT.\"","v":{"$error":"#N/A"}},{"$f":"ROUND(PAGE5!$G$21,5)","v":0},{"$f":"ROUND(PAGE5!$I$21,5)","v":0}]
[{"$f":"$C$1&\".E30A.REM.ADJ.PBSEC.DISB._INT.3.1_4_PERCT.\"","v":{"$error":"#N/A"}},{"$f":"ROUND(PAGE5!$K$21,5)","v":0},{"$f":"ROUND(PAGE5!$M$21,5)","v":0}]
[{"$f":"$C$1&\".E30A.REM.PBSEC.DISB._INT.3.1_4_PERCT.TTL.\"","v":{"$error":"#N/A"}},{"$f":"ROUND(PAGE5!$P$21,5)","v":0},{"$f":"ROUND(PAGE5!$R$21,5)","v":0}]
[{"$f":"$C$1&\".E30A.REM.FR.PBSEC.DISB._INT.4.1_5_PERCT.\"","v":{"$error":"#N/A"}},{"$f":"ROUND(PAGE5!$C$22,5)","v":0},{"$f":"ROUND(PAGE5!$E$22,5)","v":0}]
[{"$f":"$C$1&\".E30A.REM.VAR.PBSEC.DISB._INT.4.1_5_PERCT.\"","v":{"$error":"#N/A"}},{"$f":"ROUND(PAGE5!$G$22,5)","v":0},{"$f":"ROUND(PAGE5!$I$22,5)","v":0}]
[{"$f":"$C$1&\".E30A.REM.ADJ.PBSEC.DISB._INT.4.1_5_PERCT.\"","v":{"$error":"#N/A"}},{"$f":"ROUND(PAGE5!$K$22,5)","v":0},{"$f":"ROUND(PAGE5!$M$22,5)","v":0}]
[{"$f":"$C$1&\".E30A.REM.PBSEC.DISB._INT.4.1_5_PERCT.TTL.\"","v":{"$error":"#N/A"}},{"$f":"ROUND(PAGE5!$P$22,5)","v":0},{"$f":"ROUND(PAGE5!$R$22,5)","v":0}]
[{"$f":"$C$1&\".E30A.REM.FR.PBSEC.DISB._INT.5.1_6_PERCT.\"","v":{"$error":"#N/A"}},{"$f":"ROUND(PAGE5!$C$23,5)","v":0},{"$f":"ROUND(PAGE5!$E$23,5)","v":0}]
[{"$f":"$C$1&\".E30A.REM.VAR.PBSEC.DISB._INT.5.1_6_PERCT.\"","v":{"$error":"#N/A"}},{"$f":"ROUND(PAGE5!$G$23,5)","v":0},{"$f":"ROUND(PAGE5!$I$23,5)","v":0}]
[{"$f":"$C$1&\".E30A.REM.ADJ.PBSEC.DISB._INT.5.1_6_PERCT.\"","v":{"$error":"#N/A"}},{"$f":"ROUND(PAGE5!$K$23,5)","v":0},{"$f":"ROUND(PAGE5!$M$23,5)","v":0}]
[{"$f":"$C$1&\".E30A.REM.PBSEC.DISB._INT.5.1_6_PERCT.TTL.\"","v":{"$error":"#N/A"}},{"$f":"ROUND(PAGE5!$P$23,5)","v":0},{"$f":"ROUND(PAGE5!$R$23,5)","v":0}]
[{"$f":"$C$1&\".E30A.REM.FR.PBSEC.DISB._INT.6.1_7_PERCT.\"","v":{"$error":"#N/A"}},{"$f":"ROUND(PAGE5!$C$24,5)","v":0},{"$f":"ROUND(PAGE5!$E$24,5)","v":0}]
[{"$f":"$C$1&\".E30A.REM.VAR.PBSEC.DISB._INT.6.1_7_PERCT.\"","v":{"$error":"#N/A"}},{"$f":"ROUND(PAGE5!$G$24,5)","v":0},{"$f":"ROUND(PAGE5!$I$24,5)","v":0}]
[{"$f":"$C$1&\".E30A.REM.ADJ.PBSEC.DISB._INT.6.1_7_PERCT.\"","v":{"$error":"#N/A"}},{"$f":"ROUND(PAGE5!$K$24,5)","v":0},{"$f":"ROUND(PAGE5!$M$24,5)","v":0}]
[{"$f":"$C$1&\".E30A.REM.PBSEC.DISB._INT.6.1_7_PERCT.TTL.\"","v":{"$error":"#N/A"}},{"$f":"ROUND(PAGE5!$P$24,5)","v":0},{"$f":"ROUND(PAGE5!$R$24,5)","v":0}]
[{"$f":"$C$1&\".E30A.REM.FR.PBSEC.DISB._INT.7.1_8_PERCT.\"","v":{"$error":"#N/A"}},{"$f":"ROUND(PAGE5!$C$25,5)","v":0},{"$f":"ROUND(PAGE5!$E$25,5)","v":0}]
[{"$f":"$C$1&\".E30A.REM.VAR.PBSEC.DISB._INT.7.1_8_PERCT.\"","v":{"$error":"#N/A"}},{"$f":"ROUND(PAGE5!$G$25,5)","v":0},{"$f":"ROUND(PAGE5!$I$25,5)","v":0}]
[{"$f":"$C$1&\".E30A.REM.ADJ.PBSEC.DISB._INT.7.1_8_PERCT.\"","v":{"$error":"#N/A"}},{"$f":"ROUND(PAGE5!$K$25,5)","v":0},{"$f":"ROUND(PAGE5!$M$25,5)","v":0}]
[{"$f":"$C$1&\".E30A.REM.PBSEC.DISB._INT.7.1_8_PERCT.TTL.\"","v":{"$error":"#N/A"}},{"$f":"ROUND(PAGE5!$P$25,5)","v":0},{"$f":"ROUND(PAGE5!$R$25,5)","v":0}]
[{"$f":"$C$1&\".E30A.REM.FR.PBSEC.DISB._INT.8.1_9_PERCT.\"","v":{"$error":"#N/A"}},{"$f":"ROUND(PAGE5!$C$26,5)","v":0},{"$f":"ROUND(PAGE5!$E$26,5)","v":0}]
[{"$f":"$C$1&\".E30A.REM.VAR.PBSEC.DISB._INT.8.1_9_PERCT.\"","v":{"$error":"#N/A"}},{"$f":"ROUND(PAGE5!$G$26,5)","v":0},{"$f":"ROUND(PAGE5!$I$26,5)","v":0}]
[{"$f":"$C$1&\".E30A.REM.ADJ.PBSEC.DISB._INT.8.1_9_PERCT.\"","v":{"$error":"#N/A"}},{"$f":"ROUND(PAGE5!$K$26,5)","v":0},{"$f":"ROUND(PAGE5!$M$26,5)","v":0}]
[{"$f":"$C$1&\".E30A.REM.PBSEC.DISB._INT.8.1_9_PERCT.TTL.\"","v":{"$error":"#N/A"}},{"$f":"ROUND(PAGE5!$P$26,5)","v":0},{"$f":"ROUND(PAGE5!$R$26,5)","v":0}]
[{"$f":"$C$1&\".E30A.REM.FR.PBSEC.DISB._INT.9.1_10_PERCT.\"","v":{"$error":"#N/A"}},{"$f":"ROUND(PAGE5!$C$27,5)","v":0},{"$f":"ROUND(PAGE5!$E$27,5)","v":0}]
[{"$f":"$C$1&\".E30A.REM.VAR.PBSEC.DISB._INT.9.1_10_PERCT.\"","v":{"$error":"#N/A"}},{"$f":"ROUND(PAGE5!$G$27,5)","v":0},{"$f":"ROUND(PAGE5!$I$27,5)","v":0}]
[{"$f":"$C$1&\".E30A.REM.ADJ.PBSEC.DISB._INT.9.1_10_PERCT.\"","v":{"$error":"#N/A"}},{"$f":"ROUND(PAGE5!$K$27,5)","v":0},{"$f":"ROUND(PAGE5!$M$27,5)","v":0}]
[{"$f":"$C$1&\".E30A.REM.PBSEC.DISB._INT.9.1_10_PERCT.TTL.\"","v":{"$error":"#N/A"}},{"$f":"ROUND(PAGE5!$P$27,5)","v":0},{"$f":"ROUND(PAGE5!$R$27,5)","v":0}]
[{"$f":"$C$1&\".E30A.REM.FR.PBSEC.DISB._INT.10.1_11_PERCT.\"","v":{"$error":"#N/A"}},{"$f":"ROUND(PAGE5!$C$28,5)","v":0},{"$f":"ROUND(PAGE5!$E$28,5)","v":0}]
[{"$f":"$C$1&\".E30A.REM.VAR.PBSEC.DISB._INT.10.1_11_PERCT.\"","v":{"$error":"#N/A"}},{"$f":"ROUND(PAGE5!$G$28,5)","v":0},{"$f":"ROUND(PAGE5!$I$28,5)","v":0}]
[{"$f":"$C$1&\".E30A.REM.ADJ.PBSEC.DISB._INT.10.1_11_PERCT.\"","v":{"$error":"#N/A"}},{"$f":"ROUND(PAGE5!$K$28,5)","v":0},{"$f":"ROUND(PAGE5!$M$28,5)","v":0}]
[{"$f":"$C$1&\".E30A.REM.PBSEC.DISB._INT.10.1_11_PERCT.TTL.\"","v":{"$error":"#N/A"}},{"$f":"ROUND(PAGE5!$P$28,5)","v":0},{"$f":"ROUND(PAGE5!$R$28,5)","v":0}]
[{"$f":"$C$1&\".E30A.REM.FR.PBSEC.DISB._INT.11.1_12_PERCT.\"","v":{"$error":"#N/A"}},{"$f":"ROUND(PAGE5!$C$29,5)","v":0},{"$f":"ROUND(PAGE5!$E$29,5)","v":0}]
[{"$f":"$C$1&\".E30A.REM.VAR.PBSEC.DISB._INT.11.1_12_PERCT.\"","v":{"$error":"#N/A"}},{"$f":"ROUND(PAGE5!$G$29,5)","v":0},{"$f":"ROUND(PAGE5!$I$29,5)","v":0}]
[{"$f":"$C$1&\".E30A.REM.ADJ.PBSEC.DISB._INT.11.1_12_PERCT.\"","v":{"$error":"#N/A"}},{"$f":"ROUND(PAGE5!$K$29,5)","v":0},{"$f":"ROUND(PAGE5!$M$29,5)","v":0}]
[{"$f":"$C$1&\".E30A.REM.PBSEC.DISB._INT.11.1_12_PERCT.TTL.\"","v":{"$error":"#N/A"}},{"$f":"ROUND(PAGE5!$P$29,5)","v":0},{"$f":"ROUND(PAGE5!$R$29,5)","v":0}]
[{"$f":"$C$1&\".E30A.REM.FR.PBSEC.DISB._INT.12.1_13_PERCT.\"","v":{"$error":"#N/A"}},{"$f":"ROUND(PAGE5!$C$30,5)","v":0},{"$f":"ROUND(PAGE5!$E$30,5)","v":0}]
[{"$f":"$C$1&\".E30A.REM.VAR.PBSEC.DISB._INT.12.1_13_PERCT.\"","v":{"$error":"#N/A"}},{"$f":"ROUND(PAGE5!$G$30,5)","v":0},{"$f":"ROUND(PAGE5!$I$30,5)","v":0}]
[{"$f":"$C$1&\".E30A.REM.ADJ.PBSEC.DISB._INT.12.1_13_PERCT.\"","v":{"$error":"#N/A"}},{"$f":"ROUND(PAGE5!$K$30,5)","v":0},{"$f":"ROUND(PAGE5!$M$30,5)","v":0}]
[{"$f":"$C$1&\".E30A.REM.PBSEC.DISB._INT.12.1_13_PERCT.TTL.\"","v":{"$error":"#N/A"}},{"$f":"ROUND(PAGE5!$P$30,5)","v":0},{"$f":"ROUND(PAGE5!$R$30,5)","v":0}]
[{"$f":"$C$1&\".E30A.REM.FR.PBSEC.DISB._INT.13.1_14_PERCT.\"","v":{"$error":"#N/A"}},{"$f":"ROUND(PAGE5!$C$31,5)","v":0},{"$f":"ROUND(PAGE5!$E$31,5)","v":0}]
[{"$f":"$C$1&\".E30A.REM.VAR.PBSEC.DISB._INT.13.1_14_PERCT.\"","v":{"$error":"#N/A"}},{"$f":"ROUND(PAGE5!$G$31,5)","v":0},{"$f":"ROUND(PAGE5!$I$31,5)","v":0}]
[{"$f":"$C$1&\".E30A.REM.ADJ.PBSEC.DISB._INT.13.1_14_PERCT.\"","v":{"$error":"#N/A"}},{"$f":"ROUND(PAGE5!$K$31,5)","v":0},{"$f":"ROUND(PAGE5!$M$31,5)","v":0}]
[{"$f":"$C$1&\".E30A.REM.PBSEC.DISB._INT.13.1_14_PERCT.TTL.\"","v":{"$error":"#N/A"}},{"$f":"ROUND(PAGE5!$P$31,5)","v":0},{"$f":"ROUND(PAGE5!$R$31,5)","v":0}]
[{"$f":"$C$1&\".E30A.REM.FR.PBSEC.DISB._INT.14.1_15_PERCT.\"","v":{"$error":"#N/A"}},{"$f":"ROUND(PAGE5!$C$32,5)","v":0},{"$f":"ROUND(PAGE5!$E$32,5)","v":0}]
[{"$f":"$C$1&\".E30A.REM.VAR.PBSEC.DISB._INT.14.1_15_PERCT.\"","v":{"$error":"#N/A"}},{"$f":"ROUND(PAGE5!$G$32,5)","v":0},{"$f":"ROUND(PAGE5!$I$32,5)","v":0}]
[{"$f":"$C$1&\".E30A.REM.ADJ.PBSEC.DISB._INT.14.1_15_PERCT.\"","v":{"$error":"#N/A"}},{"$f":"ROUND(PAGE5!$K$32,5)","v":0},{"$f":"ROUND(PAGE5!$M$32,5)","v":0}]
[{"$f":"$C$1&\".E30A.REM.PBSEC.DISB._INT.14.1_15_PERCT.TTL.\"","v":{"$error":"#N/A"}},{"$f":"ROUND(PAGE5!$P$32,5)","v":0},{"$f":"ROUND(PAGE5!$R$32,5)","v":0}]
[{"$f":"$C$1&\".E30A.REM.FR.PBSEC.DISB._INT.OVR_15.1_PERCT.\"","v":{"$error":"#N/A"}},{"$f":"ROUND(PAGE5!$C$33,5)","v":0},{"$f":"ROUND(PAGE5!$E$33,5)","v":0}]
[{"$f":"$C$1&\".E30A.REM.VAR.PBSEC.DISB._INT.OVR_15.1_PERCT.\"","v":{"$error":"#N/A"}},{"$f":"ROUND(PAGE5!$G$33,5)","v":0},{"$f":"ROUND(PAGE5!$I$33,5)","v":0}]
[{"$f":"$C$1&\".E30A.REM.ADJ.PBSEC.DISB._INT.OVR_15.1_PERCT.\"","v":{"$error":"#N/A"}},{"$f":"ROUND(PAGE5!$K$33,5)","v":0},{"$f":"ROUND(PAGE5!$M$33,5)","v":0}]
[{"$f":"$C$1&\".E30A.REM.PBSEC.DISB._INT.OVR_15.1_PERCT.TTL.\"","v":{"$error":"#N/A"}},{"$f":"ROUND(PAGE5!$P$33,5)","v":0},{"$f":"ROUND(PAGE5!$R$33,5)","v":0}]
[{"$f":"$C$1&\".E30A.REM.PBSEC.DISB.TTL.\"","v":{"$error":"#N/A"}},{"$f":"ROUND(PAGE5!P35,5)","v":0},{"$f":"ROUND(PAGE5!R35,5)","v":0}]
[{"$f":"$C$1&\".E30A.REM.FR.PVFIN.DISB._INT.0_3_PERCT.\"","v":{"$error":"#N/A"}},{"$f":"ROUND(PAGE5!$C$39,5)","v":0},{"$f":"ROUND(PAGE5!$E$39,5)","v":0}]
[{"$f":"$C$1&\".E30A.REM.VAR.PVFIN.DISB._INT.0_3_PERCT.\"","v":{"$error":"#N/A"}},{"$f":"ROUND(PAGE5!$G$39,5)","v":0},{"$f":"ROUND(PAGE5!$I$39,5)","v":0}]
[{"$f":"$C$1&\".E30A.REM.ADJ.PVFIN.DISB._INT.0_3_PERCT.\"","v":{"$error":"#N/A"}},{"$f":"ROUND(PAGE5!$K$39,5)","v":0},{"$f":"ROUND(PAGE5!$M$39,5)","v":0}]
[{"$f":"$C$1&\".E30A.REM.PVFIN.DISB._INT.0_3_PERCT.TTL.\"","v":{"$error":"#N/A"}},{"$f":"ROUND(PAGE5!$P$39,5)","v":0},{"$f":"ROUND(PAGE5!$R$39,5)","v":0}]
[{"$f":"$C$1&\".E30A.REM.FR.PVFIN.DISB._INT.3.1_4_PERCT.\"","v":{"$error":"#N/A"}},{"$f":"ROUND(PAGE5!$C$40,5)","v":0},{"$f":"ROUND(PAGE5!$E$40,5)","v":0}]
[{"$f":"$C$1&\".E30A.REM.VAR.PVFIN.DISB._INT.3.1_4_PERCT.\"","v":{"$error":"#N/A"}},{"$f":"ROUND(PAGE5!$G$40,5)","v":0},{"$f":"ROUND(PAGE5!$I$40,5)","v":0}]
[{"$f":"$C$1&\".E30A.REM.ADJ.PVFIN.DISB._INT.3.1_4_PERCT.\"","v":{"$error":"#N/A"}},{"$f":"ROUND(PAGE5!$K$40,5)","v":0},{"$f":"ROUND(PAGE5!$M$40,5)","v":0}]
[{"$f":"$C$1&\".E30A.REM.PVFIN.DISB._INT.3.1_4_PERCT.TTL.\"","v":{"$error":"#N/A"}},{"$f":"ROUND(PAGE5!$P$40,5)","v":0},{"$f":"ROUND(PAGE5!$R$40,5)","v":0}]
[{"$f":"$C$1&\".E30A.REM.FR.PVFIN.DISB._INT.4.1_5_PERCT.\"","v":{"$error":"#N/A"}},{"$f":"ROUND(PAGE5!$C$41,5)","v":0},{"$f":"ROUND(PAGE5!$E$41,5)","v":0}]
[{"$f":"$C$1&\".E30A.REM.VAR.PVFIN.DISB._INT.4.1_5_PERCT.\"","v":{"$error":"#N/A"}},{"$f":"ROUND(PAGE5!$G$41,5)","v":0},{"$f":"ROUND(PAGE5!$I$41,5)","v":0}]
[{"$f":"$C$1&\".E30A.REM.ADJ.PVFIN.DISB._INT.4.1_5_PERCT.\"","v":{"$error":"#N/A"}},{"$f":"ROUND(PAGE5!$K$41,5)","v":0},{"$f":"ROUND(PAGE5!$M$41,5)","v":0}]
[{"$f":"$C$1&\".E30A.REM.PVFIN.DISB._INT.4.1_5_PERCT.TTL.\"","v":{"$error":"#N/A"}},{"$f":"ROUND(PAGE5!$P$41,5)","v":0},{"$f":"ROUND(PAGE5!$R$41,5)","v":0}]
[{"$f":"$C$1&\".E30A.REM.FR.PVFIN.DISB._INT.5.1_6_PERCT.\"","v":{"$error":"#N/A"}},{"$f":"ROUND(PAGE5!$C$42,5)","v":0},{"$f":"ROUND(PAGE5!$E$42,5)","v":0}]
[{"$f":"$C$1&\".E30A.REM.VAR.PVFIN.DISB._INT.5.1_6_PERCT.\"","v":{"$error":"#N/A"}},{"$f":"ROUND(PAGE5!$G$42,5)","v":0},{"$f":"ROUND(PAGE5!$I$42,5)","v":0}]
[{"$f":"$C$1&\".E30A.REM.ADJ.PVFIN.DISB._INT.5.1_6_PERCT.\"","v":{"$error":"#N/A"}},{"$f":"ROUND(PAGE5!$K$42,5)","v":0},{"$f":"ROUND(PAGE5!$M$42,5)","v":0}]
[{"$f":"$C$1&\".E30A.REM.PVFIN.DISB._INT.5.1_6_PERCT.TTL.\"","v":{"$error":"#N/A"}},{"$f":"ROUND(PAGE5!$P$42,5)","v":0},{"$f":"ROUND(PAGE5!$R$42,5)","v":0}]
[{"$f":"$C$1&\".E30A.REM.FR.PVFIN.DISB._INT.6.1_7_PERCT.\"","v":{"$error":"#N/A"}},{"$f":"ROUND(PAGE5!$C$43,5)","v":0},{"$f":"ROUND(PAGE5!$E$43,5)","v":0}]
[{"$f":"$C$1&\".E30A.REM.VAR.PVFIN.DISB._INT.6.1_7_PERCT.\"","v":{"$error":"#N/A"}},{"$f":"ROUND(PAGE5!$G$43,5)","v":0},{"$f":"ROUND(PAGE5!$I$43,5)","v":0}]
[{"$f":"$C$1&\".E30A.REM.ADJ.PVFIN.DISB._INT.6.1_7_PERCT.\"","v":{"$error":"#N/A"}},{"$f":"ROUND(PAGE5!$K$43,5)","v":0},{"$f":"ROUND(PAGE5!$M$43,5)","v":0}]
[{"$f":"$C$1&\".E30A.REM.PVFIN.DISB._INT.6.1_7_PERCT.TTL.\"","v":{"$error":"#N/A"}},{"$f":"ROUND(PAGE5!$P$43,5)","v":0},{"$f":"ROUND(PAGE5!$R$43,5)","v":0}]
[{"$f":"$C$1&\".E30A.REM.FR.PVFIN.DISB._INT.7.1_8_PERCT.\"","v":{"$error":"#N/A"}},{"$f":"ROUND(PAGE5!$C$44,5)","v":0},{"$f":"ROUND(PAGE5!$E$44,5)","v":0}]
[{"$f":"$C$1&\".E30A.REM.VAR.PVFIN.DISB._INT.7.1_8_PERCT.\"","v":{"$error":"#N/A"}},{"$f":"ROUND(PAGE5!$G$44,5)","v":0},{"$f":"ROUND(PAGE5!$I$44,5)","v":0}]
[{"$f":"$C$1&\".E30A.REM.ADJ.PVFIN.DISB._INT.7.1_8_PERCT.\"","v":{"$error":"#N/A"}},{"$f":"ROUND(PAGE5!$K$44,5)","v":0},{"$f":"ROUND(PAGE5!$M$44,5)","v":0}]
[{"$f":"$C$1&\".E30A.REM.PVFIN.DISB._INT.7.1_8_PERCT.TTL.\"","v":{"$error":"#N/A"}},{"$f":"ROUND(PAGE5!$P$44,5)","v":0},{"$f":"ROUND(PAGE5!$R$44,5)","v":0}]
[{"$f":"$C$1&\".E30A.REM.FR.PVFIN.DISB._INT.8.1_9_PERCT.\"","v":{"$error":"#N/A"}},{"$f":"ROUND(PAGE5!$C$45,5)","v":0},{"$f":"ROUND(PAGE5!$E$45,5)","v":0}]
[{"$f":"$C$1&\".E30A.REM.VAR.PVFIN.DISB._INT.8.1_9_PERCT.\"","v":{"$error":"#N/A"}},{"$f":"ROUND(PAGE5!$G$45,5)","v":0},{"$f":"ROUND(PAGE5!$I$45,5)","v":0}]
[{"$f":"$C$1&\".E30A.REM.ADJ.PVFIN.DISB._INT.8.1_9_PERCT.\"","v":{"$error":"#N/A"}},{"$f":"ROUND(PAGE5!$K$45,5)","v":0},{"$f":"ROUND(PAGE5!$M$45,5)","v":0}]
[{"$f":"$C$1&\".E30A.REM.PVFIN.DISB._INT.8.1_9_PERCT.TTL.\"","v":{"$error":"#N/A"}},{"$f":"ROUND(PAGE5!$P$45,5)","v":0},{"$f":"ROUND(PAGE5!$R$45,5)","v":0}]
[{"$f":"$C$1&\".E30A.REM.FR.PVFIN.DISB._INT.9.1_10_PERCT.\"","v":{"$error":"#N/A"}},{"$f":"ROUND(PAGE5!$C$46,5)","v":0},{"$f":"ROUND(PAGE5!$E$46,5)","v":0}]
[{"$f":"$C$1&\".E30A.REM.VAR.PVFIN.DISB._INT.9.1_10_PERCT.\"","v":{"$error":"#N/A"}},{"$f":"ROUND(PAGE5!$G$46,5)","v":0},{"$f":"ROUND(PAGE5!$I$46,5)","v":0}]
[{"$f":"$C$1&\".E30A.REM.ADJ.PVFIN.DISB._INT.9.1_10_PERCT.\"","v":{"$error":"#N/A"}},{"$f":"ROUND(PAGE5!$K$46,5)","v":0},{"$f":"ROUND(PAGE5!$M$46,5)","v":0}]
[{"$f":"$C$1&\".E30A.REM.PVFIN.DISB._INT.9.1_10_PERCT.TTL.\"","v":{"$error":"#N/A"}},{"$f":"ROUND(PAGE5!$P$46,5)","v":0},{"$f":"ROUND(PAGE5!$R$46,5)","v":0}]
[{"$f":"$C$1&\".E30A.REM.FR.PVFIN.DISB._INT.10.1_11_PERCT.\"","v":{"$error":"#N/A"}},{"$f":"ROUND(PAGE5!$C$47,5)","v":0},{"$f":"ROUND(PAGE5!$E$47,5)","v":0}]
[{"$f":"$C$1&\".E30A.REM.VAR.PVFIN.DISB._INT.10.1_11_PERCT.\"","v":{"$error":"#N/A"}},{"$f":"ROUND(PAGE5!$G$47,5)","v":0},{"$f":"ROUND(PAGE5!$I$47,5)","v":0}]
[{"$f":"$C$1&\".E30A.REM.ADJ.PVFIN.DISB._INT.10.1_11_PERCT.\"","v":{"$error":"#N/A"}},{"$f":"ROUND(PAGE5!$K$47,5)","v":0},{"$f":"ROUND(PAGE5!$M$47,5)","v":0}]
[{"$f":"$C$1&\".E30A.REM.PVFIN.DISB._INT.10.1_11_PERCT.TTL.\"","v":{"$error":"#N/A"}},{"$f":"ROUND(PAGE5!$P$47,5)","v":0},{"$f":"ROUND(PAGE5!$R$47,5)","v":0}]
[{"$f":"$C$1&\".E30A.REM.FR.PVFIN.DISB._INT.11.1_12_PERCT.\"","v":{"$error":"#N/A"}},{"$f":"ROUND(PAGE5!$C$48,5)","v":0},{"$f":"ROUND(PAGE5!$E$48,5)","v":0}]
[{"$f":"$C$1&\".E30A.REM.VAR.PVFIN.DISB._INT.11.1_12_PERCT.\"","v":{"$error":"#N/A"}},{"$f":"ROUND(PAGE5!$G$48,5)","v":0},{"$f":"ROUND(PAGE5!$I$48,5)","v":0}]
[{"$f":"$C$1&\".E30A.REM.ADJ.PVFIN.DISB._INT.11.1_12_PERCT.\"","v":{"$error":"#N/A"}},{"$f":"ROUND(PAGE5!$K$48,5)","v":0},{"$f":"ROUND(PAGE5!$M$48,5)","v":0}]
[{"$f":"$C$1&\".E30A.REM.PVFIN.DISB._INT.11.1_12_PERCT.TTL.\"","v":{"$error":"#N/A"}},{"$f":"ROUND(PAGE5!$P$48,5)","v":0},{"$f":"ROUND(PAGE5!$R$48,5)","v":0}]
[{"$f":"$C$1&\".E30A.REM.FR.PVFIN.DISB._INT.12.1_13_PERCT.\"","v":{"$error":"#N/A"}},{"$f":"ROUND(PAGE5!$C$49,5)","v":0},{"$f":"ROUND(PAGE5!$E$49,5)","v":0}]
[{"$f":"$C$1&\".E30A.REM.VAR.PVFIN.DISB._INT.12.1_13_PERCT.\"","v":{"$error":"#N/A"}},{"$f":"ROUND(PAGE5!$G$49,5)","v":0},{"$f":"ROUND(PAGE5!$I$49,5)","v":0}]
[{"$f":"$C$1&\".E30A.REM.ADJ.PVFIN.DISB._INT.12.1_13_PERCT.\"","v":{"$error":"#N/A"}},{"$f":"ROUND(PAGE5!$K$49,5)","v":0},{"$f":"ROUND(PAGE5!$M$49,5)","v":0}]
[{"$f":"$C$1&\".E30A.REM.PVFIN.DISB._INT.12.1_13_PERCT.TTL.\"","v":{"$error":"#N/A"}},{"$f":"ROUND(PAGE5!$P$49,5)","v":0},{"$f":"ROUND(PAGE5!$R$49,5)","v":0}]
[{"$f":"$C$1&\".E30A.REM.FR.PVFIN.DISB._INT.13.1_14_PERCT.\"","v":{"$error":"#N/A"}},{"$f":"ROUND(PAGE5!$C$50,5)","v":0},{"$f":"ROUND(PAGE5!$E$50,5)","v":0}]
[{"$f":"$C$1&\".E30A.REM.VAR.PVFIN.DISB._INT.13.1_14_PERCT.\"","v":{"$error":"#N/A"}},{"$f":"ROUND(PAGE5!$G$50,5)","v":0},{"$f":"ROUND(PAGE5!$I$50,5)","v":0}]
[{"$f":"$C$1&\".E30A.REM.ADJ.PVFIN.DISB._INT.13.1_14_PERCT.\"","v":{"$error":"#N/A"}},{"$f":"ROUND(PAGE5!$K$50,5)","v":0},{"$f":"ROUND(PAGE5!$M$50,5)","v":0}]
[{"$f":"$C$1&\".E30A.REM.PVFIN.DISB._INT.13.1_14_PERCT.TTL.\"","v":{"$error":"#N/A"}},{"$f":"ROUND(PAGE5!$P$50,5)","v":0},{"$f":"ROUND(PAGE5!$R$50,5)","v":0}]
[{"$f":"$C$1&\".E30A.REM.FR.PVFIN.DISB._INT.14.1_15_PERCT.\"","v":{"$error":"#N/A"}},{"$f":"ROUND(PAGE5!$C$51,5)","v":0},{"$f":"ROUND(PAGE5!$E$51,5)","v":0}]
[{"$f":"$C$1&\".E30A.REM.VAR.PVFIN.DISB._INT.14.1_15_PERCT.\"","v":{"$error":"#N/A"}},{"$f":"ROUND(PAGE5!$G$51,5)","v":0},{"$f":"ROUND(PAGE5!$I$51,5)","v":0}]
[{"$f":"$C$1&\".E30A.REM.ADJ.PVFIN.DISB._INT.14.1_15_PERCT.\"","v":{"$error":"#N/A"}},{"$f":"ROUND(PAGE5!$K$51,5)","v":0},{"$f":"ROUND(PAGE5!$M$51,5)","v":0}]
[{"$f":"$C$1&\".E30A.REM.PVFIN.DISB._INT.14.1_15_PERCT.TTL.\"","v":{"$error":"#N/A"}},{"$f":"ROUND(PAGE5!$P$51,5)","v":0},{"$f":"ROUND(PAGE5!$R$51,5)","v":0}]
[{"$f":"$C$1&\".E30A.REM.FR.PVFIN.DISB._INT.OVR_15.1_PERCT.\"","v":{"$error":"#N/A"}},{"$f":"ROUND(PAGE5!$C$52,5)","v":0},{"$f":"ROUND(PAGE5!$E$52,5)","v":0}]
[{"$f":"$C$1&\".E30A.REM.VAR.PVFIN.DISB._INT.OVR_15.1_PERCT.\"","v":{"$error":"#N/A"}},{"$f":"ROUND(PAGE5!$G$52,5)","v":0},{"$f":"ROUND(PAGE5!$I$52,5)","v":0}]
[{"$f":"$C$1&\".E30A.REM.ADJ.PVFIN.DISB._INT.OVR_15.1_PERCT.\"","v":{"$error":"#N/A"}},{"$f":"ROUND(PAGE5!$K$52,5)","v":0},{"$f":"ROUND(PAGE5!$M$52,5)","v":0}]
[{"$f":"$C$1&\".E30A.REM.PVFIN.DISB._INT.OVR_15.1_PERCT.TTL.\"","v":{"$error":"#N/A"}},{"$f":"ROUND(PAGE5!$P$52,5)","v":0},{"$f":"ROUND(PAGE5!$R$52,5)","v":0}]
[{"$f":"$C$1&\".E30A.REM.PVFIN.DISB.TTL.\"","v":{"$error":"#N/A"}},{"$f":"ROUND(PAGE5!P54,5)","v":0},{"$f":"ROUND(PAGE5!R54,5)","v":0}]
[{"$f":"$C$1&\".E30A.REM.FR.IBUS.DISB._INT.0_3_PERCT.\"","v":{"$error":"#N/A"}},{"$f":"ROUND(PAGE5!$C$58,5)","v":0},{"$f":"ROUND(PAGE5!$E$58,5)","v":0}]
[{"$f":"$C$1&\".E30A.REM.VAR.IBUS.DISB._INT.0_3_PERCT.\"","v":{"$error":"#N/A"}},{"$f":"ROUND(PAGE5!$G$58,5)","v":0},{"$f":"ROUND(PAGE5!$I$58,5)","v":0}]
[{"$f":"$C$1&\".E30A.REM.ADJ.IBUS.DISB._INT.0_3_PERCT.\"","v":{"$error":"#N/A"}},{"$f":"ROUND(PAGE5!$K$58,5)","v":0},{"$f":"ROUND(PAGE5!$M$58,5)","v":0}]
[{"$f":"$C$1&\".E30A.REM.IBUS.DISB._INT.0_3_PERCT.TTL.\"","v":{"$error":"#N/A"}},{"$f":"ROUND(PAGE5!$P$58,5)","v":0},{"$f":"ROUND(PAGE5!$R$58,5)","v":0}]
[{"$f":"$C$1&\".E30A.REM.FR.IBUS.DISB._INT.3.1_4_PERCT.\"","v":{"$error":"#N/A"}},{"$f":"ROUND(PAGE5!$C$59,5)","v":0},{"$f":"ROUND(PAGE5!$E$59,5)","v":0}]
[{"$f":"$C$1&\".E30A.REM.VAR.IBUS.DISB._INT.3.1_4_PERCT.\"","v":{"$error":"#N/A"}},{"$f":"ROUND(PAGE5!$G$59,5)","v":0},{"$f":"ROUND(PAGE5!$I$59,5)","v":0}]
[{"$f":"$C$1&\".E30A.REM.ADJ.IBUS.DISB._INT.3.1_4_PERCT.\"","v":{"$error":"#N/A"}},{"$f":"ROUND(PAGE5!$K$59,5)","v":0},{"$f":"ROUND(PAGE5!$M$59,5)","v":0}]
[{"$f":"$C$1&\".E30A.REM.IBUS.DISB._INT.3.1_4_PERCT.TTL.\"","v":{"$error":"#N/A"}},{"$f":"ROUND(PAGE5!$P$59,5)","v":0},{"$f":"ROUND(PAGE5!$R$59,5)","v":0}]
[{"$f":"$C$1&\".E30A.REM.FR.IBUS.DISB._INT.4.1_5_PERCT.\"","v":{"$error":"#N/A"}},{"$f":"ROUND(PAGE5!$C$60,5)","v":0},{"$f":"ROUND(PAGE5!$E$60,5)","v":0}]
[{"$f":"$C$1&\".E30A.REM.VAR.IBUS.DISB._INT.4.1_5_PERCT.\"","v":{"$error":"#N/A"}},{"$f":"ROUND(PAGE5!$G$60,5)","v":0},{"$f":"ROUND(PAGE5!$I$60,5)","v":0}]
[{"$f":"$C$1&\".E30A.REM.ADJ.IBUS.DISB._INT.4.1_5_PERCT.\"","v":{"$error":"#N/A"}},{"$f":"ROUND(PAGE5!$K$60,5)","v":0},{"$f":"ROUND(PAGE5!$M$60,5)","v":0}]
[{"$f":"$C$1&\".E30A.REM.IBUS.DISB._INT.4.1_5_PERCT.TTL.\"","v":{"$error":"#N/A"}},{"$f":"ROUND(PAGE5!$P$60,5)","v":0},{"$f":"ROUND(PAGE5!$R$60,5)","v":0}]
[{"$f":"$C$1&\".E30A.REM.FR.IBUS.DISB._INT.5.1_6_PERCT.\"","v":{"$error":"#N/A"}},{"$f":"ROUND(PAGE5!$C$61,5)","v":0},{"$f":"ROUND(PAGE5!$E$61,5)","v":0}]
[{"$f":"$C$1&\".E30A.REM.VAR.IBUS.DISB._INT.5.1_6_PERCT.\"","v":{"$error":"#N/A"}},{"$f":"ROUND(PAGE5!$G$61,5)","v":0},{"$f":"ROUND(PAGE5!$I$61,5)","v":0}]
[{"$f":"$C$1&\".E30A.REM.ADJ.IBUS.DISB._INT.5.1_6_PERCT.\"","v":{"$error":"#N/A"}},{"$f":"ROUND(PAGE5!$K$61,5)","v":0},{"$f":"ROUND(PAGE5!$M$61,5)","v":0}]
[{"$f":"$C$1&\".E30A.REM.IBUS.DISB._INT.5.1_6_PERCT.TTL.\"","v":{"$error":"#N/A"}},{"$f":"ROUND(PAGE5!$P$61,5)","v":0},{"$f":"ROUND(PAGE5!$R$61,5)","v":0}]
[{"$f":"$C$1&\".E30A.REM.FR.IBUS.DISB._INT.6.1_7_PERCT.\"","v":{"$error":"#N/A"}},{"$f":"ROUND(PAGE5!$C$62,5)","v":0},{"$f":"ROUND(PAGE5!$E$62,5)","v":0}]
[{"$f":"$C$1&\".E30A.REM.VAR.IBUS.DISB._INT.6.1_7_PERCT.\"","v":{"$error":"#N/A"}},{"$f":"ROUND(PAGE5!$G$62,5)","v":0},{"$f":"ROUND(PAGE5!$I$62,5)","v":0}]
[{"$f":"$C$1&\".E30A.REM.ADJ.IBUS.DISB._INT.6.1_7_PERCT.\"","v":{"$error":"#N/A"}},{"$f":"ROUND(PAGE5!$K$62,5)","v":0},{"$f":"ROUND(PAGE5!$M$62,5)","v":0}]
[{"$f":"$C$1&\".E30A.REM.IBUS.DISB._INT.6.1_7_PERCT.TTL.\"","v":{"$error":"#N/A"}},{"$f":"ROUND(PAGE5!$P$62,5)","v":0},{"$f":"ROUND(PAGE5!$R$62,5)","v":0}]
[{"$f":"$C$1&\".E30A.REM.FR.IBUS.DISB._INT.7.1_8_PERCT.\"","v":{"$error":"#N/A"}},{"$f":"ROUND(PAGE5!$C$63,5)","v":0},{"$f":"ROUND(PAGE5!$E$63,5)","v":0}]
[{"$f":"$C$1&\".E30A.REM.VAR.IBUS.DISB._INT.7.1_8_PERCT.\"","v":{"$error":"#N/A"}},{"$f":"ROUND(PAGE5!$G$63,5)","v":0},{"$f":"ROUND(PAGE5!$I$63,5)","v":0}]
[{"$f":"$C$1&\".E30A.REM.ADJ.IBUS.DISB._INT.7.1_8_PERCT.\"","v":{"$error":"#N/A"}},{"$f":"ROUND(PAGE5!$K$63,5)","v":0},{"$f":"ROUND(PAGE5!$M$63,5)","v":0}]
[{"$f":"$C$1&\".E30A.REM.IBUS.DISB._INT.7.1_8_PERCT.TTL.\"","v":{"$error":"#N/A"}},{"$f":"ROUND(PAGE5!$P$63,5)","v":0},{"$f":"ROUND(PAGE5!$R$63,5)","v":0}]
[{"$f":"$C$1&\".E30A.REM.FR.IBUS.DISB._INT.8.1_9_PERCT.\"","v":{"$error":"#N/A"}},{"$f":"ROUND(PAGE5!$C$64,5)","v":0},{"$f":"ROUND(PAGE5!$E$64,5)","v":0}]
[{"$f":"$C$1&\".E30A.REM.VAR.IBUS.DISB._INT.8.1_9_PERCT.\"","v":{"$error":"#N/A"}},{"$f":"ROUND(PAGE5!$G$64,5)","v":0},{"$f":"ROUND(PAGE5!$I$64,5)","v":0}]
[{"$f":"$C$1&\".E30A.REM.ADJ.IBUS.DISB._INT.8.1_9_PERCT.\"","v":{"$error":"#N/A"}},{"$f":"ROUND(PAGE5!$K$64,5)","v":0},{"$f":"ROUND(PAGE5!$M$64,5)","v":0}]
[{"$f":"$C$1&\".E30A.REM.IBUS.DISB._INT.8.1_9_PERCT.TTL.\"","v":{"$error":"#N/A"}},{"$f":"ROUND(PAGE5!$P$64,5)","v":0},{"$f":"ROUND(PAGE5!$R$64,5)","v":0}]
[{"$f":"$C$1&\".E30A.REM.FR.IBUS.DISB._INT.9.1_10_PERCT.\"","v":{"$error":"#N/A"}},{"$f":"ROUND(PAGE5!$C$65,5)","v":0},{"$f":"ROUND(PAGE5!$E$65,5)","v":0}]
[{"$f":"$C$1&\".E30A.REM.VAR.IBUS.DISB._INT.9.1_10_PERCT.\"","v":{"$error":"#N/A"}},{"$f":"ROUND(PAGE5!$G$65,5)","v":0},{"$f":"ROUND(PAGE5!$I$65,5)","v":0}]
[{"$f":"$C$1&\".E30A.REM.ADJ.IBUS.DISB._INT.9.1_10_PERCT.\"","v":{"$error":"#N/A"}},{"$f":"ROUND(PAGE5!$K$65,5)","v":0},{"$f":"ROUND(PAGE5!$M$65,5)","v":0}]
[{"$f":"$C$1&\".E30A.REM.IBUS.DISB._INT.9.1_10_PERCT.TTL.\"","v":{"$error":"#N/A"}},{"$f":"ROUND(PAGE5!$P$65,5)","v":0},{"$f":"ROUND(PAGE5!$R$65,5)","v":0}]
[{"$f":"$C$1&\".E30A.REM.FR.IBUS.DISB._INT.10.1_11_PERCT.\"","v":{"$error":"#N/A"}},{"$f":"ROUND(PAGE5!$C$66,5)","v":0},{"$f":"ROUND(PAGE5!$E$66,5)","v":0}]
[{"$f":"$C$1&\".E30A.REM.VAR.IBUS.DISB._INT.10.1_11_PERCT.\"","v":{"$error":"#N/A"}},{"$f":"ROUND(PAGE5!$G$66,5)","v":0},{"$f":"ROUND(PAGE5!$I$66,5)","v":0}]
[{"$f":"$C$1&\".E30A.REM.ADJ.IBUS.DISB._INT.10.1_11_PERCT.\"","v":{"$error":"#N/A"}},{"$f":"ROUND(PAGE5!$K$66,5)","v":0},{"$f":"ROUND(PAGE5!$M$66,5)","v":0}]
[{"$f":"$C$1&\".E30A.REM.IBUS.DISB._INT.10.1_11_PERCT.TTL.\"","v":{"$error":"#N/A"}},{"$f":"ROUND(PAGE5!$P$66,5)","v":0},{"$f":"ROUND(PAGE5!$R$66,5)","v":0}]
[{"$f":"$C$1&\".E30A.REM.FR.IBUS.DISB._INT.11.1_12_PERCT.\"","v":{"$error":"#N/A"}},{"$f":"ROUND(PAGE5!$C$67,5)","v":0},{"$f":"ROUND(PAGE5!$E$67,5)","v":0}]
[{"$f":"$C$1&\".E30A.REM.VAR.IBUS.DISB._INT.11.1_12_PERCT.\"","v":{"$error":"#N/A"}},{"$f":"ROUND(PAGE5!$G$67,5)","v":0},{"$f":"ROUND(PAGE5!$I$67,5)","v":0}]
[{"$f":"$C$1&\".E30A.REM.ADJ.IBUS.DISB._INT.11.1_12_PERCT.\"","v":{"$error":"#N/A"}},{"$f":"ROUND(PAGE5!$K$67,5)","v":0},{"$f":"ROUND(PAGE5!$M$67,5)","v":0}]
[{"$f":"$C$1&\".E30A.REM.IBUS.DISB._INT.11.1_12_PERCT.TTL.\"","v":{"$error":"#N/A"}},{"$f":"ROUND(PAGE5!$P$67,5)","v":0},{"$f":"ROUND(PAGE5!$R$67,5)","v":0}]
[{"$f":"$C$1&\".E30A.REM.FR.IBUS.DISB._INT.12.1_13_PERCT.\"","v":{"$error":"#N/A"}},{"$f":"ROUND(PAGE5!$C$68,5)","v":0},{"$f":"ROUND(PAGE5!$E$68,5)","v":0}]
[{"$f":"$C$1&\".E30A.REM.VAR.IBUS.DISB._INT.12.1_13_PERCT.\"","v":{"$error":"#N/A"}},{"$f":"ROUND(PAGE5!$G$68,5)","v":0},{"$f":"ROUND(PAGE5!$I$68,5)","v":0}]
[{"$f":"$C$1&\".E30A.REM.ADJ.IBUS.DISB._INT.12.1_13_PERCT.\"","v":{"$error":"#N/A"}},{"$f":"ROUND(PAGE5!$K$68,5)","v":0},{"$f":"ROUND(PAGE5!$M$68,5)","v":0}]
[{"$f":"$C$1&\".E30A.REM.IBUS.DISB._INT.12.1_13_PERCT.TTL.\"","v":{"$error":"#N/A"}},{"$f":"ROUND(PAGE5!$P$68,5)","v":0},{"$f":"ROUND(PAGE5!$R$68,5)","v":0}]
[{"$f":"$C$1&\".E30A.REM.FR.IBUS.DISB._INT.13.1_14_PERCT.\"","v":{"$error":"#N/A"}},{"$f":"ROUND(PAGE5!$C$69,5)","v":0},{"$f":"ROUND(PAGE5!$E$69,5)","v":0}]
[{"$f":"$C$1&\".E30A.REM.VAR.IBUS.DISB._INT.13.1_14_PERCT.\"","v":{"$error":"#N/A"}},{"$f":"ROUND(PAGE5!$G$69,5)","v":0},{"$f":"ROUND(PAGE5!$I$69,5)","v":0}]
[{"$f":"$C$1&\".E30A.REM.ADJ.IBUS.DISB._INT.13.1_14_PERCT.\"","v":{"$error":"#N/A"}},{"$f":"ROUND(PAGE5!$K$69,5)","v":0},{"$f":"ROUND(PAGE5!$M$69,5)","v":0}]
[{"$f":"$C$1&\".E30A.REM.IBUS.DISB._INT.13.1_14_PERCT.TTL.\"","v":{"$error":"#N/A"}},{"$f":"ROUND(PAGE5!$P$69,5)","v":0},{"$f":"ROUND(PAGE5!$R$69,5)","v":0}]
[{"$f":"$C$1&\".E30A.REM.FR.IBUS.DISB._INT.14.1_15_PERCT.\"","v":{"$error":"#N/A"}},{"$f":"ROUND(PAGE5!$C$70,5)","v":0},{"$f":"ROUND(PAGE5!$E$70,5)","v":0}]
[{"$f":"$C$1&\".E30A.REM.VAR.IBUS.DISB._INT.14.1_15_PERCT.\"","v":{"$error":"#N/A"}},{"$f":"ROUND(PAGE5!$G$70,5)","v":0},{"$f":"ROUND(PAGE5!$I$70,5)","v":0}]
[{"$f":"$C$1&\".E30A.REM.ADJ.IBUS.DISB._INT.14.1_15_PERCT.\"","v":{"$error":"#N/A"}},{"$f":"ROUND(PAGE5!$K$70,5)","v":0},{"$f":"ROUND(PAGE5!$M$70,5)","v":0}]
[{"$f":"$C$1&\".E30A.REM.IBUS.DISB._INT.14.1_15_PERCT.TTL.\"","v":{"$error":"#N/A"}},{"$f":"ROUND(PAGE5!$P$70,5)","v":0},{"$f":"ROUND(PAGE5!$R$70,5)","v":0}]
[{"$f":"$C$1&\".E30A.REM.FR.IBUS.DISB._INT.OVR_15.1_PERCT.\"","v":{"$error":"#N/A"}},{"$f":"ROUND(PAGE5!$C$71,5)","v":0},{"$f":"ROUND(PAGE5!$E$71,5)","v":0}]
[{"$f":"$C$1&\".E30A.REM.VAR.IBUS.DISB._INT.OVR_15.1_PERCT.\"","v":{"$error":"#N/A"}},{"$f":"ROUND(PAGE5!$G$71,5)","v":0},{"$f":"ROUND(PAGE5!$I$71,5)","v":0}]
[{"$f":"$C$1&\".E30A.REM.ADJ.IBUS.DISB._INT.OVR_15.1_PERCT.\"","v":{"$error":"#N/A"}},{"$f":"ROUND(PAGE5!$K$71,5)","v":0},{"$f":"ROUND(PAGE5!$M$71,5)","v":0}]
[{"$f":"$C$1&\".E30A.REM.IBUS.DISB._INT.OVR_15.1_PERCT.TTL.\"","v":{"$error":"#N/A"}},{"$f":"ROUND(PAGE5!$P$71,5)","v":0},{"$f":"ROUND(PAGE5!$R$71,5)","v":0}]
[{"$f":"$C$1&\".E30A.REM.IBUS.DISB.TTL.\"","v":{"$error":"#N/A"}},{"$f":"ROUND(PAGE5!P73,5)","v":0},{"$f":"ROUND(PAGE5!R73,5)","v":0}]
[{"$f":"$C$1&\".E30A.REM.FR.UIBUS.DISB._INT.0_3_PERCT.\"","v":{"$error":"#N/A"}},{"$f":"ROUND(PAGE5!$C$77,5)","v":0},{"$f":"ROUND(PAGE5!$E$77,5)","v":0}]
[{"$f":"$C$1&\".E30A.REM.VAR.UIBUS.DISB._INT.0_3_PERCT.\"","v":{"$error":"#N/A"}},{"$f":"ROUND(PAGE5!$G$77,5)","v":0},{"$f":"ROUND(PAGE5!$I$77,5)","v":0}]
[{"$f":"$C$1&\".E30A.REM.ADJ.UIBUS.DISB._INT.0_3_PERCT.\"","v":{"$error":"#N/A"}},{"$f":"ROUND(PAGE5!$K$77,5)","v":0},{"$f":"ROUND(PAGE5!$M$77,5)","v":0}]
[{"$f":"$C$1&\".E30A.REM.UIBUS.DISB._INT.0_3_PERCT.TTL.\"","v":{"$error":"#N/A"}},{"$f":"ROUND(PAGE5!$P$77,5)","v":0},{"$f":"ROUND(PAGE5!$R$77,5)","v":0}]
[{"$f":"$C$1&\".E30A.REM.FR.UIBUS.DISB._INT.3.1_4_PERCT.\"","v":{"$error":"#N/A"}},{"$f":"ROUND(PAGE5!$C$78,5)","v":0},{"$f":"ROUND(PAGE5!$E$78,5)","v":0}]
[{"$f":"$C$1&\".E30A.REM.VAR.UIBUS.DISB._INT.3.1_4_PERCT.\"","v":{"$error":"#N/A"}},{"$f":"ROUND(PAGE5!$G$78,5)","v":0},{"$f":"ROUND(PAGE5!$I$78,5)","v":0}]
[{"$f":"$C$1&\".E30A.REM.ADJ.UIBUS.DISB._INT.3.1_4_PERCT.\"","v":{"$error":"#N/A"}},{"$f":"ROUND(PAGE5!$K$78,5)","v":0},{"$f":"ROUND(PAGE5!$M$78,5)","v":0}]
[{"$f":"$C$1&\".E30A.REM.UIBUS.DISB._INT.3.1_4_PERCT.TTL.\"","v":{"$error":"#N/A"}},{"$f":"ROUND(PAGE5!$P$78,5)","v":0},{"$f":"ROUND(PAGE5!$R$78,5)","v":0}]
[{"$f":"$C$1&\".E30A.REM.FR.UIBUS.DISB._INT.4.1_5_PERCT.\"","v":{"$error":"#N/A"}},{"$f":"ROUND(PAGE5!$C$79,5)","v":0},{"$f":"ROUND(PAGE5!$E$79,5)","v":0}]
[{"$f":"$C$1&\".E30A.REM.VAR.UIBUS.DISB._INT.4.1_5_PERCT.\"","v":{"$error":"#N/A"}},{"$f":"ROUND(PAGE5!$G$79,5)","v":0},{"$f":"ROUND(PAGE5!$I$79,5)","v":0}]
[{"$f":"$C$1&\".E30A.REM.ADJ.UIBUS.DISB._INT.4.1_5_PERCT.\"","v":{"$error":"#N/A"}},{"$f":"ROUND(PAGE5!$K$79,5)","v":0},{"$f":"ROUND(PAGE5!$M$79,5)","v":0}]
[{"$f":"$C$1&\".E30A.REM.UIBUS.DISB._INT.4.1_5_PERCT.TTL.\"","v":{"$error":"#N/A"}},{"$f":"ROUND(PAGE5!$P$79,5)","v":0},{"$f":"ROUND(PAGE5!$R$79,5)","v":0}]
[{"$f":"$C$1&\".E30A.REM.FR.UIBUS.DISB._INT.5.1_6_PERCT.\"","v":{"$error":"#N/A"}},{"$f":"ROUND(PAGE5!$C$80,5)","v":0},{"$f":"ROUND(PAGE5!$E$80,5)","v":0}]
[{"$f":"$C$1&\".E30A.REM.VAR.UIBUS.DISB._INT.5.1_6_PERCT.\"","v":{"$error":"#N/A"}},{"$f":"ROUND(PAGE5!$G$80,5)","v":0},{"$f":"ROUND(PAGE5!$I$80,5)","v":0}]
[{"$f":"$C$1&\".E30A.REM.ADJ.UIBUS.DISB._INT.5.1_6_PERCT.\"","v":{"$error":"#N/A"}},{"$f":"ROUND(PAGE5!$K$80,5)","v":0},{"$f":"ROUND(PAGE5!$M$80,5)","v":0}]
[{"$f":"$C$1&\".E30A.REM.UIBUS.DISB._INT.5.1_6_PERCT.TTL.\"","v":{"$error":"#N/A"}},{"$f":"ROUND(PAGE5!$P$80,5)","v":0},{"$f":"ROUND(PAGE5!$R$80,5)","v":0}]
[{"$f":"$C$1&\".E30A.REM.FR.UIBUS.DISB._INT.6.1_7_PERCT.\"","v":{"$error":"#N/A"}},{"$f":"ROUND(PAGE5!$C$81,5)","v":0},{"$f":"ROUND(PAGE5!$E$81,5)","v":0}]
[{"$f":"$C$1&\".E30A.REM.VAR.UIBUS.DISB._INT.6.1_7_PERCT.\"","v":{"$error":"#N/A"}},{"$f":"ROUND(PAGE5!$G$81,5)","v":0},{"$f":"ROUND(PAGE5!$I$81,5)","v":0}]
[{"$f":"$C$1&\".E30A.REM.ADJ.UIBUS.DISB._INT.6.1_7_PERCT.\"","v":{"$error":"#N/A"}},{"$f":"ROUND(PAGE5!$K$81,5)","v":0},{"$f":"ROUND(PAGE5!$M$81,5)","v":0}]
[{"$f":"$C$1&\".E30A.REM.UIBUS.DISB._INT.6.1_7_PERCT.TTL.\"","v":{"$error":"#N/A"}},{"$f":"ROUND(PAGE5!$P$81,5)","v":0},{"$f":"ROUND(PAGE5!$R$81,5)","v":0}]
[{"$f":"$C$1&\".E30A.REM.FR.UIBUS.DISB._INT.7.1_8_PERCT.\"","v":{"$error":"#N/A"}},{"$f":"ROUND(PAGE5!$C$82,5)","v":0},{"$f":"ROUND(PAGE5!$E$82,5)","v":0}]
[{"$f":"$C$1&\".E30A.REM.VAR.UIBUS.DISB._INT.7.1_8_PERCT.\"","v":{"$error":"#N/A"}},{"$f":"ROUND(PAGE5!$G$82,5)","v":0},{"$f":"ROUND(PAGE5!$I$82,5)","v":0}]
[{"$f":"$C$1&\".E30A.REM.ADJ.UIBUS.DISB._INT.7.1_8_PERCT.\"","v":{"$error":"#N/A"}},{"$f":"ROUND(PAGE5!$K$82,5)","v":0},{"$f":"ROUND(PAGE5!$M$82,5)","v":0}]
[{"$f":"$C$1&\".E30A.REM.UIBUS.DISB._INT.7.1_8_PERCT.TTL.\"","v":{"$error":"#N/A"}},{"$f":"ROUND(PAGE5!$P$82,5)","v":0},{"$f":"ROUND(PAGE5!$R$82,5)","v":0}]
[{"$f":"$C$1&\".E30A.REM.FR.UIBUS.DISB._INT.8.1_9_PERCT.\"","v":{"$error":"#N/A"}},{"$f":"ROUND(PAGE5!$C$83,5)","v":0},{"$f":"ROUND(PAGE5!$E$83,5)","v":0}]
[{"$f":"$C$1&\".E30A.REM.VAR.UIBUS.DISB._INT.8.1_9_PERCT.\"","v":{"$error":"#N/A"}},{"$f":"ROUND(PAGE5!$G$83,5)","v":0},{"$f":"ROUND(PAGE5!$I$83,5)","v":0}]
[{"$f":"$C$1&\".E30A.REM.ADJ.UIBUS.DISB._INT.8.1_9_PERCT.\"","v":{"$error":"#N/A"}},{"$f":"ROUND(PAGE5!$K$83,5)","v":0},{"$f":"ROUND(PAGE5!$M$83,5)","v":0}]
[{"$f":"$C$1&\".E30A.REM.UIBUS.DISB._INT.8.1_9_PERCT.TTL.\"","v":{"$error":"#N/A"}},{"$f":"ROUND(PAGE5!$P$83,5)","v":0},{"$f":"ROUND(PAGE5!$R$83,5)","v":0}]
[{"$f":"$C$1&\".E30A.REM.FR.UIBUS.DISB._INT.9.1_10_PERCT.\"","v":{"$error":"#N/A"}},{"$f":"ROUND(PAGE5!$C$84,5)","v":0},{"$f":"ROUND(PAGE5!$E$84,5)","v":0}]
[{"$f":"$C$1&\".E30A.REM.VAR.UIBUS.DISB._INT.9.1_10_PERCT.\"","v":{"$error":"#N/A"}},{"$f":"ROUND(PAGE5!$G$84,5)","v":0},{"$f":"ROUND(PAGE5!$I$84,5)","v":0}]
[{"$f":"$C$1&\".E30A.REM.ADJ.UIBUS.DISB._INT.9.1_10_PERCT.\"","v":{"$error":"#N/A"}},{"$f":"ROUND(PAGE5!$K$84,5)","v":0},{"$f":"ROUND(PAGE5!$M$84,5)","v":0}]
[{"$f":"$C$1&\".E30A.REM.UIBUS.DISB._INT.9.1_10_PERCT.TTL.\"","v":{"$error":"#N/A"}},{"$f":"ROUND(PAGE5!$P$84,5)","v":0},{"$f":"ROUND(PAGE5!$R$84,5)","v":0}]
[{"$f":"$C$1&\".E30A.REM.FR.UIBUS.DISB._INT.10.1_11_PERCT.\"","v":{"$error":"#N/A"}},{"$f":"ROUND(PAGE5!$C$85,5)","v":0},{"$f":"ROUND(PAGE5!$E$85,5)","v":0}]
[{"$f":"$C$1&\".E30A.REM.VAR.UIBUS.DISB._INT.10.1_11_PERCT.\"","v":{"$error":"#N/A"}},{"$f":"ROUND(PAGE5!$G$85,5)","v":0},{"$f":"ROUND(PAGE5!$I$85,5)","v":0}]
[{"$f":"$C$1&\".E30A.REM.ADJ.UIBUS.DISB._INT.10.1_11_PERCT.\"","v":{"$error":"#N/A"}},{"$f":"ROUND(PAGE5!$K$85,5)","v":0},{"$f":"ROUND(PAGE5!$M$85,5)","v":0}]
[{"$f":"$C$1&\".E30A.REM.UIBUS.DISB._INT.10.1_11_PERCT.TTL.\"","v":{"$error":"#N/A"}},{"$f":"ROUND(PAGE5!$P$85,5)","v":0},{"$f":"ROUND(PAGE5!$R$85,5)","v":0}]
[{"$f":"$C$1&\".E30A.REM.FR.UIBUS.DISB._INT.11.1_12_PERCT.\"","v":{"$error":"#N/A"}},{"$f":"ROUND(PAGE5!$C$86,5)","v":0},{"$f":"ROUND(PAGE5!$E$86,5)","v":0}]
[{"$f":"$C$1&\".E30A.REM.VAR.UIBUS.DISB._INT.11.1_12_PERCT.\"","v":{"$error":"#N/A"}},{"$f":"ROUND(PAGE5!$G$86,5)","v":0},{"$f":"ROUND(PAGE5!$I$86,5)","v":0}]
[{"$f":"$C$1&\".E30A.REM.ADJ.UIBUS.DISB._INT.11.1_12_PERCT.\"","v":{"$error":"#N/A"}},{"$f":"ROUND(PAGE5!$K$86,5)","v":0},{"$f":"ROUND(PAGE5!$M$86,5)","v":0}]
[{"$f":"$C$1&\".E30A.REM.UIBUS.DISB._INT.11.1_12_PERCT.TTL.\"","v":{"$error":"#N/A"}},{"$f":"ROUND(PAGE5!$P$86,5)","v":0},{"$f":"ROUND(PAGE5!$R$86,5)","v":0}]
[{"$f":"$C$1&\".E30A.REM.FR.UIBUS.DISB._INT.12.1_13_PERCT.\"","v":{"$error":"#N/A"}},{"$f":"ROUND(PAGE5!$C$87,5)","v":0},{"$f":"ROUND(PAGE5!$E$87,5)","v":0}]
[{"$f":"$C$1&\".E30A.REM.VAR.UIBUS.DISB._INT.12.1_13_PERCT.\"","v":{"$error":"#N/A"}},{"$f":"ROUND(PAGE5!$G$87,5)","v":0},{"$f":"ROUND(PAGE5!$I$87,5)","v":0}]
[{"$f":"$C$1&\".E30A.REM.ADJ.UIBUS.DISB._INT.12.1_13_PERCT.\"","v":{"$error":"#N/A"}},{"$f":"ROUND(PAGE5!$K$87,5)","v":0},{"$f":"ROUND(PAGE5!$M$87,5)","v":0}]
[{"$f":"$C$1&\".E30A.REM.UIBUS.DISB._INT.12.1_13_PERCT.TTL.\"","v":{"$error":"#N/A"}},{"$f":"ROUND(PAGE5!$P$87,5)","v":0},{"$f":"ROUND(PAGE5!$R$87,5)","v":0}]
[{"$f":"$C$1&\".E30A.REM.FR.UIBUS.DISB._INT.13.1_14_PERCT.\"","v":{"$error":"#N/A"}},{"$f":"ROUND(PAGE5!$C$88,5)","v":0},{"$f":"ROUND(PAGE5!$E$88,5)","v":0}]
[{"$f":"$C$1&\".E30A.REM.VAR.UIBUS.DISB._INT.13.1_14_PERCT.\"","v":{"$error":"#N/A"}},{"$f":"ROUND(PAGE5!$G$88,5)","v":0},{"$f":"ROUND(PAGE5!$I$88,5)","v":0}]
[{"$f":"$C$1&\".E30A.REM.ADJ.UIBUS.DISB._INT.13.1_14_PERCT.\"","v":{"$error":"#N/A"}},{"$f":"ROUND(PAGE5!$K$88,5)","v":0},{"$f":"ROUND(PAGE5!$M$88,5)","v":0}]
[{"$f":"$C$1&\".E30A.REM.UIBUS.DISB._INT.13.1_14_PERCT.TTL.\"","v":{"$error":"#N/A"}},{"$f":"ROUND(PAGE5!$P$88,5)","v":0},{"$f":"ROUND(PAGE5!$R$88,5)","v":0}]
[{"$f":"$C$1&\".E30A.REM.FR.UIBUS.DISB._INT.14.1_15_PERCT.\"","v":{"$error":"#N/A"}},{"$f":"ROUND(PAGE5!$C$89,5)","v":0},{"$f":"ROUND(PAGE5!$E$89,5)","v":0}]
[{"$f":"$C$1&\".E30A.REM.VAR.UIBUS.DISB._INT.14.1_15_PERCT.\"","v":{"$error":"#N/A"}},{"$f":"ROUND(PAGE5!$G$89,5)","v":0},{"$f":"ROUND(PAGE5!$I$89,5)","v":0}]
[{"$f":"$C$1&\".E30A.REM.ADJ.UIBUS.DISB._INT.14.1_15_PERCT.\"","v":{"$error":"#N/A"}},{"$f":"ROUND(PAGE5!$K$89,5)","v":0},{"$f":"ROUND(PAGE5!$M$89,5)","v":0}]
[{"$f":"$C$1&\".E30A.REM.UIBUS.DISB._INT.14.1_15_PERCT.TTL.\"","v":{"$error":"#N/A"}},{"$f":"ROUND(PAGE5!$P$89,5)","v":0},{"$f":"ROUND(PAGE5!$R$89,5)","v":0}]
[{"$f":"$C$1&\".E30A.REM.FR.UIBUS.DISB._INT.OVR_15.1_PERCT.\"","v":{"$error":"#N/A"}},{"$f":"ROUND(PAGE5!$C$90,5)","v":0},{"$f":"ROUND(PAGE5!$E$90,5)","v":0}]
[{"$f":"$C$1&\".E30A.REM.VAR.UIBUS.DISB._INT.OVR_15.1_PERCT.\"","v":{"$error":"#N/A"}},{"$f":"ROUND(PAGE5!$G$90,5)","v":0},{"$f":"ROUND(PAGE5!$I$90,5)","v":0}]
[{"$f":"$C$1&\".E30A.REM.ADJ.UIBUS.DISB._INT.OVR_15.1_PERCT.\"","v":{"$error":"#N/A"}},{"$f":"ROUND(PAGE5!$K$90,5)","v":0},{"$f":"ROUND(PAGE5!$M$90,5)","v":0}]
[{"$f":"$C$1&\".E30A.REM.UIBUS.DISB._INT.OVR_15.1_PERCT.TTL.\"","v":{"$error":"#N/A"}},{"$f":"ROUND(PAGE5!$P$90,5)","v":0},{"$f":"ROUND(PAGE5!$R$90,5)","v":0}]
[{"$f":"$C$1&\".E30A.REM.UIBUS.DISB.TTL.\"","v":{"$error":"#N/A"}},{"$f":"ROUND(PAGE5!P92,5)","v":0},{"$f":"ROUND(PAGE5!R92,5)","v":0}]
[{"$f":"$C$1&\".E30A.REM.FR.CONSM.DISB._INT.0_3_PERCT.\"","v":{"$error":"#N/A"}},{"$f":"ROUND(PAGE5!$C$95,5)","v":0},{"$f":"ROUND(PAGE5!$E$95,5)","v":0}]
[{"$f":"$C$1&\".E30A.REM.VAR.CONSM.DISB._INT.0_3_PERCT.\"","v":{"$error":"#N/A"}},{"$f":"ROUND(PAGE5!$G$95,5)","v":0},{"$f":"ROUND(PAGE5!$I$95,5)","v":0}]
[{"$f":"$C$1&\".E30A.REM.ADJ.CONSM.DISB._INT.0_3_PERCT.\"","v":{"$error":"#N/A"}},{"$f":"ROUND(PAGE5!$K$95,5)","v":0},{"$f":"ROUND(PAGE5!$M$95,5)","v":0}]
[{"$f":"$C$1&\".E30A.REM.CONSM.DISB._INT.0_3_PERCT.TTL.\"","v":{"$error":"#N/A"}},{"$f":"ROUND(PAGE5!$P$95,5)","v":0},{"$f":"ROUND(PAGE5!$R$95,5)","v":0}]
[{"$f":"$C$1&\".E30A.REM.FR.CONSM.DISB._INT.3.1_4_PERCT.\"","v":{"$error":"#N/A"}},{"$f":"ROUND(PAGE5!$C$96,5)","v":0},{"$f":"ROUND(PAGE5!$E$96,5)","v":0}]
[{"$f":"$C$1&\".E30A.REM.VAR.CONSM.DISB._INT.3.1_4_PERCT.\"","v":{"$error":"#N/A"}},{"$f":"ROUND(PAGE5!$G$96,5)","v":0},{"$f":"ROUND(PAGE5!$I$96,5)","v":0}]
[{"$f":"$C$1&\".E30A.REM.ADJ.CONSM.DISB._INT.3.1_4_PERCT.\"","v":{"$error":"#N/A"}},{"$f":"ROUND(PAGE5!$K$96,5)","v":0},{"$f":"ROUND(PAGE5!$M$96,5)","v":0}]
[{"$f":"$C$1&\".E30A.REM.CONSM.DISB._INT.3.1_4_PERCT.TTL.\"","v":{"$error":"#N/A"}},{"$f":"ROUND(PAGE5!$P$96,5)","v":0},{"$f":"ROUND(PAGE5!$R$96,5)","v":0}]
[{"$f":"$C$1&\".E30A.REM.FR.CONSM.DISB._INT.4.1_5_PERCT.\"","v":{"$error":"#N/A"}},{"$f":"ROUND(PAGE5!$C$97,5)","v":0},{"$f":"ROUND(PAGE5!$E$97,5)","v":0}]
[{"$f":"$C$1&\".E30A.REM.VAR.CONSM.DISB._INT.4.1_5_PERCT.\"","v":{"$error":"#N/A"}},{"$f":"ROUND(PAGE5!$G$97,5)","v":0},{"$f":"ROUND(PAGE5!$I$97,5)","v":0}]
[{"$f":"$C$1&\".E30A.REM.ADJ.CONSM.DISB._INT.4.1_5_PERCT.\"","v":{"$error":"#N/A"}},{"$f":"ROUND(PAGE5!$K$97,5)","v":0},{"$f":"ROUND(PAGE5!$M$97,5)","v":0}]
[{"$f":"$C$1&\".E30A.REM.CONSM.DISB._INT.4.1_5_PERCT.TTL.\"","v":{"$error":"#N/A"}},{"$f":"ROUND(PAGE5!$P$97,5)","v":0},{"$f":"ROUND(PAGE5!$R$97,5)","v":0}]
[{"$f":"$C$1&\".E30A.REM.FR.CONSM.DISB._INT.5.1_6_PERCT.\"","v":{"$error":"#N/A"}},{"$f":"ROUND(PAGE5!$C$98,5)","v":0},{"$f":"ROUND(PAGE5!$E$98,5)","v":0}]
[{"$f":"$C$1&\".E30A.REM.VAR.CONSM.DISB._INT.5.1_6_PERCT.\"","v":{"$error":"#N/A"}},{"$f":"ROUND(PAGE5!$G$98,5)","v":0},{"$f":"ROUND(PAGE5!$I$98,5)","v":0}]
[{"$f":"$C$1&\".E30A.REM.ADJ.CONSM.DISB._INT.5.1_6_PERCT.\"","v":{"$error":"#N/A"}},{"$f":"ROUND(PAGE5!$K$98,5)","v":0},{"$f":"ROUND(PAGE5!$M$98,5)","v":0}]
[{"$f":"$C$1&\".E30A.REM.CONSM.DISB._INT.5.1_6_PERCT.TTL.\"","v":{"$error":"#N/A"}},{"$f":"ROUND(PAGE5!$P$98,5)","v":0},{"$f":"ROUND(PAGE5!$R$98,5)","v":0}]
[{"$f":"$C$1&\".E30A.REM.FR.CONSM.DISB._INT.6.1_7_PERCT.\"","v":{"$error":"#N/A"}},{"$f":"ROUND(PAGE5!$C$99,5)","v":0},{"$f":"ROUND(PAGE5!$E$99,5)","v":0}]
[{"$f":"$C$1&\".E30A.REM.VAR.CONSM.DISB._INT.6.1_7_PERCT.\"","v":{"$error":"#N/A"}},{"$f":"ROUND(PAGE5!$G$99,5)","v":0},{"$f":"ROUND(PAGE5!$I$99,5)","v":0}]
[{"$f":"$C$1&\".E30A.REM.ADJ.CONSM.DISB._INT.6.1_7_PERCT.\"","v":{"$error":"#N/A"}},{"$f":"ROUND(PAGE5!$K$99,5)","v":0},{"$f":"ROUND(PAGE5!$M$99,5)","v":0}]
[{"$f":"$C$1&\".E30A.REM.CONSM.DISB._INT.6.1_7_PERCT.TTL.\"","v":{"$error":"#N/A"}},{"$f":"ROUND(PAGE5!$P$99,5)","v":0},{"$f":"ROUND(PAGE5!$R$99,5)","v":0}]
[{"$f":"$C$1&\".E30A.REM.FR.CONSM.DISB._INT.7.1_8_PERCT.\"","v":{"$error":"#N/A"}},{"$f":"ROUND(PAGE5!$C$100,5)","v":0},{"$f":"ROUND(PAGE5!$E$100,5)","v":0}]
[{"$f":"$C$1&\".E30A.REM.VAR.CONSM.DISB._INT.7.1_8_PERCT.\"","v":{"$error":"#N/A"}},{"$f":"ROUND(PAGE5!$G$100,5)","v":0},{"$f":"ROUND(PAGE5!$I$100,5)","v":0}]
[{"$f":"$C$1&\".E30A.REM.ADJ.CONSM.DISB._INT.7.1_8_PERCT.\"","v":{"$error":"#N/A"}},{"$f":"ROUND(PAGE5!$K$100,5)","v":0},{"$f":"ROUND(PAGE5!$M$100,5)","v":0}]
[{"$f":"$C$1&\".E30A.REM.CONSM.DISB._INT.7.1_8_PERCT.TTL.\"","v":{"$error":"#N/A"}},{"$f":"ROUND(PAGE5!$P$100,5)","v":0},{"$f":"ROUND(PAGE5!$R$100,5)","v":0}]
[{"$f":"$C$1&\".E30A.REM.FR.CONSM.DISB._INT.8.1_9_PERCT.\"","v":{"$error":"#N/A"}},{"$f":"ROUND(PAGE5!$C$101,5)","v":0},{"$f":"ROUND(PAGE5!$E$101,5)","v":0}]
[{"$f":"$C$1&\".E30A.REM.VAR.CONSM.DISB._INT.8.1_9_PERCT.\"","v":{"$error":"#N/A"}},{"$f":"ROUND(PAGE5!$G$101,5)","v":0},{"$f":"ROUND(PAGE5!$I$101,5)","v":0}]
[{"$f":"$C$1&\".E30A.REM.ADJ.CONSM.DISB._INT.8.1_9_PERCT.\"","v":{"$error":"#N/A"}},{"$f":"ROUND(PAGE5!$K$101,5)","v":0},{"$f":"ROUND(PAGE5!$M$101,5)","v":0}]
[{"$f":"$C$1&\".E30A.REM.CONSM.DISB._INT.8.1_9_PERCT.TTL.\"","v":{"$error":"#N/A"}},{"$f":"ROUND(PAGE5!$P$101,5)","v":0},{"$f":"ROUND(PAGE5!$R$101,5)","v":0}]
[{"$f":"$C$1&\".E30A.REM.FR.CONSM.DISB._INT.9.1_10_PERCT.\"","v":{"$error":"#N/A"}},{"$f":"ROUND(PAGE5!$C$102,5)","v":0},{"$f":"ROUND(PAGE5!$E$102,5)","v":0}]
[{"$f":"$C$1&\".E30A.REM.VAR.CONSM.DISB._INT.9.1_10_PERCT.\"","v":{"$error":"#N/A"}},{"$f":"ROUND(PAGE5!$G$102,5)","v":0},{"$f":"ROUND(PAGE5!$I$102,5)","v":0}]
[{"$f":"$C$1&\".E30A.REM.ADJ.CONSM.DISB._INT.9.1_10_PERCT.\"","v":{"$error":"#N/A"}},{"$f":"ROUND(PAGE5!$K$102,5)","v":0},{"$f":"ROUND(PAGE5!$M$102,5)","v":0}]
[{"$f":"$C$1&\".E30A.REM.CONSM.DISB._INT.9.1_10_PERCT.TTL.\"","v":{"$error":"#N/A"}},{"$f":"ROUND(PAGE5!$P$102,5)","v":0},{"$f":"ROUND(PAGE5!$R$102,5)","v":0}]
[{"$f":"$C$1&\".E30A.REM.FR.CONSM.DISB._INT.10.1_11_PERCT.\"","v":{"$error":"#N/A"}},{"$f":"ROUND(PAGE5!$C$103,5)","v":0},{"$f":"ROUND(PAGE5!$E$103,5)","v":0}]
[{"$f":"$C$1&\".E30A.REM.VAR.CONSM.DISB._INT.10.1_11_PERCT.\"","v":{"$error":"#N/A"}},{"$f":"ROUND(PAGE5!$G$103,5)","v":0},{"$f":"ROUND(PAGE5!$I$103,5)","v":0}]
[{"$f":"$C$1&\".E30A.REM.ADJ.CONSM.DISB._INT.10.1_11_PERCT.\"","v":{"$error":"#N/A"}},{"$f":"ROUND(PAGE5!$K$103,5)","v":0},{"$f":"ROUND(PAGE5!$M$103,5)","v":0}]
[{"$f":"$C$1&\".E30A.REM.CONSM.DISB._INT.10.1_11_PERCT.TTL.\"","v":{"$error":"#N/A"}},{"$f":"ROUND(PAGE5!$P$103,5)","v":0},{"$f":"ROUND(PAGE5!$R$103,5)","v":0}]
[{"$f":"$C$1&\".E30A.REM.FR.CONSM.DISB._INT.11.1_12_PERCT.\"","v":{"$error":"#N/A"}},{"$f":"ROUND(PAGE5!$C$104,5)","v":0},{"$f":"ROUND(PAGE5!$E$104,5)","v":0}]
[{"$f":"$C$1&\".E30A.REM.VAR.CONSM.DISB._INT.11.1_12_PERCT.\"","v":{"$error":"#N/A"}},{"$f":"ROUND(PAGE5!$G$104,5)","v":0},{"$f":"ROUND(PAGE5!$I$104,5)","v":0}]
[{"$f":"$C$1&\".E30A.REM.ADJ.CONSM.DISB._INT.11.1_12_PERCT.\"","v":{"$error":"#N/A"}},{"$f":"ROUND(PAGE5!$K$104,5)","v":0},{"$f":"ROUND(PAGE5!$M$104,5)","v":0}]
[{"$f":"$C$1&\".E30A.REM.CONSM.DISB._INT.11.1_12_PERCT.TTL.\"","v":{"$error":"#N/A"}},{"$f":"ROUND(PAGE5!$P$104,5)","v":0},{"$f":"ROUND(PAGE5!$R$104,5)","v":0}]
[{"$f":"$C$1&\".E30A.REM.FR.CONSM.DISB._INT.12.1_13_PERCT.\"","v":{"$error":"#N/A"}},{"$f":"ROUND(PAGE5!$C$105,5)","v":0},{"$f":"ROUND(PAGE5!$E$105,5)","v":0}]
[{"$f":"$C$1&\".E30A.REM.VAR.CONSM.DISB._INT.12.1_13_PERCT.\"","v":{"$error":"#N/A"}},{"$f":"ROUND(PAGE5!$G$105,5)","v":0},{"$f":"ROUND(PAGE5!$I$105,5)","v":0}]
[{"$f":"$C$1&\".E30A.REM.ADJ.CONSM.DISB._INT.12.1_13_PERCT.\"","v":{"$error":"#N/A"}},{"$f":"ROUND(PAGE5!$K$105,5)","v":0},{"$f":"ROUND(PAGE5!$M$105,5)","v":0}]
[{"$f":"$C$1&\".E30A.REM.CONSM.DISB._INT.12.1_13_PERCT.TTL.\"","v":{"$error":"#N/A"}},{"$f":"ROUND(PAGE5!$P$105,5)","v":0},{"$f":"ROUND(PAGE5!$R$105,5)","v":0}]
[{"$f":"$C$1&\".E30A.REM.FR.CONSM.DISB._INT.13.1_14_PERCT.\"","v":{"$error":"#N/A"}},{"$f":"ROUND(PAGE5!$C$106,5)","v":0},{"$f":"ROUND(PAGE5!$E$106,5)","v":0}]
[{"$f":"$C$1&\".E30A.REM.VAR.CONSM.DISB._INT.13.1_14_PERCT.\"","v":{"$error":"#N/A"}},{"$f":"ROUND(PAGE5!$G$106,5)","v":0},{"$f":"ROUND(PAGE5!$I$106,5)","v":0}]
[{"$f":"$C$1&\".E30A.REM.ADJ.CONSM.DISB._INT.13.1_14_PERCT.\"","v":{"$error":"#N/A"}},{"$f":"ROUND(PAGE5!$K$106,5)","v":0},{"$f":"ROUND(PAGE5!$M$106,5)","v":0}]
[{"$f":"$C$1&\".E30A.REM.CONSM.DISB._INT.13.1_14_PERCT.TTL.\"","v":{"$error":"#N/A"}},{"$f":"ROUND(PAGE5!$P$106,5)","v":0},{"$f":"ROUND(PAGE5!$R$106,5)","v":0}]
[{"$f":"$C$1&\".E30A.REM.FR.CONSM.DISB._INT.14.1_15_PERCT.\"","v":{"$error":"#N/A"}},{"$f":"ROUND(PAGE5!$C$107,5)","v":0},{"$f":"ROUND(PAGE5!$E$107,5)","v":0}]
[{"$f":"$C$1&\".E30A.REM.VAR.CONSM.DISB._INT.14.1_15_PERCT.\"","v":{"$error":"#N/A"}},{"$f":"ROUND(PAGE5!$G$107,5)","v":0},{"$f":"ROUND(PAGE5!$I$107,5)","v":0}]
[{"$f":"$C$1&\".E30A.REM.ADJ.CONSM.DISB._INT.14.1_15_PERCT.\"","v":{"$error":"#N/A"}},{"$f":"ROUND(PAGE5!$K$107,5)","v":0},{"$f":"ROUND(PAGE5!$M$107,5)","v":0}]
[{"$f":"$C$1&\".E30A.REM.CONSM.DISB._INT.14.1_15_PERCT.TTL.\"","v":{"$error":"#N/A"}},{"$f":"ROUND(PAGE5!$P$107,5)","v":0},{"$f":"ROUND(PAGE5!$R$107,5)","v":0}]
[{"$f":"$C$1&\".E30A.REM.FR.CONSM.DISB._INT.OVR_15.1_PERCT.\"","v":{"$error":"#N/A"}},{"$f":"ROUND(PAGE5!$C$108,5)","v":0},{"$f":"ROUND(PAGE5!$E$108,5)","v":0}]
[{"$f":"$C$1&\".E30A.REM.VAR.CONSM.DISB._INT.OVR_15.1_PERCT.\"","v":{"$error":"#N/A"}},{"$f":"ROUND(PAGE5!$G$108,5)","v":0},{"$f":"ROUND(PAGE5!$I$108,5)","v":0}]
[{"$f":"$C$1&\".E30A.REM.ADJ.CONSM.DISB._INT.OVR_15.1_PERCT.\"","v":{"$error":"#N/A"}},{"$f":"ROUND(PAGE5!$K$108,5)","v":0},{"$f":"ROUND(PAGE5!$M$108,5)","v":0}]
[{"$f":"$C$1&\".E30A.REM.CONSM.DISB._INT.OVR_15.1_PERCT.TTL.\"","v":{"$error":"#N/A"}},{"$f":"ROUND(PAGE5!$P$108,5)","v":0},{"$f":"ROUND(PAGE5!$R$108,5)","v":0}]
[{"$f":"$C$1&\".E30A.REM.CONSM.DISB.TTL.\"","v":{"$error":"#N/A"}},{"$f":"ROUND(PAGE5!P110,5)","v":0},{"$f":"ROUND(PAGE5!R110,5)","v":0}]
[{"$f":"$C$1&\".E30A.REM.FR.DISB.TTL\"","v":{"$error":"#N/A"}},{"$f":"ROUND(PAGE5!$C$112,5)","v":0},{"$f":"ROUND(PAGE5!$E$112,5)","v":0}]
[{"$f":"$C$1&\".E30A.REM.VAR.DISB.TTL\"","v":{"$error":"#N/A"}},{"$f":"ROUND(PAGE5!$G$112,5)","v":0},{"$f":"ROUND(PAGE5!$I$112,5)","v":0}]
[{"$f":"$C$1&\".E30A.REM.ADJ.DISB.TTL\"","v":{"$error":"#N/A"}},{"$f":"ROUND(PAGE5!$K$112,5)","v":0},{"$f":"ROUND(PAGE5!$M$112,5)","v":0}]
[{"$f":"$C$1&\".E30A.REM.DISB._GRNT.AGG_TTL...\"","v":{"$error":"#N/A"}},{"$f":"ROUND(PAGE5!$P$112,5)","v":0},{"$f":"ROUND(PAGE5!$R$112,5)","v":0}]
["sect8","NUM","VAL"]
[{"$f":"$C$1&\".E30A.REM.FR.PBSEC.OS._INT.0_3_PERCT\"","v":{"$error":"#N/A"}},{"$f":"ROUND(PAGE6!$C$19,5)","v":0},{"$f":"ROUND(PAGE6!$E$19,5)","v":0}]
[{"$f":"$C$1&\".E30A.REM.VAR.PBSEC.OS._INT.0_3_PERCT\"","v":{"$error":"#N/A"}},{"$f":"ROUND(PAGE6!$G$19,5)","v":0},{"$f":"ROUND(PAGE6!$I$19,5)","v":0}]
[{"$f":"$C$1&\".E30A.REM.ADJ.PBSEC.OS._INT.0_3_PERCT\"","v":{"$error":"#N/A"}},{"$f":"ROUND(PAGE6!$K$19,5)","v":0},{"$f":"ROUND(PAGE6!$M$19,5)","v":0}]
[{"$f":"$C$1&\".E30A.REM.PBSEC.OS._INT.0_3_PERCT.TTL\"","v":{"$error":"#N/A"}},{"$f":"ROUND(PAGE6!$P$19,5)","v":0},{"$f":"ROUND(PAGE6!$R$19,5)","v":0}]
[{"$f":"$C$1&\".E30A.REM.FR.PBSEC.OS._INT.3.1_4_PERCT\"","v":{"$error":"#N/A"}},{"$f":"ROUND(PAGE6!$C$20,5)","v":0},{"$f":"ROUND(PAGE6!$E$20,5)","v":0}]
[{"$f":"$C$1&\".E30A.REM.VAR.PBSEC.OS._INT.3.1_4_PERCT\"","v":{"$error":"#N/A"}},{"$f":"ROUND(PAGE6!$G$20,5)","v":0},{"$f":"ROUND(PAGE6!$I$20,5)","v":0}]
[{"$f":"$C$1&\".E30A.REM.ADJ.PBSEC.OS._INT.3.1_4_PERCT\"","v":{"$error":"#N/A"}},{"$f":"ROUND(PAGE6!$K$20,5)","v":0},{"$f":"ROUND(PAGE6!$M$20,5)","v":0}]
[{"$f":"$C$1&\".E30A.REM.PBSEC.OS._INT.3.1_4_PERCT.TTL\"","v":{"$error":"#N/A"}},{"$f":"ROUND(PAGE6!$P$20,5)","v":0},{"$f":"ROUND(PAGE6!$R$20,5)","v":0}]
[{"$f":"$C$1&\".E30A.REM.FR.PBSEC.OS._INT.4.1_5_PERCT\"","v":{"$error":"#N/A"}},{"$f":"ROUND(PAGE6!$C$21,5)","v":0},{"$f":"ROUND(PAGE6!$E$21,5)","v":0}]
[{"$f":"$C$1&\".E30A.REM.VAR.PBSEC.OS._INT.4.1_5_PERCT\"","v":{"$error":"#N/A"}},{"$f":"ROUND(PAGE6!$G$21,5)","v":0},{"$f":"ROUND(PAGE6!$I$21,5)","v":0}]
[{"$f":"$C$1&\".E30A.REM.ADJ.PBSEC.OS._INT.4.1_5_PERCT\"","v":{"$error":"#N/A"}},{"$f":"ROUND(PAGE6!$K$21,5)","v":0},{"$f":"ROUND(PAGE6!$M$21,5)","v":0}]
[{"$f":"$C$1&\".E30A.REM.PBSEC.OS._INT.4.1_5_PERCT.TTL\"","v":{"$error":"#N/A"}},{"$f":"ROUND(PAGE6!$P$21,5)","v":0},{"$f":"ROUND(PAGE6!$R$21,5)","v":0}]
[{"$f":"$C$1&\".E30A.REM.FR.PBSEC.OS._INT.5.1_6_PERCT\"","v":{"$error":"#N/A"}},{"$f":"ROUND(PAGE6!$C$22,5)","v":0},{"$f":"ROUND(PAGE6!$E$22,5)","v":0}]
[{"$f":"$C$1&\".E30A.REM.VAR.PBSEC.OS._INT.5.1_6_PERCT\"","v":{"$error":"#N/A"}},{"$f":"ROUND(PAGE6!$G$22,5)","v":0},{"$f":"ROUND(PAGE6!$I$22,5)","v":0}]
[{"$f":"$C$1&\".E30A.REM.ADJ.PBSEC.OS._INT.5.1_6_PERCT\"","v":{"$error":"#N/A"}},{"$f":"ROUND(PAGE6!$K$22,5)","v":0},{"$f":"ROUND(PAGE6!$M$22,5)","v":0}]
[{"$f":"$C$1&\".E30A.REM.PBSEC.OS._INT.5.1_6_PERCT.TTL\"","v":{"$error":"#N/A"}},{"$f":"ROUND(PAGE6!$P$22,5)","v":0},{"$f":"ROUND(PAGE6!$R$22,5)","v":0}]
[{"$f":"$C$1&\".E30A.REM.FR.PBSEC.OS._INT.6.1_7_PERCT\"","v":{"$error":"#N/A"}},{"$f":"ROUND(PAGE6!$C$23,5)","v":0},{"$f":"ROUND(PAGE6!$E$23,5)","v":0}]
[{"$f":"$C$1&\".E30A.REM.VAR.PBSEC.OS._INT.6.1_7_PERCT\"","v":{"$error":"#N/A"}},{"$f":"ROUND(PAGE6!$G$23,5)","v":0},{"$f":"ROUND(PAGE6!$I$23,5)","v":0}]
[{"$f":"$C$1&\".E30A.REM.ADJ.PBSEC.OS._INT.6.1_7_PERCT\"","v":{"$error":"#N/A"}},{"$f":"ROUND(PAGE6!$K$23,5)","v":0},{"$f":"ROUND(PAGE6!$M$23,5)","v":0}]
[{"$f":"$C$1&\".E30A.REM.PBSEC.OS._INT.6.1_7_PERCT.TTL\"","v":{"$error":"#N/A"}},{"$f":"ROUND(PAGE6!$P$23,5)","v":0},{"$f":"ROUND(PAGE6!$R$23,5)","v":0}]
[{"$f":"$C$1&\".E30A.REM.FR.PBSEC.OS._INT.7.1_8_PERCT\"","v":{"$error":"#N/A"}},{"$f":"ROUND(PAGE6!$C$24,5)","v":0},{"$f":"ROUND(PAGE6!$E$24,5)","v":0}]
[{"$f":"$C$1&\".E30A.REM.VAR.PBSEC.OS._INT.7.1_8_PERCT\"","v":{"$error":"#N/A"}},{"$f":"ROUND(PAGE6!$G$24,5)","v":0},{"$f":"ROUND(PAGE6!$I$24,5)","v":0}]
[{"$f":"$C$1&\".E30A.REM.ADJ.PBSEC.OS._INT.7.1_8_PERCT\"","v":{"$error":"#N/A"}},{"$f":"ROUND(PAGE6!$K$24,5)","v":0},{"$f":"ROUND(PAGE6!$M$24,5)","v":0}]
[{"$f":"$C$1&\".E30A.REM.PBSEC.OS._INT.7.1_8_PERCT.TTL\"","v":{"$error":"#N/A"}},{"$f":"ROUND(PAGE6!$P$24,5)","v":0},{"$f":"ROUND(PAGE6!$R$24,5)","v":0}]
[{"$f":"$C$1&\".E30A.REM.FR.PBSEC.OS._INT.8.1_9_PERCT\"","v":{"$error":"#N/A"}},{"$f":"ROUND(PAGE6!$C$25,5)","v":0},{"$f":"ROUND(PAGE6!$E$25,5)","v":0}]
[{"$f":"$C$1&\".E30A.REM.VAR.PBSEC.OS._INT.8.1_9_PERCT\"","v":{"$error":"#N/A"}},{"$f":"ROUND(PAGE6!$G$25,5)","v":0},{"$f":"ROUND(PAGE6!$I$25,5)","v":0}]
[{"$f":"$C$1&\".E30A.REM.ADJ.PBSEC.OS._INT.8.1_9_PERCT\"","v":{"$error":"#N/A"}},{"$f":"ROUND(PAGE6!$K$25,5)","v":0},{"$f":"ROUND(PAGE6!$M$25,5)","v":0}]
[{"$f":"$C$1&\".E30A.REM.PBSEC.OS._INT.8.1_9_PERCT.TTL\"","v":{"$error":"#N/A"}},{"$f":"ROUND(PAGE6!$P$25,5)","v":0},{"$f":"ROUND(PAGE6!$R$25,5)","v":0}]
[{"$f":"$C$1&\".E30A.REM.FR.PBSEC.OS._INT.9.1_10_PERCT\"","v":{"$error":"#N/A"}},{"$f":"ROUND(PAGE6!$C$26,5)","v":0},{"$f":"ROUND(PAGE6!$E$26,5)","v":0}]
[{"$f":"$C$1&\".E30A.REM.VAR.PBSEC.OS._INT.9.1_10_PERCT\"","v":{"$error":"#N/A"}},{"$f":"ROUND(PAGE6!$G$26,5)","v":0},{"$f":"ROUND(PAGE6!$I$26,5)","v":0}]
[{"$f":"$C$1&\".E30A.REM.ADJ.PBSEC.OS._INT.9.1_10_PERCT\"","v":{"$error":"#N/A"}},{"$f":"ROUND(PAGE6!$K$26,5)","v":0},{"$f":"ROUND(PAGE6!$M$26,5)","v":0}]
[{"$f":"$C$1&\".E30A.REM.PBSEC.OS._INT.9.1_10_PERCT.TTL\"","v":{"$error":"#N/A"}},{"$f":"ROUND(PAGE6!$P$26,5)","v":0},{"$f":"ROUND(PAGE6!$R$26,5)","v":0}]
[{"$f":"$C$1&\".E30A.REM.FR.PBSEC.OS._INT.10.1_11_PERCT\"","v":{"$error":"#N/A"}},{"$f":"ROUND(PAGE6!$C$27,5)","v":0},{"$f":"ROUND(PAGE6!$E$27,5)","v":0}]
[{"$f":"$C$1&\".E30A.REM.VAR.PBSEC.OS._INT.10.1_11_PERCT\"","v":{"$error":"#N/A"}},{"$f":"ROUND(PAGE6!$G$27,5)","v":0},{"$f":"ROUND(PAGE6!$I$27,5)","v":0}]
[{"$f":"$C$1&\".E30A.REM.ADJ.PBSEC.OS._INT.10.1_11_PERCT\"","v":{"$error":"#N/A"}},{"$f":"ROUND(PAGE6!$K$27,5)","v":0},{"$f":"ROUND(PAGE6!$M$27,5)","v":0}]
[{"$f":"$C$1&\".E30A.REM.PBSEC.OS._INT.10.1_11_PERCT.TTL\"","v":{"$error":"#N/A"}},{"$f":"ROUND(PAGE6!$P$27,5)","v":0},{"$f":"ROUND(PAGE6!$R$27,5)","v":0}]
[{"$f":"$C$1&\".E30A.REM.FR.PBSEC.OS._INT.11.1_12_PERCT\"","v":{"$error":"#N/A"}},{"$f":"ROUND(PAGE6!$C$28,5)","v":0},{"$f":"ROUND(PAGE6!$E$28,5)","v":0}]
[{"$f":"$C$1&\".E30A.REM.VAR.PBSEC.OS._INT.11.1_12_PERCT\"","v":{"$error":"#N/A"}},{"$f":"ROUND(PAGE6!$G$28,5)","v":0},{"$f":"ROUND(PAGE6!$I$28,5)","v":0}]
[{"$f":"$C$1&\".E30A.REM.ADJ.PBSEC.OS._INT.11.1_12_PERCT\"","v":{"$error":"#N/A"}},{"$f":"ROUND(PAGE6!$K$28,5)","v":0},{"$f":"ROUND(PAGE6!$M$28,5)","v":0}]
[{"$f":"$C$1&\".E30A.REM.PBSEC.OS._INT.11.1_12_PERCT.TTL\"","v":{"$error":"#N/A"}},{"$f":"ROUND(PAGE6!$P$28,5)","v":0},{"$f":"ROUND(PAGE6!$R$28,5)","v":0}]
[{"$f":"$C$1&\".E30A.REM.FR.PBSEC.OS._INT.12.1_13_PERCT\"","v":{"$error":"#N/A"}},{"$f":"ROUND(PAGE6!$C$29,5)","v":0},{"$f":"ROUND(PAGE6!$E$29,5)","v":0}]
[{"$f":"$C$1&\".E30A.REM.VAR.PBSEC.OS._INT.12.1_13_PERCT\"","v":{"$error":"#N/A"}},{"$f":"ROUND(PAGE6!$G$29,5)","v":0},{"$f":"ROUND(PAGE6!$I$29,5)","v":0}]
[{"$f":"$C$1&\".E30A.REM.ADJ.PBSEC.OS._INT.12.1_13_PERCT\"","v":{"$error":"#N/A"}},{"$f":"ROUND(PAGE6!$K$29,5)","v":0},{"$f":"ROUND(PAGE6!$M$29,5)","v":0}]
[{"$f":"$C$1&\".E30A.REM.PBSEC.OS._INT.12.1_13_PERCT.TTL\"","v":{"$error":"#N/A"}},{"$f":"ROUND(PAGE6!$P$29,5)","v":0},{"$f":"ROUND(PAGE6!$R$29,5)","v":0}]
[{"$f":"$C$1&\".E30A.REM.FR.PBSEC.OS._INT.13.1_14_PERCT\"","v":{"$error":"#N/A"}},{"$f":"ROUND(PAGE6!$C$30,5)","v":0},{"$f":"ROUND(PAGE6!$E$30,5)","v":0}]
[{"$f":"$C$1&\".E30A.REM.VAR.PBSEC.OS._INT.13.1_14_PERCT\"","v":{"$error":"#N/A"}},{"$f":"ROUND(PAGE6!$G$30,5)","v":0},{"$f":"ROUND(PAGE6!$I$30,5)","v":0}]
[{"$f":"$C$1&\".E30A.REM.ADJ.PBSEC.OS._INT.13.1_14_PERCT\"","v":{"$error":"#N/A"}},{"$f":"ROUND(PAGE6!$K$30,5)","v":0},{"$f":"ROUND(PAGE6!$M$30,5)","v":0}]
[{"$f":"$C$1&\".E30A.REM.PBSEC.OS._INT.13.1_14_PERCT.TTL\"","v":{"$error":"#N/A"}},{"$f":"ROUND(PAGE6!$P$30,5)","v":0},{"$f":"ROUND(PAGE6!$R$30,5)","v":0}]
[{"$f":"$C$1&\".E30A.REM.FR.PBSEC.OS._INT.14.1_15_PERCT\"","v":{"$error":"#N/A"}},{"$f":"ROUND(PAGE6!$C$31,5)","v":0},{"$f":"ROUND(PAGE6!$E$31,5)","v":0}]
[{"$f":"$C$1&\".E30A.REM.VAR.PBSEC.OS._INT.14.1_15_PERCT\"","v":{"$error":"#N/A"}},{"$f":"ROUND(PAGE6!$G$31,5)","v":0},{"$f":"ROUND(PAGE6!$I$31,5)","v":0}]
[{"$f":"$C$1&\".E30A.REM.ADJ.PBSEC.OS._INT.14.1_15_PERCT\"","v":{"$error":"#N/A"}},{"$f":"ROUND(PAGE6!$K$31,5)","v":0},{"$f":"ROUND(PAGE6!$M$31,5)","v":0}]
[{"$f":"$C$1&\".E30A.REM.PBSEC.OS._INT.14.1_15_PERCT.TTL\"","v":{"$error":"#N/A"}},{"$f":"ROUND(PAGE6!$P$31,5)","v":0},{"$f":"ROUND(PAGE6!$R$31,5)","v":0}]
[{"$f":"$C$1&\".E30A.REM.FR.PBSEC.OS._INT.OVR_15.1_PERCT\"","v":{"$error":"#N/A"}},{"$f":"ROUND(PAGE6!$C$32,5)","v":0},{"$f":"ROUND(PAGE6!$E$32,5)","v":0}]
[{"$f":"$C$1&\".E30A.REM.VAR.PBSEC.OS._INT.OVR_15.1_PERCT\"","v":{"$error":"#N/A"}},{"$f":"ROUND(PAGE6!$G$32,5)","v":0},{"$f":"ROUND(PAGE6!$I$32,5)","v":0}]
[{"$f":"$C$1&\".E30A.REM.ADJ.PBSEC.OS._INT.OVR_15.1_PERCT\"","v":{"$error":"#N/A"}},{"$f":"ROUND(PAGE6!$K$32,5)","v":0},{"$f":"ROUND(PAGE6!$M$32,5)","v":0}]
[{"$f":"$C$1&\".E30A.REM.PBSEC.OS._INT.OVR_15.1_PERCT.TTL\"","v":{"$error":"#N/A"}},{"$f":"ROUND(PAGE6!$P$32,5)","v":0},{"$f":"ROUND(PAGE6!$R$32,5)","v":0}]
[{"$f":"$C$1&\".E30A.REM.PBSEC.OS.TTL.\"","v":{"$error":"#N/A"}},{"$f":"ROUND(PAGE6!P34,5)","v":0},{"$f":"ROUND(PAGE6!R34,5)","v":0}]
[{"$f":"$C$1&\".E30A.REM.FR.PVFIN.OS._INT.0_3_PERCT\"","v":{"$error":"#N/A"}},{"$f":"ROUND(PAGE6!$C$38,5)","v":0},{"$f":"ROUND(PAGE6!$E$38,5)","v":0}]
[{"$f":"$C$1&\".E30A.REM.VAR.PVFIN.OS._INT.0_3_PERCT\"","v":{"$error":"#N/A"}},{"$f":"ROUND(PAGE6!$G$38,5)","v":0},{"$f":"ROUND(PAGE6!$I$38,5)","v":0}]
[{"$f":"$C$1&\".E30A.REM.ADJ.PVFIN.OS._INT.0_3_PERCT\"","v":{"$error":"#N/A"}},{"$f":"ROUND(PAGE6!$K$38,5)","v":0},{"$f":"ROUND(PAGE6!$M$38,5)","v":0}]
[{"$f":"$C$1&\".E30A.REM.PVFIN.OS._INT.0_3_PERCT.TTL\"","v":{"$error":"#N/A"}},{"$f":"ROUND(PAGE6!$P$38,5)","v":0},{"$f":"ROUND(PAGE6!$R$38,5)","v":0}]
[{"$f":"$C$1&\".E30A.REM.FR.PVFIN.OS._INT.3.1_4_PERCT\"","v":{"$error":"#N/A"}},{"$f":"ROUND(PAGE6!$C$39,5)","v":0},{"$f":"ROUND(PAGE6!$E$39,5)","v":0}]
[{"$f":"$C$1&\".E30A.REM.VAR.PVFIN.OS._INT.3.1_4_PERCT\"","v":{"$error":"#N/A"}},{"$f":"ROUND(PAGE6!$G$39,5)","v":0},{"$f":"ROUND(PAGE6!$I$39,5)","v":0}]
[{"$f":"$C$1&\".E30A.REM.ADJ.PVFIN.OS._INT.3.1_4_PERCT\"","v":{"$error":"#N/A"}},{"$f":"ROUND(PAGE6!$K$39,5)","v":0},{"$f":"ROUND(PAGE6!$M$39,5)","v":0}]
[{"$f":"$C$1&\".E30A.REM.PVFIN.OS._INT.3.1_4_PERCT.TTL\"","v":{"$error":"#N/A"}},{"$f":"ROUND(PAGE6!$P$39,5)","v":0},{"$f":"ROUND(PAGE6!$R$39,5)","v":0}]
[{"$f":"$C$1&\".E30A.REM.FR.PVFIN.OS._INT.4.1_5_PERCT\"","v":{"$error":"#N/A"}},{"$f":"ROUND(PAGE6!$C$40,5)","v":0},{"$f":"ROUND(PAGE6!$E$40,5)","v":0}]
[{"$f":"$C$1&\".E30A.REM.VAR.PVFIN.OS._INT.4.1_5_PERCT\"","v":{"$error":"#N/A"}},{"$f":"ROUND(PAGE6!$G$40,5)","v":0},{"$f":"ROUND(PAGE6!$I$40,5)","v":0}]
[{"$f":"$C$1&\".E30A.REM.ADJ.PVFIN.OS._INT.4.1_5_PERCT\"","v":{"$error":"#N/A"}},{"$f":"ROUND(PAGE6!$K$40,5)","v":0},{"$f":"ROUND(PAGE6!$M$40,5)","v":0}]
[{"$f":"$C$1&\".E30A.REM.PVFIN.OS._INT.4.1_5_PERCT.TTL\"","v":{"$error":"#N/A"}},{"$f":"ROUND(PAGE6!$P$40,5)","v":0},{"$f":"ROUND(PAGE6!$R$40,5)","v":0}]
[{"$f":"$C$1&\".E30A.REM.FR.PVFIN.OS._INT.5.1_6_PERCT\"","v":{"$error":"#N/A"}},{"$f":"ROUND(PAGE6!$C$41,5)","v":0},{"$f":"ROUND(PAGE6!$E$41,5)","v":0}]
[{"$f":"$C$1&\".E30A.REM.VAR.PVFIN.OS._INT.5.1_6_PERCT\"","v":{"$error":"#N/A"}},{"$f":"ROUND(PAGE6!$G$41,5)","v":0},{"$f":"ROUND(PAGE6!$I$41,5)","v":0}]
[{"$f":"$C$1&\".E30A.REM.ADJ.PVFIN.OS._INT.5.1_6_PERCT\"","v":{"$error":"#N/A"}},{"$f":"ROUND(PAGE6!$K$41,5)","v":0},{"$f":"ROUND(PAGE6!$M$41,5)","v":0}]
[{"$f":"$C$1&\".E30A.REM.PVFIN.OS._INT.5.1_6_PERCT.TTL\"","v":{"$error":"#N/A"}},{"$f":"ROUND(PAGE6!$P$41,5)","v":0},{"$f":"ROUND(PAGE6!$R$41,5)","v":0}]
[{"$f":"$C$1&\".E30A.REM.FR.PVFIN.OS._INT.6.1_7_PERCT\"","v":{"$error":"#N/A"}},{"$f":"ROUND(PAGE6!$C$42,5)","v":0},{"$f":"ROUND(PAGE6!$E$42,5)","v":0}]
[{"$f":"$C$1&\".E30A.REM.VAR.PVFIN.OS._INT.6.1_7_PERCT\"","v":{"$error":"#N/A"}},{"$f":"ROUND(PAGE6!$G$42,5)","v":0},{"$f":"ROUND(PAGE6!$I$42,5)","v":0}]
[{"$f":"$C$1&\".E30A.REM.ADJ.PVFIN.OS._INT.6.1_7_PERCT\"","v":{"$error":"#N/A"}},{"$f":"ROUND(PAGE6!$K$42,5)","v":0},{"$f":"ROUND(PAGE6!$M$42,5)","v":0}]
[{"$f":"$C$1&\".E30A.REM.PVFIN.OS._INT.6.1_7_PERCT.TTL\"","v":{"$error":"#N/A"}},{"$f":"ROUND(PAGE6!$P$42,5)","v":0},{"$f":"ROUND(PAGE6!$R$42,5)","v":0}]
[{"$f":"$C$1&\".E30A.REM.FR.PVFIN.OS._INT.7.1_8_PERCT\"","v":{"$error":"#N/A"}},{"$f":"ROUND(PAGE6!$C$43,5)","v":0},{"$f":"ROUND(PAGE6!$E$43,5)","v":0}]
[{"$f":"$C$1&\".E30A.REM.VAR.PVFIN.OS._INT.7.1_8_PERCT\"","v":{"$error":"#N/A"}},{"$f":"ROUND(PAGE6!$G$43,5)","v":0},{"$f":"ROUND(PAGE6!$I$43,5)","v":0}]
[{"$f":"$C$1&\".E30A.REM.ADJ.PVFIN.OS._INT.7.1_8_PERCT\"","v":{"$error":"#N/A"}},{"$f":"ROUND(PAGE6!$K$43,5)","v":0},{"$f":"ROUND(PAGE6!$M$43,5)","v":0}]
[{"$f":"$C$1&\".E30A.REM.PVFIN.OS._INT.7.1_8_PERCT.TTL\"","v":{"$error":"#N/A"}},{"$f":"ROUND(PAGE6!$P$43,5)","v":0},{"$f":"ROUND(PAGE6!$R$43,5)","v":0}]
[{"$f":"$C$1&\".E30A.REM.FR.PVFIN.OS._INT.8.1_9_PERCT\"","v":{"$error":"#N/A"}},{"$f":"ROUND(PAGE6!$C$44,5)","v":0},{"$f":"ROUND(PAGE6!$E$44,5)","v":0}]
[{"$f":"$C$1&\".E30A.REM.VAR.PVFIN.OS._INT.8.1_9_PERCT\"","v":{"$error":"#N/A"}},{"$f":"ROUND(PAGE6!$G$44,5)","v":0},{"$f":"ROUND(PAGE6!$I$44,5)","v":0}]
[{"$f":"$C$1&\".E30A.REM.ADJ.PVFIN.OS._INT.8.1_9_PERCT\"","v":{"$error":"#N/A"}},{"$f":"ROUND(PAGE6!$K$44,5)","v":0},{"$f":"ROUND(PAGE6!$M$44,5)","v":0}]
[{"$f":"$C$1&\".E30A.REM.PVFIN.OS._INT.8.1_9_PERCT.TTL\"","v":{"$error":"#N/A"}},{"$f":"ROUND(PAGE6!$P$44,5)","v":0},{"$f":"ROUND(PAGE6!$R$44,5)","v":0}]
[{"$f":"$C$1&\".E30A.REM.FR.PVFIN.OS._INT.9.1_10_PERCT\"","v":{"$error":"#N/A"}},{"$f":"ROUND(PAGE6!$C$45,5)","v":0},{"$f":"ROUND(PAGE6!$E$45,5)","v":0}]
[{"$f":"$C$1&\".E30A.REM.VAR.PVFIN.OS._INT.9.1_10_PERCT\"","v":{"$error":"#N/A"}},{"$f":"ROUND(PAGE6!$G$45,5)","v":0},{"$f":"ROUND(PAGE6!$I$45,5)","v":0}]
[{"$f":"$C$1&\".E30A.REM.ADJ.PVFIN.OS._INT.9.1_10_PERCT\"","v":{"$error":"#N/A"}},{"$f":"ROUND(PAGE6!$K$45,5)","v":0},{"$f":"ROUND(PAGE6!$M$45,5)","v":0}]
[{"$f":"$C$1&\".E30A.REM.PVFIN.OS._INT.9.1_10_PERCT.TTL\"","v":{"$error":"#N/A"}},{"$f":"ROUND(PAGE6!$P$45,5)","v":0},{"$f":"ROUND(PAGE6!$R$45,5)","v":0}]
[{"$f":"$C$1&\".E30A.REM.FR.PVFIN.OS._INT.10.1_11_PERCT\"","v":{"$error":"#N/A"}},{"$f":"ROUND(PAGE6!$C$46,5)","v":0},{"$f":"ROUND(PAGE6!$E$46,5)","v":0}]
[{"$f":"$C$1&\".E30A.REM.VAR.PVFIN.OS._INT.10.1_11_PERCT\"","v":{"$error":"#N/A"}},{"$f":"ROUND(PAGE6!$G$46,5)","v":0},{"$f":"ROUND(PAGE6!$I$46,5)","v":0}]
[{"$f":"$C$1&\".E30A.REM.ADJ.PVFIN.OS._INT.10.1_11_PERCT\"","v":{"$error":"#N/A"}},{"$f":"ROUND(PAGE6!$K$46,5)","v":0},{"$f":"ROUND(PAGE6!$M$46,5)","v":0}]
[{"$f":"$C$1&\".E30A.REM.PVFIN.OS._INT.10.1_11_PERCT.TTL\"","v":{"$error":"#N/A"}},{"$f":"ROUND(PAGE6!$P$46,5)","v":0},{"$f":"ROUND(PAGE6!$R$46,5)","v":0}]
[{"$f":"$C$1&\".E30A.REM.FR.PVFIN.OS._INT.11.1_12_PERCT\"","v":{"$error":"#N/A"}},{"$f":"ROUND(PAGE6!$C$47,5)","v":0},{"$f":"ROUND(PAGE6!$E$47,5)","v":0}]
[{"$f":"$C$1&\".E30A.REM.VAR.PVFIN.OS._INT.11.1_12_PERCT\"","v":{"$error":"#N/A"}},{"$f":"ROUND(PAGE6!$G$47,5)","v":0},{"$f":"ROUND(PAGE6!$I$47,5)","v":0}]
[{"$f":"$C$1&\".E30A.REM.ADJ.PVFIN.OS._INT.11.1_12_PERCT\"","v":{"$error":"#N/A"}},{"$f":"ROUND(PAGE6!$K$47,5)","v":0},{"$f":"ROUND(PAGE6!$M$47,5)","v":0}]
[{"$f":"$C$1&\".E30A.REM.PVFIN.OS._INT.11.1_12_PERCT.TTL\"","v":{"$error":"#N/A"}},{"$f":"ROUND(PAGE6!$P$47,5)","v":0},{"$f":"ROUND(PAGE6!$R$47,5)","v":0}]
[{"$f":"$C$1&\".E30A.REM.FR.PVFIN.OS._INT.12.1_13_PERCT\"","v":{"$error":"#N/A"}},{"$f":"ROUND(PAGE6!$C$48,5)","v":0},{"$f":"ROUND(PAGE6!$E$48,5)","v":0}]
[{"$f":"$C$1&\".E30A.REM.VAR.PVFIN.OS._INT.12.1_13_PERCT\"","v":{"$error":"#N/A"}},{"$f":"ROUND(PAGE6!$G$48,5)","v":0},{"$f":"ROUND(PAGE6!$I$48,5)","v":0}]
[{"$f":"$C$1&\".E30A.REM.ADJ.PVFIN.OS._INT.12.1_13_PERCT\"","v":{"$error":"#N/A"}},{"$f":"ROUND(PAGE6!$K$48,5)","v":0},{"$f":"ROUND(PAGE6!$M$48,5)","v":0}]
[{"$f":"$C$1&\".E30A.REM.PVFIN.OS._INT.12.1_13_PERCT.TTL\"","v":{"$error":"#N/A"}},{"$f":"ROUND(PAGE6!$P$48,5)","v":0},{"$f":"ROUND(PAGE6!$R$48,5)","v":0}]
[{"$f":"$C$1&\".E30A.REM.FR.PVFIN.OS._INT.13.1_14_PERCT\"","v":{"$error":"#N/A"}},{"$f":"ROUND(PAGE6!$C$49,5)","v":0},{"$f":"ROUND(PAGE6!$E$49,5)","v":0}]
[{"$f":"$C$1&\".E30A.REM.VAR.PVFIN.OS._INT.13.1_14_PERCT\"","v":{"$error":"#N/A"}},{"$f":"ROUND(PAGE6!$G$49,5)","v":0},{"$f":"ROUND(PAGE6!$I$49,5)","v":0}]
[{"$f":"$C$1&\".E30A.REM.ADJ.PVFIN.OS._INT.13.1_14_PERCT\"","v":{"$error":"#N/A"}},{"$f":"ROUND(PAGE6!$K$49,5)","v":0},{"$f":"ROUND(PAGE6!$M$49,5)","v":0}]
[{"$f":"$C$1&\".E30A.REM.PVFIN.OS._INT.13.1_14_PERCT.TTL\"","v":{"$error":"#N/A"}},{"$f":"ROUND(PAGE6!$P$49,5)","v":0},{"$f":"ROUND(PAGE6!$R$49,5)","v":0}]
[{"$f":"$C$1&\".E30A.REM.FR.PVFIN.OS._INT.14.1_15_PERCT\"","v":{"$error":"#N/A"}},{"$f":"ROUND(PAGE6!$C$50,5)","v":0},{"$f":"ROUND(PAGE6!$E$50,5)","v":0}]
[{"$f":"$C$1&\".E30A.REM.VAR.PVFIN.OS._INT.14.1_15_PERCT\"","v":{"$error":"#N/A"}},{"$f":"ROUND(PAGE6!$G$50,5)","v":0},{"$f":"ROUND(PAGE6!$I$50,5)","v":0}]
[{"$f":"$C$1&\".E30A.REM.ADJ.PVFIN.OS._INT.14.1_15_PERCT\"","v":{"$error":"#N/A"}},{"$f":"ROUND(PAGE6!$K$50,5)","v":0},{"$f":"ROUND(PAGE6!$M$50,5)","v":0}]
[{"$f":"$C$1&\".E30A.REM.PVFIN.OS._INT.14.1_15_PERCT.TTL\"","v":{"$error":"#N/A"}},{"$f":"ROUND(PAGE6!$P$50,5)","v":0},{"$f":"ROUND(PAGE6!$R$50,5)","v":0}]
[{"$f":"$C$1&\".E30A.REM.FR.PVFIN.OS._INT.OVR_15.1_PERCT\"","v":{"$error":"#N/A"}},{"$f":"ROUND(PAGE6!$C$51,5)","v":0},{"$f":"ROUND(PAGE6!$E$51,5)","v":0}]
[{"$f":"$C$1&\".E30A.REM.VAR.PVFIN.OS._INT.OVR_15.1_PERCT\"","v":{"$error":"#N/A"}},{"$f":"ROUND(PAGE6!$G$51,5)","v":0},{"$f":"ROUND(PAGE6!$I$51,5)","v":0}]
[{"$f":"$C$1&\".E30A.REM.ADJ.PVFIN.OS._INT.OVR_15.1_PERCT\"","v":{"$error":"#N/A"}},{"$f":"ROUND(PAGE6!$K$51,5)","v":0},{"$f":"ROUND(PAGE6!$M$51,5)","v":0}]
[{"$f":"$C$1&\".E30A.REM.PVFIN.OS._INT.OVR_15.1_PERCT.TTL\"","v":{"$error":"#N/A"}},{"$f":"ROUND(PAGE6!$P$51,5)","v":0},{"$f":"ROUND(PAGE6!$R$51,5)","v":0}]
[{"$f":"$C$1&\".E30A.REM.PVFIN.OS.TTL.\"","v":{"$error":"#N/A"}},{"$f":"ROUND(PAGE6!P53,5)","v":0},{"$f":"ROUND(PAGE6!R53,5)","v":0}]
[{"$f":"$C$1&\".E30A.REM.FR.IBUS.OS._INT.0_3_PERCT\"","v":{"$error":"#N/A"}},{"$f":"ROUND(PAGE6!$C$57,5)","v":0},{"$f":"ROUND(PAGE6!$E$57,5)","v":0}]
[{"$f":"$C$1&\".E30A.REM.VAR.IBUS.OS._INT.0_3_PERCT\"","v":{"$error":"#N/A"}},{"$f":"ROUND(PAGE6!$G$57,5)","v":0},{"$f":"ROUND(PAGE6!$I$57,5)","v":0}]
[{"$f":"$C$1&\".E30A.REM.ADJ.IBUS.OS._INT.0_3_PERCT\"","v":{"$error":"#N/A"}},{"$f":"ROUND(PAGE6!$K$57,5)","v":0},{"$f":"ROUND(PAGE6!$M$57,5)","v":0}]
[{"$f":"$C$1&\".E30A.REM.IBUS.OS._INT.0_3_PERCT.TTL\"","v":{"$error":"#N/A"}},{"$f":"ROUND(PAGE6!$P$57,5)","v":0},{"$f":"ROUND(PAGE6!$R$57,5)","v":0}]
[{"$f":"$C$1&\".E30A.REM.FR.IBUS.OS._INT.3.1_4_PERCT\"","v":{"$error":"#N/A"}},{"$f":"ROUND(PAGE6!$C$58,5)","v":0},{"$f":"ROUND(PAGE6!$E$58,5)","v":0}]
[{"$f":"$C$1&\".E30A.REM.VAR.IBUS.OS._INT.3.1_4_PERCT\"","v":{"$error":"#N/A"}},{"$f":"ROUND(PAGE6!$G$58,5)","v":0},{"$f":"ROUND(PAGE6!$I$58,5)","v":0}]
[{"$f":"$C$1&\".E30A.REM.ADJ.IBUS.OS._INT.3.1_4_PERCT\"","v":{"$error":"#N/A"}},{"$f":"ROUND(PAGE6!$K$58,5)","v":0},{"$f":"ROUND(PAGE6!$M$58,5)","v":0}]
[{"$f":"$C$1&\".E30A.REM.IBUS.OS._INT.3.1_4_PERCT.TTL\"","v":{"$error":"#N/A"}},{"$f":"ROUND(PAGE6!$P$58,5)","v":0},{"$f":"ROUND(PAGE6!$R$58,5)","v":0}]
[{"$f":"$C$1&\".E30A.REM.FR.IBUS.OS._INT.4.1_5_PERCT\"","v":{"$error":"#N/A"}},{"$f":"ROUND(PAGE6!$C$59,5)","v":0},{"$f":"ROUND(PAGE6!$E$59,5)","v":0}]
[{"$f":"$C$1&\".E30A.REM.VAR.IBUS.OS._INT.4.1_5_PERCT\"","v":{"$error":"#N/A"}},{"$f":"ROUND(PAGE6!$G$59,5)","v":0},{"$f":"ROUND(PAGE6!$I$59,5)","v":0}]
[{"$f":"$C$1&\".E30A.REM.ADJ.IBUS.OS._INT.4.1_5_PERCT\"","v":{"$error":"#N/A"}},{"$f":"ROUND(PAGE6!$K$59,5)","v":0},{"$f":"ROUND(PAGE6!$M$59,5)","v":0}]
[{"$f":"$C$1&\".E30A.REM.IBUS.OS._INT.4.1_5_PERCT.TTL\"","v":{"$error":"#N/A"}},{"$f":"ROUND(PAGE6!$P$59,5)","v":0},{"$f":"ROUND(PAGE6!$R$59,5)","v":0}]
[{"$f":"$C$1&\".E30A.REM.FR.IBUS.OS._INT.5.1_6_PERCT\"","v":{"$error":"#N/A"}},{"$f":"ROUND(PAGE6!$C$60,5)","v":0},{"$f":"ROUND(PAGE6!$E$60,5)","v":0}]
[{"$f":"$C$1&\".E30A.REM.VAR.IBUS.OS._INT.5.1_6_PERCT\"","v":{"$error":"#N/A"}},{"$f":"ROUND(PAGE6!$G$60,5)","v":0},{"$f":"ROUND(PAGE6!$I$60,5)","v":0}]
[{"$f":"$C$1&\".E30A.REM.ADJ.IBUS.OS._INT.5.1_6_PERCT\"","v":{"$error":"#N/A"}},{"$f":"ROUND(PAGE6!$K$60,5)","v":0},{"$f":"ROUND(PAGE6!$M$60,5)","v":0}]
[{"$f":"$C$1&\".E30A.REM.IBUS.OS._INT.5.1_6_PERCT.TTL\"","v":{"$error":"#N/A"}},{"$f":"ROUND(PAGE6!$P$60,5)","v":0},{"$f":"ROUND(PAGE6!$R$60,5)","v":0}]
[{"$f":"$C$1&\".E30A.REM.FR.IBUS.OS._INT.6.1_7_PERCT\"","v":{"$error":"#N/A"}},{"$f":"ROUND(PAGE6!$C$61,5)","v":0},{"$f":"ROUND(PAGE6!$E$61,5)","v":0}]
[{"$f":"$C$1&\".E30A.REM.VAR.IBUS.OS._INT.6.1_7_PERCT\"","v":{"$error":"#N/A"}},{"$f":"ROUND(PAGE6!$G$61,5)","v":0},{"$f":"ROUND(PAGE6!$I$61,5)","v":0}]
[{"$f":"$C$1&\".E30A.REM.ADJ.IBUS.OS._INT.6.1_7_PERCT\"","v":{"$error":"#N/A"}},{"$f":"ROUND(PAGE6!$K$61,5)","v":0},{"$f":"ROUND(PAGE6!$M$61,5)","v":0}]
[{"$f":"$C$1&\".E30A.REM.IBUS.OS._INT.6.1_7_PERCT.TTL\"","v":{"$error":"#N/A"}},{"$f":"ROUND(PAGE6!$P$61,5)","v":0},{"$f":"ROUND(PAGE6!$R$61,5)","v":0}]
[{"$f":"$C$1&\".E30A.REM.FR.IBUS.OS._INT.7.1_8_PERCT\"","v":{"$error":"#N/A"}},{"$f":"ROUND(PAGE6!$C$62,5)","v":0},{"$f":"ROUND(PAGE6!$E$62,5)","v":0}]
[{"$f":"$C$1&\".E30A.REM.VAR.IBUS.OS._INT.7.1_8_PERCT\"","v":{"$error":"#N/A"}},{"$f":"ROUND(PAGE6!$G$62,5)","v":0},{"$f":"ROUND(PAGE6!$I$62,5)","v":0}]
[{"$f":"$C$1&\".E30A.REM.ADJ.IBUS.OS._INT.7.1_8_PERCT\"","v":{"$error":"#N/A"}},{"$f":"ROUND(PAGE6!$K$62,5)","v":0},{"$f":"ROUND(PAGE6!$M$62,5)","v":0}]
[{"$f":"$C$1&\".E30A.REM.IBUS.OS._INT.7.1_8_PERCT.TTL\"","v":{"$error":"#N/A"}},{"$f":"ROUND(PAGE6!$P$62,5)","v":0},{"$f":"ROUND(PAGE6!$R$62,5)","v":0}]
[{"$f":"$C$1&\".E30A.REM.FR.IBUS.OS._INT.8.1_9_PERCT\"","v":{"$error":"#N/A"}},{"$f":"ROUND(PAGE6!$C$63,5)","v":0},{"$f":"ROUND(PAGE6!$E$63,5)","v":0}]
[{"$f":"$C$1&\".E30A.REM.VAR.IBUS.OS._INT.8.1_9_PERCT\"","v":{"$error":"#N/A"}},{"$f":"ROUND(PAGE6!$G$63,5)","v":0},{"$f":"ROUND(PAGE6!$I$63,5)","v":0}]
[{"$f":"$C$1&\".E30A.REM.ADJ.IBUS.OS._INT.8.1_9_PERCT\"","v":{"$error":"#N/A"}},{"$f":"ROUND(PAGE6!$K$63,5)","v":0},{"$f":"ROUND(PAGE6!$M$63,5)","v":0}]
[{"$f":"$C$1&\".E30A.REM.IBUS.OS._INT.8.1_9_PERCT.TTL\"","v":{"$error":"#N/A"}},{"$f":"ROUND(PAGE6!$P$63,5)","v":0},{"$f":"ROUND(PAGE6!$R$63,5)","v":0}]
[{"$f":"$C$1&\".E30A.REM.FR.IBUS.OS._INT.9.1_10_PERCT\"","v":{"$error":"#N/A"}},{"$f":"ROUND(PAGE6!$C$64,5)","v":0},{"$f":"ROUND(PAGE6!$E$64,5)","v":0}]
[{"$f":"$C$1&\".E30A.REM.VAR.IBUS.OS._INT.9.1_10_PERCT\"","v":{"$error":"#N/A"}},{"$f":"ROUND(PAGE6!$G$64,5)","v":0},{"$f":"ROUND(PAGE6!$I$64,5)","v":0}]
[{"$f":"$C$1&\".E30A.REM.ADJ.IBUS.OS._INT.9.1_10_PERCT\"","v":{"$error":"#N/A"}},{"$f":"ROUND(PAGE6!$K$64,5)","v":0},{"$f":"ROUND(PAGE6!$M$64,5)","v":0}]
[{"$f":"$C$1&\".E30A.REM.IBUS.OS._INT.9.1_10_PERCT.TTL\"","v":{"$error":"#N/A"}},{"$f":"ROUND(PAGE6!$P$64,5)","v":0},{"$f":"ROUND(PAGE6!$R$64,5)","v":0}]
[{"$f":"$C$1&\".E30A.REM.FR.IBUS.OS._INT.10.1_11_PERCT\"","v":{"$error":"#N/A"}},{"$f":"ROUND(PAGE6!$C$65,5)","v":0},{"$f":"ROUND(PAGE6!$E$65,5)","v":0}]
[{"$f":"$C$1&\".E30A.REM.VAR.IBUS.OS._INT.10.1_11_PERCT\"","v":{"$error":"#N/A"}},{"$f":"ROUND(PAGE6!$G$65,5)","v":0},{"$f":"ROUND(PAGE6!$I$65,5)","v":0}]
[{"$f":"$C$1&\".E30A.REM.ADJ.IBUS.OS._INT.10.1_11_PERCT\"","v":{"$error":"#N/A"}},{"$f":"ROUND(PAGE6!$K$65,5)","v":0},{"$f":"ROUND(PAGE6!$M$65,5)","v":0}]
[{"$f":"$C$1&\".E30A.REM.IBUS.OS._INT.10.1_11_PERCT.TTL\"","v":{"$error":"#N/A"}},{"$f":"ROUND(PAGE6!$P$65,5)","v":0},{"$f":"ROUND(PAGE6!$R$65,5)","v":0}]
[{"$f":"$C$1&\".E30A.REM.FR.IBUS.OS._INT.11.1_12_PERCT\"","v":{"$error":"#N/A"}},{"$f":"ROUND(PAGE6!$C$66,5)","v":0},{"$f":"ROUND(PAGE6!$E$66,5)","v":0}]
[{"$f":"$C$1&\".E30A.REM.VAR.IBUS.OS._INT.11.1_12_PERCT\"","v":{"$error":"#N/A"}},{"$f":"ROUND(PAGE6!$G$66,5)","v":0},{"$f":"ROUND(PAGE6!$I$66,5)","v":0}]
[{"$f":"$C$1&\".E30A.REM.ADJ.IBUS.OS._INT.11.1_12_PERCT\"","v":{"$error":"#N/A"}},{"$f":"ROUND(PAGE6!$K$66,5)","v":0},{"$f":"ROUND(PAGE6!$M$66,5)","v":0}]
[{"$f":"$C$1&\".E30A.REM.IBUS.OS._INT.11.1_12_PERCT.TTL\"","v":{"$error":"#N/A"}},{"$f":"ROUND(PAGE6!$P$66,5)","v":0},{"$f":"ROUND(PAGE6!$R$66,5)","v":0}]
[{"$f":"$C$1&\".E30A.REM.FR.IBUS.OS._INT.12.1_13_PERCT\"","v":{"$error":"#N/A"}},{"$f":"ROUND(PAGE6!$C$67,5)","v":0},{"$f":"ROUND(PAGE6!$E$67,5)","v":0}]
[{"$f":"$C$1&\".E30A.REM.VAR.IBUS.OS._INT.12.1_13_PERCT\"","v":{"$error":"#N/A"}},{"$f":"ROUND(PAGE6!$G$67,5)","v":0},{"$f":"ROUND(PAGE6!$I$67,5)","v":0}]
[{"$f":"$C$1&\".E30A.REM.ADJ.IBUS.OS._INT.12.1_13_PERCT\"","v":{"$error":"#N/A"}},{"$f":"ROUND(PAGE6!$K$67,5)","v":0},{"$f":"ROUND(PAGE6!$M$67,5)","v":0}]
[{"$f":"$C$1&\".E30A.REM.IBUS.OS._INT.12.1_13_PERCT.TTL\"","v":{"$error":"#N/A"}},{"$f":"ROUND(PAGE6!$P$67,5)","v":0},{"$f":"ROUND(PAGE6!$R$67,5)","v":0}]
[{"$f":"$C$1&\".E30A.REM.FR.IBUS.OS._INT.13.1_14_PERCT\"","v":{"$error":"#N/A"}},{"$f":"ROUND(PAGE6!$C$68,5)","v":0},{"$f":"ROUND(PAGE6!$E$68,5)","v":0}]
[{"$f":"$C$1&\".E30A.REM.VAR.IBUS.OS._INT.13.1_14_PERCT\"","v":{"$error":"#N/A"}},{"$f":"ROUND(PAGE6!$G$68,5)","v":0},{"$f":"ROUND(PAGE6!$I$68,5)","v":0}]
[{"$f":"$C$1&\".E30A.REM.ADJ.IBUS.OS._INT.13.1_14_PERCT\"","v":{"$error":"#N/A"}},{"$f":"ROUND(PAGE6!$K$68,5)","v":0},{"$f":"ROUND(PAGE6!$M$68,5)","v":0}]
[{"$f":"$C$1&\".E30A.REM.IBUS.OS._INT.13.1_14_PERCT.TTL\"","v":{"$error":"#N/A"}},{"$f":"ROUND(PAGE6!$P$68,5)","v":0},{"$f":"ROUND(PAGE6!$R$68,5)","v":0}]
[{"$f":"$C$1&\".E30A.REM.FR.IBUS.OS._INT.14.1_15_PERCT\"","v":{"$error":"#N/A"}},{"$f":"ROUND(PAGE6!$C$69,5)","v":0},{"$f":"ROUND(PAGE6!$E$69,5)","v":0}]
[{"$f":"$C$1&\".E30A.REM.VAR.IBUS.OS._INT.14.1_15_PERCT\"","v":{"$error":"#N/A"}},{"$f":"ROUND(PAGE6!$G$69,5)","v":0},{"$f":"ROUND(PAGE6!$I$69,5)","v":0}]
[{"$f":"$C$1&\".E30A.REM.ADJ.IBUS.OS._INT.14.1_15_PERCT\"","v":{"$error":"#N/A"}},{"$f":"ROUND(PAGE6!$K$69,5)","v":0},{"$f":"ROUND(PAGE6!$M$69,5)","v":0}]
[{"$f":"$C$1&\".E30A.REM.IBUS.OS._INT.14.1_15_PERCT.TTL\"","v":{"$error":"#N/A"}},{"$f":"ROUND(PAGE6!$P$69,5)","v":0},{"$f":"ROUND(PAGE6!$R$69,5)","v":0}]
[{"$f":"$C$1&\".E30A.REM.FR.IBUS.OS._INT.OVR_15.1_PERCT\"","v":{"$error":"#N/A"}},{"$f":"ROUND(PAGE6!$C$70,5)","v":0},{"$f":"ROUND(PAGE6!$E$70,5)","v":0}]
[{"$f":"$C$1&\".E30A.REM.VAR.IBUS.OS._INT.OVR_15.1_PERCT\"","v":{"$error":"#N/A"}},{"$f":"ROUND(PAGE6!$G$70,5)","v":0},{"$f":"ROUND(PAGE6!$I$70,5)","v":0}]
[{"$f":"$C$1&\".E30A.REM.ADJ.IBUS.OS._INT.OVR_15.1_PERCT\"","v":{"$error":"#N/A"}},{"$f":"ROUND(PAGE6!$K$70,5)","v":0},{"$f":"ROUND(PAGE6!$M$70,5)","v":0}]
[{"$f":"$C$1&\".E30A.REM.IBUS.OS._INT.OVR_15.1_PERCT.TTL\"","v":{"$error":"#N/A"}},{"$f":"ROUND(PAGE6!$P$70,5)","v":0},{"$f":"ROUND(PAGE6!$R$70,5)","v":0}]
[{"$f":"$C$1&\".E30A.REM.IBUS.OS.TTL.\"","v":{"$error":"#N/A"}},{"$f":"ROUND(PAGE6!P72,5)","v":0},{"$f":"ROUND(PAGE6!R72,5)","v":0}]
[{"$f":"$C$1&\".E30A.REM.FR.UIBUS.OS._INT.0_3_PERCT\"","v":{"$error":"#N/A"}},{"$f":"ROUND(PAGE6!$C$76,5)","v":0},{"$f":"ROUND(PAGE6!$E$76,5)","v":0}]
[{"$f":"$C$1&\".E30A.REM.VAR.UIBUS.OS._INT.0_3_PERCT\"","v":{"$error":"#N/A"}},{"$f":"ROUND(PAGE6!$G$76,5)","v":0},{"$f":"ROUND(PAGE6!$I$76,5)","v":0}]
[{"$f":"$C$1&\".E30A.REM.ADJ.UIBUS.OS._INT.0_3_PERCT\"","v":{"$error":"#N/A"}},{"$f":"ROUND(PAGE6!$K$76,5)","v":0},{"$f":"ROUND(PAGE6!$M$76,5)","v":0}]
[{"$f":"$C$1&\".E30A.REM.UIBUS.OS._INT.0_3_PERCT.TTL\"","v":{"$error":"#N/A"}},{"$f":"ROUND(PAGE6!$P$76,5)","v":0},{"$f":"ROUND(PAGE6!$R$76,5)","v":0}]
[{"$f":"$C$1&\".E30A.REM.FR.UIBUS.OS._INT.3.1_4_PERCT\"","v":{"$error":"#N/A"}},{"$f":"ROUND(PAGE6!$C$77,5)","v":0},{"$f":"ROUND(PAGE6!$E$77,5)","v":0}]
[{"$f":"$C$1&\".E30A.REM.VAR.UIBUS.OS._INT.3.1_4_PERCT\"","v":{"$error":"#N/A"}},{"$f":"ROUND(PAGE6!$G$77,5)","v":0},{"$f":"ROUND(PAGE6!$I$77,5)","v":0}]
[{"$f":"$C$1&\".E30A.REM.ADJ.UIBUS.OS._INT.3.1_4_PERCT\"","v":{"$error":"#N/A"}},{"$f":"ROUND(PAGE6!$K$77,5)","v":0},{"$f":"ROUND(PAGE6!$M$77,5)","v":0}]
[{"$f":"$C$1&\".E30A.REM.UIBUS.OS._INT.3.1_4_PERCT.TTL\"","v":{"$error":"#N/A"}},{"$f":"ROUND(PAGE6!$P$77,5)","v":0},{"$f":"ROUND(PAGE6!$R$77,5)","v":0}]
[{"$f":"$C$1&\".E30A.REM.FR.UIBUS.OS._INT.4.1_5_PERCT\"","v":{"$error":"#N/A"}},{"$f":"ROUND(PAGE6!$C$78,5)","v":0},{"$f":"ROUND(PAGE6!$E$78,5)","v":0}]
[{"$f":"$C$1&\".E30A.REM.VAR.UIBUS.OS._INT.4.1_5_PERCT\"","v":{"$error":"#N/A"}},{"$f":"ROUND(PAGE6!$G$78,5)","v":0},{"$f":"ROUND(PAGE6!$I$78,5)","v":0}]
[{"$f":"$C$1&\".E30A.REM.ADJ.UIBUS.OS._INT.4.1_5_PERCT\"","v":{"$error":"#N/A"}},{"$f":"ROUND(PAGE6!$K$78,5)","v":0},{"$f":"ROUND(PAGE6!$M$78,5)","v":0}]
[{"$f":"$C$1&\".E30A.REM.UIBUS.OS._INT.4.1_5_PERCT.TTL\"","v":{"$error":"#N/A"}},{"$f":"ROUND(PAGE6!$P$78,5)","v":0},{"$f":"ROUND(PAGE6!$R$78,5)","v":0}]
[{"$f":"$C$1&\".E30A.REM.FR.UIBUS.OS._INT.5.1_6_PERCT\"","v":{"$error":"#N/A"}},{"$f":"ROUND(PAGE6!$C$79,5)","v":0},{"$f":"ROUND(PAGE6!$E$79,5)","v":0}]
[{"$f":"$C$1&\".E30A.REM.VAR.UIBUS.OS._INT.5.1_6_PERCT\"","v":{"$error":"#N/A"}},{"$f":"ROUND(PAGE6!$G$79,5)","v":0},{"$f":"ROUND(PAGE6!$I$79,5)","v":0}]
[{"$f":"$C$1&\".E30A.REM.ADJ.UIBUS.OS._INT.5.1_6_PERCT\"","v":{"$error":"#N/A"}},{"$f":"ROUND(PAGE6!$K$79,5)","v":0},{"$f":"ROUND(PAGE6!$M$79,5)","v":0}]
[{"$f":"$C$1&\".E30A.REM.UIBUS.OS._INT.5.1_6_PERCT.TTL\"","v":{"$error":"#N/A"}},{"$f":"ROUND(PAGE6!$P$79,5)","v":0},{"$f":"ROUND(PAGE6!$R$79,5)","v":0}]
[{"$f":"$C$1&\".E30A.REM.FR.UIBUS.OS._INT.6.1_7_PERCT\"","v":{"$error":"#N/A"}},{"$f":"ROUND(PAGE6!$C$80,5)","v":0},{"$f":"ROUND(PAGE6!$E$80,5)","v":0}]
[{"$f":"$C$1&\".E30A.REM.VAR.UIBUS.OS._INT.6.1_7_PERCT\"","v":{"$error":"#N/A"}},{"$f":"ROUND(PAGE6!$G$80,5)","v":0},{"$f":"ROUND(PAGE6!$I$80,5)","v":0}]
[{"$f":"$C$1&\".E30A.REM.ADJ.UIBUS.OS._INT.6.1_7_PERCT\"","v":{"$error":"#N/A"}},{"$f":"ROUND(PAGE6!$K$80,5)","v":0},{"$f":"ROUND(PAGE6!$M$80,5)","v":0}]
[{"$f":"$C$1&\".E30A.REM.UIBUS.OS._INT.6.1_7_PERCT.TTL\"","v":{"$error":"#N/A"}},{"$f":"ROUND(PAGE6!$P$80,5)","v":0},{"$f":"ROUND(PAGE6!$R$80,5)","v":0}]
[{"$f":"$C$1&\".E30A.REM.FR.UIBUS.OS._INT.7.1_8_PERCT\"","v":{"$error":"#N/A"}},{"$f":"ROUND(PAGE6!$C$81,5)","v":0},{"$f":"ROUND(PAGE6!$E$81,5)","v":0}]
[{"$f":"$C$1&\".E30A.REM.VAR.UIBUS.OS._INT.7.1_8_PERCT\"","v":{"$error":"#N/A"}},{"$f":"ROUND(PAGE6!$G$81,5)","v":0},{"$f":"ROUND(PAGE6!$I$81,5)","v":0}]
[{"$f":"$C$1&\".E30A.REM.ADJ.UIBUS.OS._INT.7.1_8_PERCT\"","v":{"$error":"#N/A"}},{"$f":"ROUND(PAGE6!$K$81,5)","v":0},{"$f":"ROUND(PAGE6!$M$81,5)","v":0}]
[{"$f":"$C$1&\".E30A.REM.UIBUS.OS._INT.7.1_8_PERCT.TTL\"","v":{"$error":"#N/A"}},{"$f":"ROUND(PAGE6!$P$81,5)","v":0},{"$f":"ROUND(PAGE6!$R$81,5)","v":0}]
[{"$f":"$C$1&\".E30A.REM.FR.UIBUS.OS._INT.8.1_9_PERCT\"","v":{"$error":"#N/A"}},{"$f":"ROUND(PAGE6!$C$82,5)","v":0},{"$f":"ROUND(PAGE6!$E$82,5)","v":0}]
[{"$f":"$C$1&\".E30A.REM.VAR.UIBUS.OS._INT.8.1_9_PERCT\"","v":{"$error":"#N/A"}},{"$f":"ROUND(PAGE6!$G$82,5)","v":0},{"$f":"ROUND(PAGE6!$I$82,5)","v":0}]
[{"$f":"$C$1&\".E30A.REM.ADJ.UIBUS.OS._INT.8.1_9_PERCT\"","v":{"$error":"#N/A"}},{"$f":"ROUND(PAGE6!$K$82,5)","v":0},{"$f":"ROUND(PAGE6!$M$82,5)","v":0}]
[{"$f":"$C$1&\".E30A.REM.UIBUS.OS._INT.8.1_9_PERCT.TTL\"","v":{"$error":"#N/A"}},{"$f":"ROUND(PAGE6!$P$82,5)","v":0},{"$f":"ROUND(PAGE6!$R$82,5)","v":0}]
[{"$f":"$C$1&\".E30A.REM.FR.UIBUS.OS._INT.9.1_10_PERCT\"","v":{"$error":"#N/A"}},{"$f":"ROUND(PAGE6!$C$83,5)","v":0},{"$f":"ROUND(PAGE6!$E$83,5)","v":0}]
[{"$f":"$C$1&\".E30A.REM.VAR.UIBUS.OS._INT.9.1_10_PERCT\"","v":{"$error":"#N/A"}},{"$f":"ROUND(PAGE6!$G$83,5)","v":0},{"$f":"ROUND(PAGE6!$I$83,5)","v":0}]
[{"$f":"$C$1&\".E30A.REM.ADJ.UIBUS.OS._INT.9.1_10_PERCT\"","v":{"$error":"#N/A"}},{"$f":"ROUND(PAGE6!$K$83,5)","v":0},{"$f":"ROUND(PAGE6!$M$83,5)","v":0}]
[{"$f":"$C$1&\".E30A.REM.UIBUS.OS._INT.9.1_10_PERCT.TTL\"","v":{"$error":"#N/A"}},{"$f":"ROUND(PAGE6!$P$83,5)","v":0},{"$f":"ROUND(PAGE6!$R$83,5)","v":0}]
[{"$f":"$C$1&\".E30A.REM.FR.UIBUS.OS._INT.10.1_11_PERCT\"","v":{"$error":"#N/A"}},{"$f":"ROUND(PAGE6!$C$84,5)","v":0},{"$f":"ROUND(PAGE6!$E$84,5)","v":0}]
[{"$f":"$C$1&\".E30A.REM.VAR.UIBUS.OS._INT.10.1_11_PERCT\"","v":{"$error":"#N/A"}},{"$f":"ROUND(PAGE6!$G$84,5)","v":0},{"$f":"ROUND(PAGE6!$I$84,5)","v":0}]
[{"$f":"$C$1&\".E30A.REM.ADJ.UIBUS.OS._INT.10.1_11_PERCT\"","v":{"$error":"#N/A"}},{"$f":"ROUND(PAGE6!$K$84,5)","v":0},{"$f":"ROUND(PAGE6!$M$84,5)","v":0}]
[{"$f":"$C$1&\".E30A.REM.UIBUS.OS._INT.10.1_11_PERCT.TTL\"","v":{"$error":"#N/A"}},{"$f":"ROUND(PAGE6!$P$84,5)","v":0},{"$f":"ROUND(PAGE6!$R$84,5)","v":0}]
[{"$f":"$C$1&\".E30A.REM.FR.UIBUS.OS._INT.11.1_12_PERCT\"","v":{"$error":"#N/A"}},{"$f":"ROUND(PAGE6!$C$85,5)","v":0},{"$f":"ROUND(PAGE6!$E$85,5)","v":0}]
[{"$f":"$C$1&\".E30A.REM.VAR.UIBUS.OS._INT.11.1_12_PERCT\"","v":{"$error":"#N/A"}},{"$f":"ROUND(PAGE6!$G$85,5)","v":0},{"$f":"ROUND(PAGE6!$I$85,5)","v":0}]
[{"$f":"$C$1&\".E30A.REM.ADJ.UIBUS.OS._INT.11.1_12_PERCT\"","v":{"$error":"#N/A"}},{"$f":"ROUND(PAGE6!$K$85,5)","v":0},{"$f":"ROUND(PAGE6!$M$85,5)","v":0}]
[{"$f":"$C$1&\".E30A.REM.UIBUS.OS._INT.11.1_12_PERCT.TTL\"","v":{"$error":"#N/A"}},{"$f":"ROUND(PAGE6!$P$85,5)","v":0},{"$f":"ROUND(PAGE6!$R$85,5)","v":0}]
[{"$f":"$C$1&\".E30A.REM.FR.UIBUS.OS._INT.12.1_13_PERCT\"","v":{"$error":"#N/A"}},{"$f":"ROUND(PAGE6!$C$86,5)","v":0},{"$f":"ROUND(PAGE6!$E$86,5)","v":0}]
[{"$f":"$C$1&\".E30A.REM.VAR.UIBUS.OS._INT.12.1_13_PERCT\"","v":{"$error":"#N/A"}},{"$f":"ROUND(PAGE6!$G$86,5)","v":0},{"$f":"ROUND(PAGE6!$I$86,5)","v":0}]
[{"$f":"$C$1&\".E30A.REM.ADJ.UIBUS.OS._INT.12.1_13_PERCT\"","v":{"$error":"#N/A"}},{"$f":"ROUND(PAGE6!$K$86,5)","v":0},{"$f":"ROUND(PAGE6!$M$86,5)","v":0}]
[{"$f":"$C$1&\".E30A.REM.UIBUS.OS._INT.12.1_13_PERCT.TTL\"","v":{"$error":"#N/A"}},{"$f":"ROUND(PAGE6!$P$86,5)","v":0},{"$f":"ROUND(PAGE6!$R$86,5)","v":0}]
[{"$f":"$C$1&\".E30A.REM.FR.UIBUS.OS._INT.13.1_14_PERCT\"","v":{"$error":"#N/A"}},{"$f":"ROUND(PAGE6!$C$87,5)","v":0},{"$f":"ROUND(PAGE6!$E$87,5)","v":0}]
[{"$f":"$C$1&\".E30A.REM.VAR.UIBUS.OS._INT.13.1_14_PERCT\"","v":{"$error":"#N/A"}},{"$f":"ROUND(PAGE6!$G$87,5)","v":0},{"$f":"ROUND(PAGE6!$I$87,5)","v":0}]
[{"$f":"$C$1&\".E30A.REM.ADJ.UIBUS.OS._INT.13.1_14_PERCT\"","v":{"$error":"#N/A"}},{"$f":"ROUND(PAGE6!$K$87,5)","v":0},{"$f":"ROUND(PAGE6!$M$87,5)","v":0}]
[{"$f":"$C$1&\".E30A.REM.UIBUS.OS._INT.13.1_14_PERCT.TTL\"","v":{"$error":"#N/A"}},{"$f":"ROUND(PAGE6!$P$87,5)","v":0},{"$f":"ROUND(PAGE6!$R$87,5)","v":0}]
[{"$f":"$C$1&\".E30A.REM.FR.UIBUS.OS._INT.14.1_15_PERCT\"","v":{"$error":"#N/A"}},{"$f":"ROUND(PAGE6!$C$88,5)","v":0},{"$f":"ROUND(PAGE6!$E$88,5)","v":0}]
[{"$f":"$C$1&\".E30A.REM.VAR.UIBUS.OS._INT.14.1_15_PERCT\"","v":{"$error":"#N/A"}},{"$f":"ROUND(PAGE6!$G$88,5)","v":0},{"$f":"ROUND(PAGE6!$I$88,5)","v":0}]
[{"$f":"$C$1&\".E30A.REM.ADJ.UIBUS.OS._INT.14.1_15_PERCT\"","v":{"$error":"#N/A"}},{"$f":"ROUND(PAGE6!$K$88,5)","v":0},{"$f":"ROUND(PAGE6!$M$88,5)","v":0}]
[{"$f":"$C$1&\".E30A.REM.UIBUS.OS._INT.14.1_15_PERCT.TTL\"","v":{"$error":"#N/A"}},{"$f":"ROUND(PAGE6!$P$88,5)","v":0},{"$f":"ROUND(PAGE6!$R$88,5)","v":0}]
[{"$f":"$C$1&\".E30A.REM.FR.UIBUS.OS._INT.OVR_15.1_PERCT\"","v":{"$error":"#N/A"}},{"$f":"ROUND(PAGE6!$C$89,5)","v":0},{"$f":"ROUND(PAGE6!$E$89,5)","v":0}]
[{"$f":"$C$1&\".E30A.REM.VAR.UIBUS.OS._INT.OVR_15.1_PERCT\"","v":{"$error":"#N/A"}},{"$f":"ROUND(PAGE6!$G$89,5)","v":0},{"$f":"ROUND(PAGE6!$I$89,5)","v":0}]
[{"$f":"$C$1&\".E30A.REM.ADJ.UIBUS.OS._INT.OVR_15.1_PERCT\"","v":{"$error":"#N/A"}},{"$f":"ROUND(PAGE6!$K$89,5)","v":0},{"$f":"ROUND(PAGE6!$M$89,5)","v":0}]
[{"$f":"$C$1&\".E30A.REM.UIBUS.OS._INT.OVR_15.1_PERCT.TTL\"","v":{"$error":"#N/A"}},{"$f":"ROUND(PAGE6!$P$89,5)","v":0},{"$f":"ROUND(PAGE6!$R$89,5)","v":0}]
[{"$f":"$C$1&\".E30A.REM.UIBUS.OS.TTL.\"","v":{"$error":"#N/A"}},{"$f":"ROUND(PAGE6!P91,5)","v":0},{"$f":"ROUND(PAGE6!R91,5)","v":0}]
[{"$f":"$C$1&\".E30A.REM.FR.CONSM.OS._INT.0_3_PERCT\"","v":{"$error":"#N/A"}},{"$f":"ROUND(PAGE6!$C$94,5)","v":0},{"$f":"ROUND(PAGE6!$E$94,5)","v":0}]
[{"$f":"$C$1&\".E30A.REM.VAR.CONSM.OS._INT.0_3_PERCT\"","v":{"$error":"#N/A"}},{"$f":"ROUND(PAGE6!$G$94,5)","v":0},{"$f":"ROUND(PAGE6!$I$94,5)","v":0}]
[{"$f":"$C$1&\".E30A.REM.ADJ.CONSM.OS._INT.0_3_PERCT\"","v":{"$error":"#N/A"}},{"$f":"ROUND(PAGE6!$K$94,5)","v":0},{"$f":"ROUND(PAGE6!$M$94,5)","v":0}]
[{"$f":"$C$1&\".E30A.REM.CONSM.OS._INT.0_3_PERCT.TTL\"","v":{"$error":"#N/A"}},{"$f":"ROUND(PAGE6!$P$94,5)","v":0},{"$f":"ROUND(PAGE6!$R$94,5)","v":0}]
[{"$f":"$C$1&\".E30A.REM.FR.CONSM.OS._INT.3.1_4_PERCT\"","v":{"$error":"#N/A"}},{"$f":"ROUND(PAGE6!$C$95,5)","v":0},{"$f":"ROUND(PAGE6!$E$95,5)","v":0}]
[{"$f":"$C$1&\".E30A.REM.VAR.CONSM.OS._INT.3.1_4_PERCT\"","v":{"$error":"#N/A"}},{"$f":"ROUND(PAGE6!$G$95,5)","v":0},{"$f":"ROUND(PAGE6!$I$95,5)","v":0}]
[{"$f":"$C$1&\".E30A.REM.ADJ.CONSM.OS._INT.3.1_4_PERCT\"","v":{"$error":"#N/A"}},{"$f":"ROUND(PAGE6!$K$95,5)","v":0},{"$f":"ROUND(PAGE6!$M$95,5)","v":0}]
[{"$f":"$C$1&\".E30A.REM.CONSM.OS._INT.3.1_4_PERCT.TTL\"","v":{"$error":"#N/A"}},{"$f":"ROUND(PAGE6!$P$95,5)","v":0},{"$f":"ROUND(PAGE6!$R$95,5)","v":0}]
[{"$f":"$C$1&\".E30A.REM.FR.CONSM.OS._INT.4.1_5_PERCT\"","v":{"$error":"#N/A"}},{"$f":"ROUND(PAGE6!$C$96,5)","v":0},{"$f":"ROUND(PAGE6!$E$96,5)","v":0}]
[{"$f":"$C$1&\".E30A.REM.VAR.CONSM.OS._INT.4.1_5_PERCT\"","v":{"$error":"#N/A"}},{"$f":"ROUND(PAGE6!$G$96,5)","v":0},{"$f":"ROUND(PAGE6!$I$96,5)","v":0}]
[{"$f":"$C$1&\".E30A.REM.ADJ.CONSM.OS._INT.4.1_5_PERCT\"","v":{"$error":"#N/A"}},{"$f":"ROUND(PAGE6!$K$96,5)","v":0},{"$f":"ROUND(PAGE6!$M$96,5)","v":0}]
[{"$f":"$C$1&\".E30A.REM.CONSM.OS._INT.4.1_5_PERCT.TTL\"","v":{"$error":"#N/A"}},{"$f":"ROUND(PAGE6!$P$96,5)","v":0},{"$f":"ROUND(PAGE6!$R$96,5)","v":0}]
[{"$f":"$C$1&\".E30A.REM.FR.CONSM.OS._INT.5.1_6_PERCT\"","v":{"$error":"#N/A"}},{"$f":"ROUND(PAGE6!$C$97,5)","v":0},{"$f":"ROUND(PAGE6!$E$97,5)","v":0}]
[{"$f":"$C$1&\".E30A.REM.VAR.CONSM.OS._INT.5.1_6_PERCT\"","v":{"$error":"#N/A"}},{"$f":"ROUND(PAGE6!$G$97,5)","v":0},{"$f":"ROUND(PAGE6!$I$97,5)","v":0}]
[{"$f":"$C$1&\".E30A.REM.ADJ.CONSM.OS._INT.5.1_6_PERCT\"","v":{"$error":"#N/A"}},{"$f":"ROUND(PAGE6!$K$97,5)","v":0},{"$f":"ROUND(PAGE6!$M$97,5)","v":0}]
[{"$f":"$C$1&\".E30A.REM.CONSM.OS._INT.5.1_6_PERCT.TTL\"","v":{"$error":"#N/A"}},{"$f":"ROUND(PAGE6!$P$97,5)","v":0},{"$f":"ROUND(PAGE6!$R$97,5)","v":0}]
[{"$f":"$C$1&\".E30A.REM.FR.CONSM.OS._INT.6.1_7_PERCT\"","v":{"$error":"#N/A"}},{"$f":"ROUND(PAGE6!$C$98,5)","v":0},{"$f":"ROUND(PAGE6!$E$98,5)","v":0}]
[{"$f":"$C$1&\".E30A.REM.VAR.CONSM.OS._INT.6.1_7_PERCT\"","v":{"$error":"#N/A"}},{"$f":"ROUND(PAGE6!$G$98,5)","v":0},{"$f":"ROUND(PAGE6!$I$98,5)","v":0}]
[{"$f":"$C$1&\".E30A.REM.ADJ.CONSM.OS._INT.6.1_7_PERCT\"","v":{"$error":"#N/A"}},{"$f":"ROUND(PAGE6!$K$98,5)","v":0},{"$f":"ROUND(PAGE6!$M$98,5)","v":0}]
[{"$f":"$C$1&\".E30A.REM.CONSM.OS._INT.6.1_7_PERCT.TTL\"","v":{"$error":"#N/A"}},{"$f":"ROUND(PAGE6!$P$98,5)","v":0},{"$f":"ROUND(PAGE6!$R$98,5)","v":0}]
[{"$f":"$C$1&\".E30A.REM.FR.CONSM.OS._INT.7.1_8_PERCT\"","v":{"$error":"#N/A"}},{"$f":"ROUND(PAGE6!$C$99,5)","v":0},{"$f":"ROUND(PAGE6!$E$99,5)","v":0}]
[{"$f":"$C$1&\".E30A.REM.VAR.CONSM.OS._INT.7.1_8_PERCT\"","v":{"$error":"#N/A"}},{"$f":"ROUND(PAGE6!$G$99,5)","v":0},{"$f":"ROUND(PAGE6!$I$99,5)","v":0}]
[{"$f":"$C$1&\".E30A.REM.ADJ.CONSM.OS._INT.7.1_8_PERCT\"","v":{"$error":"#N/A"}},{"$f":"ROUND(PAGE6!$K$99,5)","v":0},{"$f":"ROUND(PAGE6!$M$99,5)","v":0}]
[{"$f":"$C$1&\".E30A.REM.CONSM.OS._INT.7.1_8_PERCT.TTL\"","v":{"$error":"#N/A"}},{"$f":"ROUND(PAGE6!$P$99,5)","v":0},{"$f":"ROUND(PAGE6!$R$99,5)","v":0}]
[{"$f":"$C$1&\".E30A.REM.FR.CONSM.OS._INT.8.1_9_PERCT\"","v":{"$error":"#N/A"}},{"$f":"ROUND(PAGE6!$C$100,5)","v":0},{"$f":"ROUND(PAGE6!$E$100,5)","v":0}]
[{"$f":"$C$1&\".E30A.REM.VAR.CONSM.OS._INT.8.1_9_PERCT\"","v":{"$error":"#N/A"}},{"$f":"ROUND(PAGE6!$G$100,5)","v":0},{"$f":"ROUND(PAGE6!$I$100,5)","v":0}]
[{"$f":"$C$1&\".E30A.REM.ADJ.CONSM.OS._INT.8.1_9_PERCT\"","v":{"$error":"#N/A"}},{"$f":"ROUND(PAGE6!$K$100,5)","v":0},{"$f":"ROUND(PAGE6!$M$100,5)","v":0}]
[{"$f":"$C$1&\".E30A.REM.CONSM.OS._INT.8.1_9_PERCT.TTL\"","v":{"$error":"#N/A"}},{"$f":"ROUND(PAGE6!$P$100,5)","v":0},{"$f":"ROUND(PAGE6!$R$100,5)","v":0}]
[{"$f":"$C$1&\".E30A.REM.FR.CONSM.OS._INT.9.1_10_PERCT\"","v":{"$error":"#N/A"}},{"$f":"ROUND(PAGE6!$C$101,5)","v":0},{"$f":"ROUND(PAGE6!$E$101,5)","v":0}]
[{"$f":"$C$1&\".E30A.REM.VAR.CONSM.OS._INT.9.1_10_PERCT\"","v":{"$error":"#N/A"}},{"$f":"ROUND(PAGE6!$G$101,5)","v":0},{"$f":"ROUND(PAGE6!$I$101,5)","v":0}]
[{"$f":"$C$1&\".E30A.REM.ADJ.CONSM.OS._INT.9.1_10_PERCT\"","v":{"$error":"#N/A"}},{"$f":"ROUND(PAGE6!$K$101,5)","v":0},{"$f":"ROUND(PAGE6!$M$101,5)","v":0}]
[{"$f":"$C$1&\".E30A.REM.CONSM.OS._INT.9.1_10_PERCT.TTL\"","v":{"$error":"#N/A"}},{"$f":"ROUND(PAGE6!$P$101,5)","v":0},{"$f":"ROUND(PAGE6!$R$101,5)","v":0}]
[{"$f":"$C$1&\".E30A.REM.FR.CONSM.OS._INT.10.1_11_PERCT\"","v":{"$error":"#N/A"}},{"$f":"ROUND(PAGE6!$C$102,5)","v":0},{"$f":"ROUND(PAGE6!$E$102,5)","v":0}]
[{"$f":"$C$1&\".E30A.REM.VAR.CONSM.OS._INT.10.1_11_PERCT\"","v":{"$error":"#N/A"}},{"$f":"ROUND(PAGE6!$G$102,5)","v":0},{"$f":"ROUND(PAGE6!$I$102,5)","v":0}]
[{"$f":"$C$1&\".E30A.REM.ADJ.CONSM.OS._INT.10.1_11_PERCT\"","v":{"$error":"#N/A"}},{"$f":"ROUND(PAGE6!$K$102,5)","v":0},{"$f":"ROUND(PAGE6!$M$102,5)","v":0}]
[{"$f":"$C$1&\".E30A.REM.CONSM.OS._INT.10.1_11_PERCT.TTL\"","v":{"$error":"#N/A"}},{"$f":"ROUND(PAGE6!$P$102,5)","v":0},{"$f":"ROUND(PAGE6!$R$102,5)","v":0}]
[{"$f":"$C$1&\".E30A.REM.FR.CONSM.OS._INT.11.1_12_PERCT\"","v":{"$error":"#N/A"}},{"$f":"ROUND(PAGE6!$C$103,5)","v":0},{"$f":"ROUND(PAGE6!$E$103,5)","v":0}]
[{"$f":"$C$1&\".E30A.REM.VAR.CONSM.OS._INT.11.1_12_PERCT\"","v":{"$error":"#N/A"}},{"$f":"ROUND(PAGE6!$G$103,5)","v":0},{"$f":"ROUND(PAGE6!$I$103,5)","v":0}]
[{"$f":"$C$1&\".E30A.REM.ADJ.CONSM.OS._INT.11.1_12_PERCT\"","v":{"$error":"#N/A"}},{"$f":"ROUND(PAGE6!$K$103,5)","v":0},{"$f":"ROUND(PAGE6!$M$103,5)","v":0}]
[{"$f":"$C$1&\".E30A.REM.CONSM.OS._INT.11.1_12_PERCT.TTL\"","v":{"$error":"#N/A"}},{"$f":"ROUND(PAGE6!$P$103,5)","v":0},{"$f":"ROUND(PAGE6!$R$103,5)","v":0}]
[{"$f":"$C$1&\".E30A.REM.FR.CONSM.OS._INT.12.1_13_PERCT\"","v":{"$error":"#N/A"}},{"$f":"ROUND(PAGE6!$C$104,5)","v":0},{"$f":"ROUND(PAGE6!$E$104,5)","v":0}]
[{"$f":"$C$1&\".E30A.REM.VAR.CONSM.OS._INT.12.1_13_PERCT\"","v":{"$error":"#N/A"}},{"$f":"ROUND(PAGE6!$G$104,5)","v":0},{"$f":"ROUND(PAGE6!$I$104,5)","v":0}]
[{"$f":"$C$1&\".E30A.REM.ADJ.CONSM.OS._INT.12.1_13_PERCT\"","v":{"$error":"#N/A"}},{"$f":"ROUND(PAGE6!$K$104,5)","v":0},{"$f":"ROUND(PAGE6!$M$104,5)","v":0}]
[{"$f":"$C$1&\".E30A.REM.CONSM.OS._INT.12.1_13_PERCT.TTL\"","v":{"$error":"#N/A"}},{"$f":"ROUND(PAGE6!$P$104,5)","v":0},{"$f":"ROUND(PAGE6!$R$104,5)","v":0}]
[{"$f":"$C$1&\".E30A.REM.FR.CONSM.OS._INT.13.1_14_PERCT\"","v":{"$error":"#N/A"}},{"$f":"ROUND(PAGE6!$C$105,5)","v":0},{"$f":"ROUND(PAGE6!$E$105,5)","v":0}]
[{"$f":"$C$1&\".E30A.REM.VAR.CONSM.OS._INT.13.1_14_PERCT\"","v":{"$error":"#N/A"}},{"$f":"ROUND(PAGE6!$G$105,5)","v":0},{"$f":"ROUND(PAGE6!$I$105,5)","v":0}]
[{"$f":"$C$1&\".E30A.REM.ADJ.CONSM.OS._INT.13.1_14_PERCT\"","v":{"$error":"#N/A"}},{"$f":"ROUND(PAGE6!$K$105,5)","v":0},{"$f":"ROUND(PAGE6!$M$105,5)","v":0}]
[{"$f":"$C$1&\".E30A.REM.CONSM.OS._INT.13.1_14_PERCT.TTL\"","v":{"$error":"#N/A"}},{"$f":"ROUND(PAGE6!$P$105,5)","v":0},{"$f":"ROUND(PAGE6!$R$105,5)","v":0}]
[{"$f":"$C$1&\".E30A.REM.FR.CONSM.OS._INT.14.1_15_PERCT\"","v":{"$error":"#N/A"}},{"$f":"ROUND(PAGE6!$C$106,5)","v":0},{"$f":"ROUND(PAGE6!$E$106,5)","v":0}]
[{"$f":"$C$1&\".E30A.REM.VAR.CONSM.OS._INT.14.1_15_PERCT\"","v":{"$error":"#N/A"}},{"$f":"ROUND(PAGE6!$G$106,5)","v":0},{"$f":"ROUND(PAGE6!$I$106,5)","v":0}]
[{"$f":"$C$1&\".E30A.REM.ADJ.CONSM.OS._INT.14.1_15_PERCT\"","v":{"$error":"#N/A"}},{"$f":"ROUND(PAGE6!$K$106,5)","v":0},{"$f":"ROUND(PAGE6!$M$106,5)","v":0}]
[{"$f":"$C$1&\".E30A.REM.CONSM.OS._INT.14.1_15_PERCT.TTL\"","v":{"$error":"#N/A"}},{"$f":"ROUND(PAGE6!$P$106,5)","v":0},{"$f":"ROUND(PAGE6!$R$106,5)","v":0}]
[{"$f":"$C$1&\".E30A.REM.FR.CONSM.OS._INT.OVR_15.1_PERCT\"","v":{"$error":"#N/A"}},{"$f":"ROUND(PAGE6!$C$107,5)","v":0},{"$f":"ROUND(PAGE6!$E$107,5)","v":0}]
[{"$f":"$C$1&\".E30A.REM.VAR.CONSM.OS._INT.OVR_15.1_PERCT\"","v":{"$error":"#N/A"}},{"$f":"ROUND(PAGE6!$G$107,5)","v":0},{"$f":"ROUND(PAGE6!$I$107,5)","v":0}]
[{"$f":"$C$1&\".E30A.REM.ADJ.CONSM.OS._INT.OVR_15.1_PERCT\"","v":{"$error":"#N/A"}},{"$f":"ROUND(PAGE6!$K$107,5)","v":0},{"$f":"ROUND(PAGE6!$M$107,5)","v":0}]
[{"$f":"$C$1&\".E30A.REM.CONSM.OS._INT.OVR_15.1_PERCT.TTL\"","v":{"$error":"#N/A"}},{"$f":"ROUND(PAGE6!$P$107,5)","v":0},{"$f":"ROUND(PAGE6!$R$107,5)","v":0}]
[{"$f":"$C$1&\".E30A.REM.CONSM.OS.TTL.\"","v":{"$error":"#N/A"}},{"$f":"ROUND(PAGE6!P109,5)","v":0},{"$f":"ROUND(PAGE6!R109,5)","v":0}]
[{"$f":"$C$1&\".E30A.REM.FR.OS.TTL..\"","v":{"$error":"#N/A"}},{"$f":"ROUND(PAGE6!$C$111,5)","v":0},{"$f":"ROUND(PAGE6!$E$111,5)","v":0}]
[{"$f":"$C$1&\".E30A.REM.VAR.OS.TTL..\"","v":{"$error":"#N/A"}},{"$f":"ROUND(PAGE6!$G$111,5)","v":0},{"$f":"ROUND(PAGE6!$I$111,5)","v":0}]
[{"$f":"$C$1&\".E30A.REM.ADJ.OS.TTL..\"","v":{"$error":"#N/A"}},{"$f":"ROUND(PAGE6!$K$111,5)","v":0},{"$f":"ROUND(PAGE6!$M$111,5)","v":0}]
[{"$f":"$C$1&\".E30A.REM.OS.SEC_TYPE.AGG_TTL..\"","v":{"$error":"#N/A"}},{"$f":"ROUND(PAGE6!$P$111,5)","v":0},{"$f":"ROUND(PAGE6!$R$111,5)","v":0}]
["sect9","NUM","VAL"]
[{"$f":"$C$1&\".E30A.REM.FR..PER.5YRS.NEW\"","v":{"$error":"#N/A"}},{"$f":"ROUND(PAGE7!$C$14,5)","v":0},{"$f":"ROUND(PAGE7!$E$14,5)","v":0}]
[{"$f":"$C$1&\".E30A.REM.VAR..PER.5YRS.NEW\"","v":{"$error":"#N/A"}},{"$f":"ROUND(PAGE7!$G$14,5)","v":0},{"$f":"ROUND(PAGE7!$I$14,5)","v":0}]
[{"$f":"$C$1&\".E30A.REM.ADJ..PER.5YRS.NEW\"","v":{"$error":"#N/A"}},{"$f":"ROUND(PAGE7!$K$14,5)","v":0},{"$f":"ROUND(PAGE7!$M$14,5)","v":0}]
[{"$f":"$C$1&\".E30A.REM..PER.5YRS.NEW.TTL\"","v":{"$error":"#N/A"}},{"$f":"ROUND(PAGE7!$P$14,5)","v":0},{"$f":"ROUND(PAGE7!$R$14,5)","v":0}]
[{"$f":"$C$1&\".E30A.REM.FR.PER.5TO10YRS.NEW.\"","v":{"$error":"#N/A"}},{"$f":"ROUND(PAGE7!$C$16,5)","v":0},{"$f":"ROUND(PAGE7!$E$16,5)","v":0}]
[{"$f":"$C$1&\".E30A.REM.VAR.PER.5TO10YRS.NEW.\"","v":{"$error":"#N/A"}},{"$f":"ROUND(PAGE7!$G$16,5)","v":0},{"$f":"ROUND(PAGE7!$I$16,5)","v":0}]
[{"$f":"$C$1&\".E30A.REM.ADJ.PER.5TO10YRS.NEW.\"","v":{"$error":"#N/A"}},{"$f":"ROUND(PAGE7!$K$16,5)","v":0},{"$f":"ROUND(PAGE7!$M$16,5)","v":0}]
[{"$f":"$C$1&\".E30A.REM.PER.5TO10YRS.NEW.TTL.\"","v":{"$error":"#N/A"}},{"$f":"ROUND(PAGE7!$P$16,5)","v":0},{"$f":"ROUND(PAGE7!$R$16,5)","v":0}]
[{"$f":"$C$1&\".E30A.REM.FR.PER.10TO15YRS.NEW.\"","v":{"$error":"#N/A"}},{"$f":"ROUND(PAGE7!$C$18,5)","v":0},{"$f":"ROUND(PAGE7!$E$18,5)","v":0}]
[{"$f":"$C$1&\".E30A.REM.VAR.PER.10TO15YRS.NEW.\"","v":{"$error":"#N/A"}},{"$f":"ROUND(PAGE7!$G$18,5)","v":0},{"$f":"ROUND(PAGE7!$I$18,5)","v":0}]
[{"$f":"$C$1&\".E30A.REM.ADJ.PER.10TO15YRS.NEW.\"","v":{"$error":"#N/A"}},{"$f":"ROUND(PAGE7!$K$18,5)","v":0},{"$f":"ROUND(PAGE7!$M$18,5)","v":0}]
[{"$f":"$C$1&\".E30A.REM.PER.10TO15YRS.NEW.TTL.\"","v":{"$error":"#N/A"}},{"$f":"ROUND(PAGE7!$P$18,5)","v":0},{"$f":"ROUND(PAGE7!$R$18,5)","v":0}]
[{"$f":"$C$1&\".E30A.REM.FR.PER.15TO20YRS.NEW.\"","v":{"$error":"#N/A"}},{"$f":"ROUND(PAGE7!$C$20,5)","v":0},{"$f":"ROUND(PAGE7!$E$20,5)","v":0}]
[{"$f":"$C$1&\".E30A.REM.VAR.PER.15TO20YRS.NEW.\"","v":{"$error":"#N/A"}},{"$f":"ROUND(PAGE7!$G$20,5)","v":0},{"$f":"ROUND(PAGE7!$I$20,5)","v":0}]
[{"$f":"$C$1&\".E30A.REM.ADJ.PER.15TO20YRS.NEW.\"","v":{"$error":"#N/A"}},{"$f":"ROUND(PAGE7!$K$20,5)","v":0},{"$f":"ROUND(PAGE7!$M$20,5)","v":0}]
[{"$f":"$C$1&\".E30A.REM.PER.15TO20YRS.NEW.TTL.\"","v":{"$error":"#N/A"}},{"$f":"ROUND(PAGE7!$P$20,5)","v":0},{"$f":"ROUND(PAGE7!$R$20,5)","v":0}]
[{"$f":"$C$1&\".E30A.REM.FR.PER.20TO25YRS.NEW.\"","v":{"$error":"#N/A"}},{"$f":"ROUND(PAGE7!$C$22,5)","v":0},{"$f":"ROUND(PAGE7!$E$22,5)","v":0}]
[{"$f":"$C$1&\".E30A.REM.VAR.PER.20TO25YRS.NEW.\"","v":{"$error":"#N/A"}},{"$f":"ROUND(PAGE7!$G$22,5)","v":0},{"$f":"ROUND(PAGE7!$I$22,5)","v":0}]
[{"$f":"$C$1&\".E30A.REM.ADJ.PER.20TO25YRS.NEW.\"","v":{"$error":"#N/A"}},{"$f":"ROUND(PAGE7!$K$22,5)","v":0},{"$f":"ROUND(PAGE7!$M$22,5)","v":0}]
[{"$f":"$C$1&\".E30A.REM.PER.20TO25YRS.NEW.TTL.\"","v":{"$error":"#N/A"}},{"$f":"ROUND(PAGE7!$P$22,5)","v":0},{"$f":"ROUND(PAGE7!$R$22,5)","v":0}]
[{"$f":"$C$1&\".E30A.REM.FR.PER.25TO30YRS.NEW.\"","v":{"$error":"#N/A"}},{"$f":"ROUND(PAGE7!$C$24,5)","v":0},{"$f":"ROUND(PAGE7!$E$24,5)","v":0}]
[{"$f":"$C$1&\".E30A.REM.VAR.PER.25TO30YRS.NEW.\"","v":{"$error":"#N/A"}},{"$f":"ROUND(PAGE7!$G$24,5)","v":0},{"$f":"ROUND(PAGE7!$I$24,5)","v":0}]
[{"$f":"$C$1&\".E30A.REM.ADJ.PER.25TO30YRS.NEW.\"","v":{"$error":"#N/A"}},{"$f":"ROUND(PAGE7!$K$24,5)","v":0},{"$f":"ROUND(PAGE7!$M$24,5)","v":0}]
[{"$f":"$C$1&\".E30A.REM.PER.25TO30YRS.NEW.TTL.\"","v":{"$error":"#N/A"}},{"$f":"ROUND(PAGE7!$P$24,5)","v":0},{"$f":"ROUND(PAGE7!$R$24,5)","v":0}]
[{"$f":"$C$1&\".E30A.REM.FR.PER.OVR30YRS.NEW.\"","v":{"$error":"#N/A"}},{"$f":"ROUND(PAGE7!$C$26,5)","v":0},{"$f":"ROUND(PAGE7!$E$26,5)","v":0}]
[{"$f":"$C$1&\".E30A.REM.VAR.PER.OVR30YRS.NEW.\"","v":{"$error":"#N/A"}},{"$f":"ROUND(PAGE7!$G$26,5)","v":0},{"$f":"ROUND(PAGE7!$I$26,5)","v":0}]
[{"$f":"$C$1&\".E30A.REM.ADJ.PER.OVR30YRS.NEW.\"","v":{"$error":"#N/A"}},{"$f":"ROUND(PAGE7!$K$26,5)","v":0},{"$f":"ROUND(PAGE7!$M$26,5)","v":0}]
[{"$f":"$C$1&\".E30A.REM.PER.OVR30YRS.NEW.TTL.\"","v":{"$error":"#N/A"}},{"$f":"ROUND(PAGE7!$P$26,5)","v":0},{"$f":"ROUND(PAGE7!$R$26,5)","v":0}]
[{"$f":"$C$1&\".E30A.REM.FR.PER.MAX_PER.NEW.\"","v":{"$error":"#N/A"}},{"$f":"ROUND(PAGE7!$C$28,5)","v":0},{"$f":"ROUND(PAGE7!$E$28,5)","v":0}]
[{"$f":"$C$1&\".E30A.REM.VAR.PER.MAX_PER.NEW.\"","v":{"$error":"#N/A"}},{"$f":"ROUND(PAGE7!$G$28,5)","v":0},{"$f":"ROUND(PAGE7!$I$28,5)","v":0}]
[{"$f":"$C$1&\".E30A.REM.ADJ.PER.MAX_PER.NEW.\"","v":{"$error":"#N/A"}},{"$f":"ROUND(PAGE7!$K$28,5)","v":0},{"$f":"ROUND(PAGE7!$M$28,5)","v":0}]
[{"$f":"$C$1&\".E30A.REM.PER.MAX_PER.NEW.TTL.\"","v":{"$error":"#N/A"}},{"$f":"ROUND(PAGE7!$P$28,5)","v":0},{"$f":"ROUND(PAGE7!$R$28,5)","v":0}]
[{"$f":"$C$1&\".E30A.REM.FR.PER.UNSPEC.NEW.\"","v":{"$error":"#N/A"}},{"$f":"ROUND(PAGE7!$C$30,5)","v":0},{"$f":"ROUND(PAGE7!$E$30,5)","v":0}]
[{"$f":"$C$1&\".E30A.REM.VAR.PER.UNSPEC.NEW.\"","v":{"$error":"#N/A"}},{"$f":"ROUND(PAGE7!$G$30,5)","v":0},{"$f":"ROUND(PAGE7!$I$30,5)","v":0}]
[{"$f":"$C$1&\".E30A.REM.ADJ.PER.UNSPEC.NEW.\"","v":{"$error":"#N/A"}},{"$f":"ROUND(PAGE7!$K$30,5)","v":0},{"$f":"ROUND(PAGE7!$M$30,5)","v":0}]
[{"$f":"$C$1&\".E30A.REM.PER.UNSPEC.NEW.TTL.\"","v":{"$error":"#N/A"}},{"$f":"ROUND(PAGE7!$P$30,5)","v":0},{"$f":"ROUND(PAGE7!$R$30,5)","v":0}]
[{"$f":"$C$1&\".E30A.REM.FR.NEW.TTL..\"","v":{"$error":"#N/A"}},{"$f":"ROUND(PAGE7!C32,5)","v":0},{"$f":"ROUND(PAGE7!$E$32,5)","v":0}]
[{"$f":"$C$1&\".E30A.REM.VAR.NEW.TTL..\"","v":{"$error":"#N/A"}},{"$f":"ROUND(PAGE7!G32,5)","v":0},{"$f":"ROUND(PAGE7!$I$32,5)","v":0}]
[{"$f":"$C$1&\".E30A.REM.ADJ.NEW.TTL..\"","v":{"$error":"#N/A"}},{"$f":"ROUND(PAGE7!K32,5)","v":0},{"$f":"ROUND(PAGE7!$M$32,5)","v":0}]
["sect10","VAL"]
[{"$f":"$C$1&\".E30A.REM.NEW.AGG_TTL...\"","v":{"$error":"#N/A"}},{"$f":"ROUND(PAGE7!$R$32,5)","v":0}]
["sect11","RATE"]
[{"$f":"$C$1&\".E30A.REM.FR.PBSEC.APPR.L.\"","v":{"$error":"#N/A"}},{"$f":"ROUND(PAGE8!$C$19,5)","v":0}]
[{"$f":"$C$1&\".E30A.REM.FR.PBSEC.APPR.H.\"","v":{"$error":"#N/A"}},{"$f":"ROUND(PAGE8!$E$19,5)","v":0}]
[{"$f":"$C$1&\".E30A.REM.FR.PBSEC.APPR.L.M\"","v":{"$error":"#N/A"}},{"$f":"ROUND(PAGE8!$G$19,5)","v":0}]
[{"$f":"$C$1&\".E30A.REM.FR.PBSEC.APPR.H.M\"","v":{"$error":"#N/A"}},{"$f":"ROUND(PAGE8!$I$19,5)","v":0}]
[{"$f":"$C$1&\".E30A.REM.FR.PBSEC.DISB.L.\"","v":{"$error":"#N/A"}},{"$f":"ROUND(PAGE8!$K$19,5)","v":0}]
[{"$f":"$C$1&\".E30A.REM.FR.PBSEC.DISB.H.\"","v":{"$error":"#N/A"}},{"$f":"ROUND(PAGE8!$M$19,5)","v":0}]
[{"$f":"$C$1&\".E30A.REM.FR.PBSEC.DISB.L.M\"","v":{"$error":"#N/A"}},{"$f":"ROUND(PAGE8!$O$19,5)","v":0}]
[{"$f":"$C$1&\".E30A.REM.FR.PBSEC.DISB.H.M\"","v":{"$error":"#N/A"}},{"$f":"ROUND(PAGE8!$Q$19,5)","v":0}]
[{"$f":"$C$1&\".E30A.REM.FR.PBSEC.OS.L.\"","v":{"$error":"#N/A"}},{"$f":"ROUND(PAGE8!$S$19,5)","v":0}]
[{"$f":"$C$1&\".E30A.REM.FR.PBSEC.OS.H.\"","v":{"$error":"#N/A"}},{"$f":"ROUND(PAGE8!$U$19,5)","v":0}]
[{"$f":"$C$1&\".E30A.REM.FR.PBSEC.OS.L.M\"","v":{"$error":"#N/A"}},{"$f":"ROUND(PAGE8!$W$19,5)","v":0}]
[{"$f":"$C$1&\".E30A.REM.FR.PBSEC.OS.H.M\"","v":{"$error":"#N/A"}},{"$f":"ROUND(PAGE8!$Y$19,5)","v":0}]
[{"$f":"$C$1&\".E30A.REM.FR.PVFIN.APPR.L.\"","v":{"$error":"#N/A"}},{"$f":"ROUND(PAGE8!$C$22,5)","v":0}]
[{"$f":"$C$1&\".E30A.REM.FR.PVFIN.APPR.H.\"","v":{"$error":"#N/A"}},{"$f":"ROUND(PAGE8!$E$22,5)","v":0}]
[{"$f":"$C$1&\".E30A.REM.FR.PVFIN.APPR.L.M\"","v":{"$error":"#N/A"}},{"$f":"ROUND(PAGE8!$G$22,5)","v":0}]
[{"$f":"$C$1&\".E30A.REM.FR.PVFIN.APPR.H.M\"","v":{"$error":"#N/A"}},{"$f":"ROUND(PAGE8!$I$22,5)","v":0}]
[{"$f":"$C$1&\".E30A.REM.FR.PVFIN.DISB.L.\"","v":{"$error":"#N/A"}},{"$f":"ROUND(PAGE8!$K$22,5)","v":0}]
[{"$f":"$C$1&\".E30A.REM.FR.PVFIN.DISB.H.\"","v":{"$error":"#N/A"}},{"$f":"ROUND(PAGE8!$M$22,5)","v":0}]
[{"$f":"$C$1&\".E30A.REM.FR.PVFIN.DISB.L.M\"","v":{"$error":"#N/A"}},{"$f":"ROUND(PAGE8!$O$22,5)","v":0}]
[{"$f":"$C$1&\".E30A.REM.FR.PVFIN.DISB.H.M\"","v":{"$error":"#N/A"}},{"$f":"ROUND(PAGE8!$Q$22,5)","v":0}]
[{"$f":"$C$1&\".E30A.REM.FR.PVFIN.OS.L.\"","v":{"$error":"#N/A"}},{"$f":"ROUND(PAGE8!$S$22,5)","v":0}]
[{"$f":"$C$1&\".E30A.REM.FR.PVFIN.OS.H.\"","v":{"$error":"#N/A"}},{"$f":"ROUND(PAGE8!$U$22,5)","v":0}]
[{"$f":"$C$1&\".E30A.REM.FR.PVFIN.OS.L.M\"","v":{"$error":"#N/A"}},{"$f":"ROUND(PAGE8!$W$22,5)","v":0}]
[{"$f":"$C$1&\".E30A.REM.FR.PVFIN.OS.H.M\"","v":{"$error":"#N/A"}},{"$f":"ROUND(PAGE8!$Y$22,5)","v":0}]
[{"$f":"$C$1&\".E30A.REM.FR.IBUS.APPR.L.\"","v":{"$error":"#N/A"}},{"$f":"ROUND(PAGE8!$C$25,5)","v":0}]
[{"$f":"$C$1&\".E30A.REM.FR.IBUS.APPR.H.\"","v":{"$error":"#N/A"}},{"$f":"ROUND(PAGE8!$E$25,5)","v":0}]
[{"$f":"$C$1&\".E30A.REM.FR.IBUS.APPR.L.M\"","v":{"$error":"#N/A"}},{"$f":"ROUND(PAGE8!$G$25,5)","v":0}]
[{"$f":"$C$1&\".E30A.REM.FR.IBUS.APPR.H.M\"","v":{"$error":"#N/A"}},{"$f":"ROUND(PAGE8!$I$25,5)","v":0}]
[{"$f":"$C$1&\".E30A.REM.FR.IBUS.DISB.L.\"","v":{"$error":"#N/A"}},{"$f":"ROUND(PAGE8!$K$25,5)","v":0}]
[{"$f":"$C$1&\".E30A.REM.FR.IBUS.DISB.H.\"","v":{"$error":"#N/A"}},{"$f":"ROUND(PAGE8!$M$25,5)","v":0}]
[{"$f":"$C$1&\".E30A.REM.FR.IBUS.DISB.L.M\"","v":{"$error":"#N/A"}},{"$f":"ROUND(PAGE8!$O$25,5)","v":0}]
[{"$f":"$C$1&\".E30A.REM.FR.IBUS.DISB.H.M\"","v":{"$error":"#N/A"}},{"$f":"ROUND(PAGE8!$Q$25,5)","v":0}]
[{"$f":"$C$1&\".E30A.REM.FR.IBUS.OS.L.\"","v":{"$error":"#N/A"}},{"$f":"ROUND(PAGE8!$S$25,5)","v":0}]
[{"$f":"$C$1&\".E30A.REM.FR.IBUS.OS.H.\"","v":{"$error":"#N/A"}},{"$f":"ROUND(PAGE8!$U$25,5)","v":0}]
[{"$f":"$C$1&\".E30A.REM.FR.IBUS.OS.L.M\"","v":{"$error":"#N/A"}},{"$f":"ROUND(PAGE8!$W$25,5)","v":0}]
[{"$f":"$C$1&\".E30A.REM.FR.IBUS.OS.H.M\"","v":{"$error":"#N/A"}},{"$f":"ROUND(PAGE8!$Y$25,5)","v":0}]
[{"$f":"$C$1&\".E30A.REM.FR.UIBUS.APPR.L.\"","v":{"$error":"#N/A"}},{"$f":"ROUND(PAGE8!$C$28,5)","v":0}]
[{"$f":"$C$1&\".E30A.REM.FR.UIBUS.APPR.H.\"","v":{"$error":"#N/A"}},{"$f":"ROUND(PAGE8!$E$28,5)","v":0}]
[{"$f":"$C$1&\".E30A.REM.FR.UIBUS.APPR.L.M\"","v":{"$error":"#N/A"}},{"$f":"ROUND(PAGE8!$G$28,5)","v":0}]
[{"$f":"$C$1&\".E30A.REM.FR.UIBUS.APPR.H.M\"","v":{"$error":"#N/A"}},{"$f":"ROUND(PAGE8!$I$28,5)","v":0}]
[{"$f":"$C$1&\".E30A.REM.FR.UIBUS.DISB.L.\"","v":{"$error":"#N/A"}},{"$f":"ROUND(PAGE8!$K$28,5)","v":0}]
[{"$f":"$C$1&\".E30A.REM.FR.UIBUS.DISB.H.\"","v":{"$error":"#N/A"}},{"$f":"ROUND(PAGE8!$M$28,5)","v":0}]
[{"$f":"$C$1&\".E30A.REM.FR.UIBUS.DISB.L.M\"","v":{"$error":"#N/A"}},{"$f":"ROUND(PAGE8!$O$28,5)","v":0}]
[{"$f":"$C$1&\".E30A.REM.FR.UIBUS.DISB.H.M\"","v":{"$error":"#N/A"}},{"$f":"ROUND(PAGE8!$Q$28,5)","v":0}]
[{"$f":"$C$1&\".E30A.REM.FR.UIBUS.OS.L.\"","v":{"$error":"#N/A"}},{"$f":"ROUND(PAGE8!$S$28,5)","v":0}]
[{"$f":"$C$1&\".E30A.REM.FR.UIBUS.OS.H.\"","v":{"$error":"#N/A"}},{"$f":"ROUND(PAGE8!$U$28,5)","v":0}]
[{"$f":"$C$1&\".E30A.REM.FR.UIBUS.OS.L.M\"","v":{"$error":"#N/A"}},{"$f":"ROUND(PAGE8!$W$28,5)","v":0}]
[{"$f":"$C$1&\".E30A.REM.FR.UIBUS.OS.H.M\"","v":{"$error":"#N/A"}},{"$f":"ROUND(PAGE8!$Y$28,5)","v":0}]
[{"$f":"$C$1&\".E30A.REM.FR.CONSM.APPR.L.\"","v":{"$error":"#N/A"}},{"$f":"ROUND(PAGE8!$C$30,5)","v":0}]
[{"$f":"$C$1&\".E30A.REM.FR.CONSM.APPR.H.\"","v":{"$error":"#N/A"}},{"$f":"ROUND(PAGE8!$E$30,5)","v":0}]
[{"$f":"$C$1&\".E30A.REM.FR.CONSM.APPR.L.M\"","v":{"$error":"#N/A"}},{"$f":"ROUND(PAGE8!$G$30,5)","v":0}]
[{"$f":"$C$1&\".E30A.REM.FR.CONSM.APPR.H.M\"","v":{"$error":"#N/A"}},{"$f":"ROUND(PAGE8!$I$30,5)","v":0}]
[{"$f":"$C$1&\".E30A.REM.FR.CONSM.DISB.L.\"","v":{"$error":"#N/A"}},{"$f":"ROUND(PAGE8!$K$30,5)","v":0}]
[{"$f":"$C$1&\".E30A.REM.FR.CONSM.DISB.H.\"","v":{"$error":"#N/A"}},{"$f":"ROUND(PAGE8!$M$30,5)","v":0}]
[{"$f":"$C$1&\".E30A.REM.FR.CONSM.DISB.L.M\"","v":{"$error":"#N/A"}},{"$f":"ROUND(PAGE8!$O$30,5)","v":0}]
[{"$f":"$C$1&\".E30A.REM.FR.CONSM.DISB.H.M\"","v":{"$error":"#N/A"}},{"$f":"ROUND(PAGE8!$Q$30,5)","v":0}]
[{"$f":"$C$1&\".E30A.REM.FR.CONSM.OS.L.\"","v":{"$error":"#N/A"}},{"$f":"ROUND(PAGE8!$S$30,5)","v":0}]
[{"$f":"$C$1&\".E30A.REM.FR.CONSM.OS.H.\"","v":{"$error":"#N/A"}},{"$f":"ROUND(PAGE8!$U$30,5)","v":0}]
[{"$f":"$C$1&\".E30A.REM.FR.CONSM.OS.L.M\"","v":{"$error":"#N/A"}},{"$f":"ROUND(PAGE8!$W$30,5)","v":0}]
[{"$f":"$C$1&\".E30A.REM.FR.CONSM.OS.H.M\"","v":{"$error":"#N/A"}},{"$f":"ROUND(PAGE8!$Y$30,5)","v":0}]
[{"$f":"$C$1&\".E30A.REM.VR.PBSEC.APPR.L.\"","v":{"$error":"#N/A"}},{"$f":"ROUND(PAGE8!$C$40,5)","v":0}]
[{"$f":"$C$1&\".E30A.REM.VR.PBSEC.APPR.H.\"","v":{"$error":"#N/A"}},{"$f":"ROUND(PAGE8!$E$40,5)","v":0}]
[{"$f":"$C$1&\".E30A.REM.VR.PBSEC.APPR.L.M\"","v":{"$error":"#N/A"}},{"$f":"ROUND(PAGE8!$G$40,5)","v":0}]
[{"$f":"$C$1&\".E30A.REM.VR.PBSEC.APPR.H.M\"","v":{"$error":"#N/A"}},{"$f":"ROUND(PAGE8!$I$40,5)","v":0}]
[{"$f":"$C$1&\".E30A.REM.VR.PBSEC.DISB.L.\"","v":{"$error":"#N/A"}},{"$f":"ROUND(PAGE8!$K$40,5)","v":0}]
[{"$f":"$C$1&\".E30A.REM.VR.PBSEC.DISB.H.\"","v":{"$error":"#N/A"}},{"$f":"ROUND(PAGE8!$M$40,5)","v":0}]
[{"$f":"$C$1&\".E30A.REM.VR.PBSEC.DISB.L.M\"","v":{"$error":"#N/A"}},{"$f":"ROUND(PAGE8!$O$40,5)","v":0}]
[{"$f":"$C$1&\".E30A.REM.VR.PBSEC.DISB.H.M\"","v":{"$error":"#N/A"}},{"$f":"ROUND(PAGE8!$Q$40,5)","v":0}]
[{"$f":"$C$1&\".E30A.REM.VR.PBSEC.OS.L.\"","v":{"$error":"#N/A"}},{"$f":"ROUND(PAGE8!$S$40,5)","v":0}]
[{"$f":"$C$1&\".E30A.REM.VR.PBSEC.OS.H.\"","v":{"$error":"#N/A"}},{"$f":"ROUND(PAGE8!$U$40,5)","v":0}]
[{"$f":"$C$1&\".E30A.REM.VR.PBSEC.OS.L.M\"","v":{"$error":"#N/A"}},{"$f":"ROUND(PAGE8!$W$40,5)","v":0}]
[{"$f":"$C$1&\".E30A.REM.VR.PBSEC.OS.H.M\"","v":{"$error":"#N/A"}},{"$f":"ROUND(PAGE8!$Y$40,5)","v":0}]
[{"$f":"$C$1&\".E30A.REM.VR.PVFIN.APPR.L.\"","v":{"$error":"#N/A"}},{"$f":"ROUND(PAGE8!$C$43,5)","v":0}]
[{"$f":"$C$1&\".E30A.REM.VR.PVFIN.APPR.H.\"","v":{"$error":"#N/A"}},{"$f":"ROUND(PAGE8!$E$43,5)","v":0}]
[{"$f":"$C$1&\".E30A.REM.VR.PVFIN.APPR.L.M\"","v":{"$error":"#N/A"}},{"$f":"ROUND(PAGE8!$G$43,5)","v":0}]
[{"$f":"$C$1&\".E30A.REM.VR.PVFIN.APPR.H.M\"","v":{"$error":"#N/A"}},{"$f":"ROUND(PAGE8!$I$43,5)","v":0}]
[{"$f":"$C$1&\".E30A.REM.VR.PVFIN.DISB.L.\"","v":{"$error":"#N/A"}},{"$f":"ROUND(PAGE8!$K$43,5)","v":0}]
[{"$f":"$C$1&\".E30A.REM.VR.PVFIN.DISB.H.\"","v":{"$error":"#N/A"}},{"$f":"ROUND(PAGE8!$M$43,5)","v":0}]
[{"$f":"$C$1&\".E30A.REM.VR.PVFIN.DISB.L.M\"","v":{"$error":"#N/A"}},{"$f":"ROUND(PAGE8!$O$43,5)","v":0}]
[{"$f":"$C$1&\".E30A.REM.VR.PVFIN.DISB.H.M\"","v":{"$error":"#N/A"}},{"$f":"ROUND(PAGE8!$Q$43,5)","v":0}]
[{"$f":"$C$1&\".E30A.REM.VR.PVFIN.OS.L.\"","v":{"$error":"#N/A"}},{"$f":"ROUND(PAGE8!$S$43,5)","v":0}]
[{"$f":"$C$1&\".E30A.REM.VR.PVFIN.OS.H.\"","v":{"$error":"#N/A"}},{"$f":"ROUND(PAGE8!$U$43,5)","v":0}]
[{"$f":"$C$1&\".E30A.REM.VR.PVFIN.OS.L.M\"","v":{"$error":"#N/A"}},{"$f":"ROUND(PAGE8!$W$43,5)","v":0}]
[{"$f":"$C$1&\".E30A.REM.VR.PVFIN.OS.H.M\"","v":{"$error":"#N/A"}},{"$f":"ROUND(PAGE8!$Y$43,5)","v":0}]
[{"$f":"$C$1&\".E30A.REM.VR.IBUS.APPR.L.\"","v":{"$error":"#N/A"}},{"$f":"ROUND(PAGE8!$C$46,5)","v":0}]
[{"$f":"$C$1&\".E30A.REM.VR.IBUS.APPR.H.\"","v":{"$error":"#N/A"}},{"$f":"ROUND(PAGE8!$E$46,5)","v":0}]
[{"$f":"$C$1&\".E30A.REM.VR.IBUS.APPR.L.M\"","v":{"$error":"#N/A"}},{"$f":"ROUND(PAGE8!$G$46,5)","v":0}]
[{"$f":"$C$1&\".E30A.REM.VR.IBUS.APPR.H.M\"","v":{"$error":"#N/A"}},{"$f":"ROUND(PAGE8!$I$46,5)","v":0}]
[{"$f":"$C$1&\".E30A.REM.VR.IBUS.DISB.L.\"","v":{"$error":"#N/A"}},{"$f":"ROUND(PAGE8!$K$46,5)","v":0}]
[{"$f":"$C$1&\".E30A.REM.VR.IBUS.DISB.H.\"","v":{"$error":"#N/A"}},{"$f":"ROUND(PAGE8!$M$46,5)","v":0}]
[{"$f":"$C$1&\".E30A.REM.VR.IBUS.DISB.L.M\"","v":{"$error":"#N/A"}},{"$f":"ROUND(PAGE8!$O$46,5)","v":0}]
[{"$f":"$C$1&\".E30A.REM.VR.IBUS.DISB.H.M\"","v":{"$error":"#N/A"}},{"$f":"ROUND(PAGE8!$Q$46,5)","v":0}]
[{"$f":"$C$1&\".E30A.REM.VR.IBUS.OS.L.\"","v":{"$error":"#N/A"}},{"$f":"ROUND(PAGE8!$S$46,5)","v":0}]
[{"$f":"$C$1&\".E30A.REM.VR.IBUS.OS.H.\"","v":{"$error":"#N/A"}},{"$f":"ROUND(PAGE8!$U$46,5)","v":0}]
[{"$f":"$C$1&\".E30A.REM.VR.IBUS.OS.L.M\"","v":{"$error":"#N/A"}},{"$f":"ROUND(PAGE8!$W$46,5)","v":0}]
[{"$f":"$C$1&\".E30A.REM.VR.IBUS.OS.H.M\"","v":{"$error":"#N/A"}},{"$f":"ROUND(PAGE8!$Y$46,5)","v":0}]
[{"$f":"$C$1&\".E30A.REM.VR.UIBUS.APPR.L.\"","v":{"$error":"#N/A"}},{"$f":"ROUND(PAGE8!$C$49,5)","v":0}]
[{"$f":"$C$1&\".E30A.REM.VR.UIBUS.APPR.H.\"","v":{"$error":"#N/A"}},{"$f":"ROUND(PAGE8!$E$49,5)","v":0}]
[{"$f":"$C$1&\".E30A.REM.VR.UIBUS.APPR.L.M\"","v":{"$error":"#N/A"}},{"$f":"ROUND(PAGE8!$G$49,5)","v":0}]
[{"$f":"$C$1&\".E30A.REM.VR.UIBUS.APPR.H.M\"","v":{"$error":"#N/A"}},{"$f":"ROUND(PAGE8!$I$49,5)","v":0}]
[{"$f":"$C$1&\".E30A.REM.VR.UIBUS.DISB.L.\"","v":{"$error":"#N/A"}},{"$f":"ROUND(PAGE8!$K$49,5)","v":0}]
[{"$f":"$C$1&\".E30A.REM.VR.UIBUS.DISB.H.\"","v":{"$error":"#N/A"}},{"$f":"ROUND(PAGE8!$M$49,5)","v":0}]
[{"$f":"$C$1&\".E30A.REM.VR.UIBUS.DISB.L.M\"","v":{"$error":"#N/A"}},{"$f":"ROUND(PAGE8!$O$49,5)","v":0}]
[{"$f":"$C$1&\".E30A.REM.VR.UIBUS.DISB.H.M\"","v":{"$error":"#N/A"}},{"$f":"ROUND(PAGE8!$Q$49,5)","v":0}]
[{"$f":"$C$1&\".E30A.REM.VR.UIBUS.OS.L.\"","v":{"$error":"#N/A"}},{"$f":"ROUND(PAGE8!$S$49,5)","v":0}]
[{"$f":"$C$1&\".E30A.REM.VR.UIBUS.OS.H.\"","v":{"$error":"#N/A"}},{"$f":"ROUND(PAGE8!$U$49,5)","v":0}]
[{"$f":"$C$1&\".E30A.REM.VR.UIBUS.OS.L.M\"","v":{"$error":"#N/A"}},{"$f":"ROUND(PAGE8!$W$49,5)","v":0}]
[{"$f":"$C$1&\".E30A.REM.VR.UIBUS.OS.H.M\"","v":{"$error":"#N/A"}},{"$f":"ROUND(PAGE8!$Y$49,5)","v":0}]
[{"$f":"$C$1&\".E30A.REM.VR.CONSM.APPR.L.\"","v":{"$error":"#N/A"}},{"$f":"ROUND(PAGE8!$C$51,5)","v":0}]
[{"$f":"$C$1&\".E30A.REM.VR.CONSM.APPR.H.\"","v":{"$error":"#N/A"}},{"$f":"ROUND(PAGE8!$E$51,5)","v":0}]
[{"$f":"$C$1&\".E30A.REM.VR.CONSM.APPR.L.M\"","v":{"$error":"#N/A"}},{"$f":"ROUND(PAGE8!$G$51,5)","v":0}]
[{"$f":"$C$1&\".E30A.REM.VR.CONSM.APPR.H.M\"","v":{"$error":"#N/A"}},{"$f":"ROUND(PAGE8!$I$51,5)","v":0}]
[{"$f":"$C$1&\".E30A.REM.VR.CONSM.DISB.L.\"","v":{"$error":"#N/A"}},{"$f":"ROUND(PAGE8!$K$51,5)","v":0}]
[{"$f":"$C$1&\".E30A.REM.VR.CONSM.DISB.H.\"","v":{"$error":"#N/A"}},{"$f":"ROUND(PAGE8!$M$51,5)","v":0}]
[{"$f":"$C$1&\".E30A.REM.VR.CONSM.DISB.L.M\"","v":{"$error":"#N/A"}},{"$f":"ROUND(PAGE8!$O$51,5)","v":0}]
[{"$f":"$C$1&\".E30A.REM.VR.CONSM.DISB.H.M\"","v":{"$error":"#N/A"}},{"$f":"ROUND(PAGE8!$Q$51,5)","v":0}]
[{"$f":"$C$1&\".E30A.REM.VR.CONSM.OS.L.\"","v":{"$error":"#N/A"}},{"$f":"ROUND(PAGE8!$S$51,5)","v":0}]
[{"$f":"$C$1&\".E30A.REM.VR.CONSM.OS.H.\"","v":{"$error":"#N/A"}},{"$f":"ROUND(PAGE8!$U$51,5)","v":0}]
[{"$f":"$C$1&\".E30A.REM.VR.CONSM.OS.L.M\"","v":{"$error":"#N/A"}},{"$f":"ROUND(PAGE8!$W$51,5)","v":0}]
[{"$f":"$C$1&\".E30A.REM.VR.CONSM.OS.H.M\"","v":{"$error":"#N/A"}},{"$f":"ROUND(PAGE8!$Y$51,5)","v":0}]
[{"$f":"$C$1&\".E30A.REM.AR.PBSEC.APPR.L.\"","v":{"$error":"#N/A"}},{"$f":"ROUND(PAGE8!$C$61,5)","v":0}]
[{"$f":"$C$1&\".E30A.REM.AR.PBSEC.APPR.H.\"","v":{"$error":"#N/A"}},{"$f":"ROUND(PAGE8!$E$61,5)","v":0}]
[{"$f":"$C$1&\".E30A.REM.AR.PBSEC.APPR.L.M\"","v":{"$error":"#N/A"}},{"$f":"ROUND(PAGE8!$G$61,5)","v":0}]
[{"$f":"$C$1&\".E30A.REM.AR.PBSEC.APPR.H.M\"","v":{"$error":"#N/A"}},{"$f":"ROUND(PAGE8!$I$61,5)","v":0}]
[{"$f":"$C$1&\".E30A.REM.AR.PBSEC.DISB.L.\"","v":{"$error":"#N/A"}},{"$f":"ROUND(PAGE8!$K$61,5)","v":0}]
[{"$f":"$C$1&\".E30A.REM.AR.PBSEC.DISB.H.\"","v":{"$error":"#N/A"}},{"$f":"ROUND(PAGE8!$M$61,5)","v":0}]
[{"$f":"$C$1&\".E30A.REM.AR.PBSEC.DISB.L.M\"","v":{"$error":"#N/A"}},{"$f":"ROUND(PAGE8!$O$61,5)","v":0}]
[{"$f":"$C$1&\".E30A.REM.AR.PBSEC.DISB.H.M\"","v":{"$error":"#N/A"}},{"$f":"ROUND(PAGE8!$Q$61,5)","v":0}]
[{"$f":"$C$1&\".E30A.REM.AR.PBSEC.OS.L.\"","v":{"$error":"#N/A"}},{"$f":"ROUND(PAGE8!$S$61,5)","v":0}]
[{"$f":"$C$1&\".E30A.REM.AR.PBSEC.OS.H.\"","v":{"$error":"#N/A"}},{"$f":"ROUND(PAGE8!$U$61,5)","v":0}]
[{"$f":"$C$1&\".E30A.REM.AR.PBSEC.OS.L.M\"","v":{"$error":"#N/A"}},{"$f":"ROUND(PAGE8!$W$61,5)","v":0}]
[{"$f":"$C$1&\".E30A.REM.AR.PBSEC.OS.H.M\"","v":{"$error":"#N/A"}},{"$f":"ROUND(PAGE8!$Y$61,5)","v":0}]
[{"$f":"$C$1&\".E30A.REM.AR.PVFIN.APPR.L.\"","v":{"$error":"#N/A"}},{"$f":"ROUND(PAGE8!$C$64,5)","v":0}]
[{"$f":"$C$1&\".E30A.REM.AR.PVFIN.APPR.H.\"","v":{"$error":"#N/A"}},{"$f":"ROUND(PAGE8!$E$64,5)","v":0}]
[{"$f":"$C$1&\".E30A.REM.AR.PVFIN.APPR.L.M\"","v":{"$error":"#N/A"}},{"$f":"ROUND(PAGE8!$G$64,5)","v":0}]
[{"$f":"$C$1&\".E30A.REM.AR.PVFIN.APPR.H.M\"","v":{"$error":"#N/A"}},{"$f":"ROUND(PAGE8!$I$64,5)","v":0}]
[{"$f":"$C$1&\".E30A.REM.AR.PVFIN.DISB.L.\"","v":{"$error":"#N/A"}},{"$f":"ROUND(PAGE8!$K$64,5)","v":0}]
[{"$f":"$C$1&\".E30A.REM.AR.PVFIN.DISB.H.\"","v":{"$error":"#N/A"}},{"$f":"ROUND(PAGE8!$M$64,5)","v":0}]
[{"$f":"$C$1&\".E30A.REM.AR.PVFIN.DISB.L.M\"","v":{"$error":"#N/A"}},{"$f":"ROUND(PAGE8!$O$64,5)","v":0}]
[{"$f":"$C$1&\".E30A.REM.AR.PVFIN.DISB.H.M\"","v":{"$error":"#N/A"}},{"$f":"ROUND(PAGE8!$Q$64,5)","v":0}]
[{"$f":"$C$1&\".E30A.REM.AR.PVFIN.OS.L.\"","v":{"$error":"#N/A"}},{"$f":"ROUND(PAGE8!$S$64,5)","v":0}]
[{"$f":"$C$1&\".E30A.REM.AR.PVFIN.OS.H.\"","v":{"$error":"#N/A"}},{"$f":"ROUND(PAGE8!$U$64,5)","v":0}]
[{"$f":"$C$1&\".E30A.REM.AR.PVFIN.OS.L.M\"","v":{"$error":"#N/A"}},{"$f":"ROUND(PAGE8!$W$64,5)","v":0}]
[{"$f":"$C$1&\".E30A.REM.AR.PVFIN.OS.H.M\"","v":{"$error":"#N/A"}},{"$f":"ROUND(PAGE8!$Y$64,5)","v":0}]
[{"$f":"$C$1&\".E30A.REM.AR.IBUS.APPR.L.\"","v":{"$error":"#N/A"}},{"$f":"ROUND(PAGE8!$C$67,5)","v":0}]
[{"$f":"$C$1&\".E30A.REM.AR.IBUS.APPR.H.\"","v":{"$error":"#N/A"}},{"$f":"ROUND(PAGE8!$E$67,5)","v":0}]
[{"$f":"$C$1&\".E30A.REM.AR.IBUS.APPR.L.M\"","v":{"$error":"#N/A"}},{"$f":"ROUND(PAGE8!$G$67,5)","v":0}]
[{"$f":"$C$1&\".E30A.REM.AR.IBUS.APPR.H.M\"","v":{"$error":"#N/A"}},{"$f":"ROUND(PAGE8!$I$67,5)","v":0}]
[{"$f":"$C$1&\".E30A.REM.AR.IBUS.DISB.L.\"","v":{"$error":"#N/A"}},{"$f":"ROUND(PAGE8!$K$67,5)","v":0}]
[{"$f":"$C$1&\".E30A.REM.AR.IBUS.DISB.H.\"","v":{"$error":"#N/A"}},{"$f":"ROUND(PAGE8!$M$67,5)","v":0}]
[{"$f":"$C$1&\".E30A.REM.AR.IBUS.DISB.L.M\"","v":{"$error":"#N/A"}},{"$f":"ROUND(PAGE8!$O$67,5)","v":0}]
[{"$f":"$C$1&\".E30A.REM.AR.IBUS.DISB.H.M\"","v":{"$error":"#N/A"}},{"$f":"ROUND(PAGE8!$Q$67,5)","v":0}]
[{"$f":"$C$1&\".E30A.REM.AR.IBUS.OS.L.\"","v":{"$error":"#N/A"}},{"$f":"ROUND(PAGE8!$S$67,5)","v":0}]
[{"$f":"$C$1&\".E30A.REM.AR.IBUS.OS.H.\"","v":{"$error":"#N/A"}},{"$f":"ROUND(PAGE8!$U$67,5)","v":0}]
[{"$f":"$C$1&\".E30A.REM.AR.IBUS.OS.L.M\"","v":{"$error":"#N/A"}},{"$f":"ROUND(PAGE8!$W$67,5)","v":0}]
[{"$f":"$C$1&\".E30A.REM.AR.IBUS.OS.H.M\"","v":{"$error":"#N/A"}},{"$f":"ROUND(PAGE8!$Y$67,5)","v":0}]
[{"$f":"$C$1&\".E30A.REM.AR.UIBUS.APPR.L.\"","v":{"$error":"#N/A"}},{"$f":"ROUND(PAGE8!$C$70,5)","v":0}]
[{"$f":"$C$1&\".E30A.REM.AR.UIBUS.APPR.H.\"","v":{"$error":"#N/A"}},{"$f":"ROUND(PAGE8!$E$70,5)","v":0}]
[{"$f":"$C$1&\".E30A.REM.AR.UIBUS.APPR.L.M\"","v":{"$error":"#N/A"}},{"$f":"ROUND(PAGE8!$G$70,5)","v":0}]
[{"$f":"$C$1&\".E30A.REM.AR.UIBUS.APPR.H.M\"","v":{"$error":"#N/A"}},{"$f":"ROUND(PAGE8!$I$70,5)","v":0}]
[{"$f":"$C$1&\".E30A.REM.AR.UIBUS.DISB.L.\"","v":{"$error":"#N/A"}},{"$f":"ROUND(PAGE8!$K$70,5)","v":0}]
[{"$f":"$C$1&\".E30A.REM.AR.UIBUS.DISB.H.\"","v":{"$error":"#N/A"}},{"$f":"ROUND(PAGE8!$M$70,5)","v":0}]
[{"$f":"$C$1&\".E30A.REM.AR.UIBUS.DISB.L.M\"","v":{"$error":"#N/A"}},{"$f":"ROUND(PAGE8!$O$70,5)","v":0}]
[{"$f":"$C$1&\".E30A.REM.AR.UIBUS.DISB.H.M\"","v":{"$error":"#N/A"}},{"$f":"ROUND(PAGE8!$Q$70,5)","v":0}]
[{"$f":"$C$1&\".E30A.REM.AR.UIBUS.OS.L.\"","v":{"$error":"#N/A"}},{"$f":"ROUND(PAGE8!$S$70,5)","v":0}]
[{"$f":"$C$1&\".E30A.REM.AR.UIBUS.OS.H.\"","v":{"$error":"#N/A"}},{"$f":"ROUND(PAGE8!$U$70,5)","v":0}]
[{"$f":"$C$1&\".E30A.REM.AR.UIBUS.OS.L.M\"","v":{"$error":"#N/A"}},{"$f":"ROUND(PAGE8!$W$70,5)","v":0}]
[{"$f":"$C$1&\".E30A.REM.AR.UIBUS.OS.H.M\"","v":{"$error":"#N/A"}},{"$f":"ROUND(PAGE8!$Y$70,5)","v":0}]
[{"$f":"$C$1&\".E30A.REM.AR.CONSM.APPR.L.\"","v":{"$error":"#N/A"}},{"$f":"ROUND(PAGE8!$C$72,5)","v":0}]
[{"$f":"$C$1&\".E30A.REM.AR.CONSM.APPR.H.\"","v":{"$error":"#N/A"}},{"$f":"ROUND(PAGE8!$E$72,5)","v":0}]
[{"$f":"$C$1&\".E30A.REM.AR.CONSM.APPR.L.M\"","v":{"$error":"#N/A"}},{"$f":"ROUND(PAGE8!$G$72,5)","v":0}]
[{"$f":"$C$1&\".E30A.REM.AR.CONSM.APPR.H.M\"","v":{"$error":"#N/A"}},{"$f":"ROUND(PAGE8!$I$72,5)","v":0}]
[{"$f":"$C$1&\".E30A.REM.AR.CONSM.DISB.L.\"","v":{"$error":"#N/A"}},{"$f":"ROUND(PAGE8!$K$72,5)","v":0}]
[{"$f":"$C$1&\".E30A.REM.AR.CONSM.DISB.H.\"","v":{"$error":"#N/A"}},{"$f":"ROUND(PAGE8!$M$72,5)","v":0}]
[{"$f":"$C$1&\".E30A.REM.AR.CONSM.DISB.L.M\"","v":{"$error":"#N/A"}},{"$f":"ROUND(PAGE8!$O$72,5)","v":0}]
[{"$f":"$C$1&\".E30A.REM.AR.CONSM.DISB.H.M\"","v":{"$error":"#N/A"}},{"$f":"ROUND(PAGE8!$Q$72,5)","v":0}]
[{"$f":"$C$1&\".E30A.REM.AR.CONSM.OS.L.\"","v":{"$error":"#N/A"}},{"$f":"ROUND(PAGE8!$S$72,5)","v":0}]
[{"$f":"$C$1&\".E30A.REM.AR.CONSM.OS.H.\"","v":{"$error":"#N/A"}},{"$f":"ROUND(PAGE8!$U$72,5)","v":0}]
[{"$f":"$C$1&\".E30A.REM.AR.CONSM.OS.L.M\"","v":{"$error":"#N/A"}},{"$f":"ROUND(PAGE8!$W$72,5)","v":0}]
[{"$f":"$C$1&\".E30A.REM.AR.CONSM.OS.H.M\"","v":{"$error":"#N/A"}},{"$f":"ROUND(PAGE8!$Y$72,5)","v":0}]
["sect12","VAL"]
[{"$f":"$C$1&\".E30A.TR_FNDS.RE_MRTG_LNS_NRES..\"","v":{"$error":"#N/A"}},{"$f":"ROUND(PAGE9!$I$17,5)","v":0}]
[{"$f":"$C$1&\".E30A.TR_FNDS.RE_MRTG_LNS_RES..\"","v":{"$error":"#N/A"}},{"$f":"ROUND(PAGE9!$I$15,5)","v":0}]
[{"$f":"$C$1&\".E30A.TR_FNDS.RE_MRTG_LNS_TTL..\"","v":{"$error":"#N/A"}},{"$f":"ROUND(PAGE9!$I$13,5)","v":0}]

{"sheet":"PAGE1","index":5,"n_rows":100,"n_cols":24,"rows_kept":100,"cut":false,"hidden":false,"merged":[[10,2,10,8],[3,0,3,16],[5,0,5,16],[7,0,7,16]]}
[]
[null,null,null,null,null,null,null,null,null,null,null,null,null,null,null,null,"CB 30A/1"]
[]
["CENTRAL BANK OF TRINIDAD AND TOBAGO"]
[]
["REAL ESTATE MORTGAGE LOANS  QUARTERLY"]
[]
[" A. CHANGES  SECTOR AND SIZE"]
[]
[]
[null,"INSTITUTION:",{"$f":"'COVER PAGE'!C7:J7","v":"SELECT INSTITUTION"}]
[]
[]
[null,"MONTH:",{"$f":"VLOOKUP('COVER PAGE'!F9,Controls!$H$4:$K$147,3,FALSE)","v":"September"}]
[]
[null,"YEAR:",{"$f":"VLOOKUP('COVER PAGE'!F9,Controls!$H$4:$K$147,4,FALSE)","v":24}]
[]
[null,null,"OUTSTANDING ",null,null,null,"APPROVED",null,null,null,"DISBURSED",null,null,null,"OUTSTANDING"]
["A.","SECTOR AND SIZE","BALANCE AS OF",null,null,null,"DURING",null,null,null,"DURING",null,null,null,"BALANCE AS AT"]
[null,null,"PRIOR QUARTER",null,null,null,"QUARTER",null,null,null,"QUARTER",null,null,null,"QUARTER END"]
[]
[null,null,"NO.",null,"VALUE",null,"NO.",null,"VALUE",null,"NO.",null,"VALUE",null,"NO.",null,"VALUE"]
[null,null,null,null,"( $000 )",null,null,null,"( $000 )",null,null,null,"( $000 )",null,null,null,"( $000 )"]
[]
["1 .","PUBLIC SECTOR",{"$f":"SUM(C26:C37)","v":0},null,{"$f":"SUM(E26:E37)","v":0},null,{"$f":"SUM(G26:G37)","v":0},null,{"$f":"SUM(I26:I37)","v":0},null,{"$f":"SUM(K26:K37)","v":0},null,{"$f":"SUM(M26:M37)","v":0},null,{"$f":"SUM(O26:O37)","v":0},null,{"$f":"SUM(Q26:Q37)","v":0}]
[null,"Under $450,000"]
[null,"$450,001  $750,000"]
[null,"$750,001  $1,000,000"]
[null,"$1,000,001  $1,250,000"]
[null,"$1,250,001  $1,500,000"]
[null,"$1,500,001  $1,750,000"]
[null,"$1,750,001  $2,000,000"]
[null,"$2,000,001  $2,250,000"]
[null,"$2,250,001  $2,500,000"]
[null,"$2,500,001  $2,750,000"]
[null,"$2,750,001  $3,000,000"]
[null,"Over $3,000,001"]
[]
["2 .","PRIVATE FINANCIAL"]
[null,"INSTITUTIONS",{"$f":"SUM(C41:C52)","v":0},null,{"$f":"SUM(E41:E52)","v":0},null,{"$f":"SUM(G41:G52)","v":0},null,{"$f":"SUM(I41:I52)","v":0},null,{"$f":"SUM(K41:K52)","v":0},null,{"$f":"SUM(M41:M52)","v":0},null,{"$f":"SUM(O41:O52)","v":0},null,{"$f":"SUM(Q41:Q52)","v":0}]
[null,"Under $450,000"]
[null,"$450,001  $750,000"]
[null,"$750,001  $1,000,000"]
[null,"$1,000,001  $1,250,000"]
[null,"$1,250,001  $1,500,000"]
[null,"$1,500,001  $1,750,000"]
[null,"$1,750,001  $2,000,000"]
[null,"$2,000,001  $2,250,000"]
[null,"$2,250,001  $2,500,000"]
[null,"$2,500,001  $2,750,000"]
[null,"$2,750,001  $3,000,000"]
[null,"Over $3,000,001"]
[]
["3 .","INCORPORATED "]
[null,"BUSINESSES",{"$f":"SUM(C56:C67)","v":0},null,{"$f":"SUM(E56:E67)","v":0},null,0,null,0,null,0,null,0,null,0,null,0]
[null,"Under $450,000"]
[null,"$450,001  $750,000"]
[null,"$750,001  $1,000,000"]
[null,"$1,000,001  $1,250,000"]
[null,"$1,250,001  $1,500,000"]
[null,"$1,500,001  $1,750,000"]
[null,"$1,750,001  $2,000,000"]
[null,"$2,000,001  $2,250,000"]
[null,"$2,250,001  $2,500,000"]
[null,"$2,500,001  $2,750,000"]
[null,"$2,750,001  $3,000,000"]
[null,"Over $3,000,001"]
[]
["4 .","UNINCORPORATED "]
[null,"BUSINESSES",{"$f":"SUM(C71:C82)","v":0},null,{"$f":"SUM(E71:E82)","v":0},null,{"$f":"SUM(G71:G82)","v":0},null,{"$f":"SUM(I71:I82)","v":0},null,{"$f":"SUM(K71:K82)","v":0},null,{"$f":"SUM(M71:M82)","v":0},null,{"$f":"SUM(O71:O82)","v":0},null,{"$f":"SUM(Q71:Q82)","v":0}]
[null,"Under $450,000"]
[null,"$450,001  $750,000"]
[null,"$750,001  $1,000,000"]
[null,"$1,000,001  $1,250,000"]
[null,"$1,250,001  $1,500,000"]
[null,"$1,500,001  $1,750,000"]
[null,"$1,750,001  $2,000,000"]
[null,"$2,000,001  $2,250,000"]
[null,"$2,250,001  $2,500,000"]
[null,"$2,500,001  $2,750,000"]
[null,"$2,750,001  $3,000,000"]
[null,"Over $3,000,001"]
[]
["5 . ","CONSUMERS",{"$f":"SUM(C85:C96)","v":0},null,{"$f":"SUM(E85:E96)","v":0},null,{"$f":"SUM(G85:G96)","v":0},null,{"$f":"SUM(I85:I96)","v":0},null,{"$f":"SUM(K85:K96)","v":0},null,{"$f":"SUM(M85:M96)","v":0},null,{"$f":"SUM(O85:O96)","v":0},null,{"$f":"SUM(Q85:Q96)","v":0}]
[null,"Under $450,000"]
[null,"$450,001  $750,000"]
[null,"$750,001  $1,000,000"]
[null,"$1,000,001  $1,250,000"]
[null,"$1,250,001  $1,500,000"]
[null,"$1,500,001  $1,750,000"]
[null,"$1,750,001  $2,000,000"]
[null,"$2,000,001  $2,250,000"]
[null,"$2,250,001  $2,500,000"]
[null,"$2,500,001  $2,750,000"]
[null,"$2,750,001  $3,000,000"]
[null,"Over $3,000,001"]
[]
[null,"T O T A L",{"$f":"SUM(C25,C40,C55,C70,C84)","v":0},null,{"$f":"SUM(E25,E40,E55,E70,E84)","v":0},null,0,null,0,null,0,null,0,null,0,null,0]
[null,null,null,null,null,null,null,null,null,null,null,null,null,null,null,null,null,null,null,null," "," "," "," "]
[null,null,null,null,null,null,null,null,null,null,null,null,null,null,null,null,null,null,null,null," "," "," "," "]

{"sheet":"PAGE2","index":6,"n_rows":109,"n_cols":21,"rows_kept":109,"cut":false,"hidden":false,"merged":[]}
[]
[null,null,null,null,null,null,null,null,null,null,null,null,null,"CB 30A/2"]
[]
["CENTRAL BANK OF TRINIDAD AND TOBAGO"]
[]
["REAL ESTATE MORTGAGE LOANS  QUARTERLY"]
[]
["  A. CHANGES  SECTOR AND ACCORDING TO INTEREST RATE "]
[]
[]
[]
[null,null,"OUTSTANDING ",null,null,null,"APPROVED",null,null,null,null,"OUTSTANDING"]
["A.","SECTOR AND SIZE","BALANCE AS AT",null,null,null,"DURING",null,null,null,null,"BALANCE AS AT"]
[null,null,"END OF PRIOR QUARTER",null,null,null,"QUARTER",null,null,null,null,"QUARTER END"]
[]
[null,null,"NO.",null,"VALUE",null,"NO.",null,"VALUE",null,null,"NO.",null,"VALUE"]
[null,null,null,null,"( $000 )",null,null,null,"( $000 )",null,null,null,null,"( $000 )"]
[]
["1 .","PUBLIC SECTOR"]
[null,null,{"$f":"SUM(C21:C34)","v":0},null,{"$f":"SUM(E21:E34)","v":0},null,0,null,0,null,null,0,null,0]
[null,"3.0% and Under"]
[null,"3.1%  4.0% "]
[null,"4.1%  5.0% "]
[null,"5.1%  6.0% "]
[null,"6.1%  7.0%"]
[null,"7.1%  8.0%"]
[null,"8.1%  9.0%"]
[null,"9.1%  10.0%"]
[null,"10.1%  11.0%"]
[null,"11.1%  12.0%"]
[null,"12.1%  13.0%"]
[null,"13.1%  14.0%"]
[null,"14.1%  15.0%"]
[null,"15.1% and Over"]
[]
["2 .","PRIVATE FINANCIAL"]
[null,"INSTITUTIONS"]
[null,null,{"$f":"SUM(C39:C52)","v":0},null,{"$f":"SUM(E39:E52)","v":0},null,{"$f":"SUM(G39:G52)","v":0},null,{"$f":"SUM(I39:I52)","v":0},null,null,{"$f":"SUM(L39:L52)","v":0},null,{"$f":"SUM(N39:N52)","v":0}]
[null,"3.0% and Under"]
[null,"3.1%  4.0% "]
[null,"4.1%  5.0% "]
[null,"5.1%  6.0% "]
[null,"6.1%  7.0%"]
[null,"7.1%  8.0%"]
[null,"8.1%  9.0%"]
[null,"9.1%  10.0%"]
[null,"10.1%  11.0%"]
[null,"11.1%  12.0%"]
[null,"12.1%  13.0%"]
[null,"13.1%  14.0%"]
[null,"14.1%  15.0%"]
[null,"15.1% and Over"]
[]
["3 .","INCORPORATED "]
[null,"BUSINESSES"]
[null,null,{"$f":"SUM(C57:C70)","v":0},null,{"$f":"SUM(E57:E70)","v":0},null,{"$f":"SUM(G57:G70)","v":0},null,{"$f":"SUM(I57:I70)","v":0},null,null,{"$f":"SUM(L57:L70)","v":0},null,{"$f":"SUM(N57:N70)","v":0}]
[null,"3.0% and Under"]
[null,"3.1%  4.0% "]
[null,"4.1%  5.0% "]
[null,"5.1%  6.0% "]
[null,"6.1%  7.0%"]
[null,"7.1%  8.0%"]
[null,"8.1%  9.0%"]
[null,"9.1%  10.0%"]
[null,"10.1%  11.0%"]
[null,"11.1%  12.0%"]
[null,"12.1%  13.0%"]
[null,"13.1%  14.0%"]
[null,"14.1%  15.0%"]
[null,"15.1% and Over"]
[]
["4 .","UNINCORPORATED "]
[null,"BUSINESSES"]
[null,null,{"$f":"SUM(C75:C88)","v":0},null,{"$f":"SUM(E75:E88)","v":0},null,{"$f":"SUM(G75:G88)","v":0},null,{"$f":"SUM(I75:I88)","v":0},null,null,{"$f":"SUM(L75:L88)","v":0},null,{"$f":"SUM(N75:N88)","v":0}]
[null,"3.0% and Under"]
[null,"3.1%  4.0% "]
[null,"4.1%  5.0% "]
[null,"5.1%  6.0% "]
[null,"6.1%  7.0%"]
[null,"7.1%  8.0%"]
[null,"8.1%  9.0%"]
[null,"9.1%  10.0%"]
[null,"10.1%  11.0%"]
[null,"11.1%  12.0%"]
[null,"12.1%  13.0%"]
[null,"13.1%  14.0%"]
[null,"14.1%  15.0%"]
[null,"15.1% and Over"]
[]
["5 . ","CONSUMERS"]
[null,null,{"$f":"SUM(C92:C105)","v":0},null,{"$f":"SUM(E92:E105)","v":0},null,{"$f":"SUM(G92:G105)","v":0},null,{"$f":"SUM(I92:I105)","v":0},null,null,{"$f":"SUM(L92:L105)","v":0},null,{"$f":"SUM(N92:N105)","v":0}]
[null,"3.0% and Under"]
[null,"3.1%  4.0% "]
[null,"4.1%  5.0% "]
[null,"5.1%  6.0% "]
[null,"6.1%  7.0%"]
[null,"7.1%  8.0%"]
[null,"8.1%  9.0%"]
[null,"9.1%  10.0%"]
[null,"10.1%  11.0%"]
[null,"11.1%  12.0%"]
[null,"12.1%  13.0%"]
[null,"13.1%  14.0%"]
[null,"14.1%  15.0%"]
[null,"15.1% and Over"]
[]
[null,"T O T A L",{"$f":"SUM(C20+C38+C56+C74+C91)","v":0},null,{"$f":"SUM(E20+E38+E56+E74+E91)","v":0},null,{"$f":"SUM(G20+G38+G56+G74+G91)","v":0},null,{"$f":"SUM(I20+I38+I56+I74+I91)","v":0},null,null,{"$f":"SUM(L20+L38+L56+L74+L91)","v":0},null,{"$f":"SUM(N20+N38+N56+N74+N91)","v":0}]
[null,null,null,null,null,null,null,null,null,null,null,null,null,null,null,null,null," "," "," "," "]
[null,null,null,null,null,null,null,null,null,null,null,null,null,null,null,null,null," "," "," "," "]

{"sheet":"PAGE3","index":7,"n_rows":60,"n_cols":21,"rows_kept":60,"cut":false,"hidden":false,"merged":[]}
[]
[null,null,null,null,null,null,null,null,null,null,null,null,null,"CB 30A/3"]
[]
["CENTRAL BANK OF TRINIDAD AND TOBAGO"]
[]
["REAL ESTATE MORTGAGE LOANS  QUARTERLY"]
[]
["  A. CHANGES  PROPERTY TYPE AND ACCORDING TO INTEREST RATE "]
[]
[]
[]
[null,null,"OUTSTANDING ",null,null,null,"DISBURSED/GRANTED",null,null,null,null,"OUTSTANDING"]
[null,null,"BALANCE AS AT",null,null,null,"DURING",null,null,null,null,"BALANCE AS AT"]
[null,null,"END OF PRIOR QUARTER",null,null,null,"QUARTER",null,null,null,null,"QUARTER END"]
[]
[null,null,"NO.",null,"VALUE",null,"NO.",null,"VALUE",null,null,"NO.",null,"VALUE"]
[null,null,null,null,"( $000 )",null,null,null,"( $000 )",null,null,null,null,"( $000 )"]
[]
["A.","RESIDENTIAL"]
[]
[null,"3.0% and Under"]
[null,"3.1%  4.0% "]
[null,"4.1%  5.0% "]
[null,"5.1%  6.0% "]
[null,"6.1%  7.0%"]
[null,"7.1%  8.0%"]
[null,"8.1%  9.0%"]
[null,"9.1%  10.0%"]
[null,"10.1%  11.0%"]
[null,"11.1%  12.0%"]
[null,"12.1%  13.0%"]
[null,"13.1%  14.0%"]
[null,"14.1%  15.0%"]
[null,"15.1% and Over"]
[]
[null,"SUBT O T A L",{"$f":"SUM(C21:C34)","v":0},null,{"$f":"SUM(E21:E34)","v":0},null,{"$f":"SUM(G21:G34)","v":0},null,{"$f":"SUM(I21:I34)","v":0},null,null,{"$f":"SUM(L21:L34)","v":0},null,{"$f":"SUM(N21:N34)","v":0}]
[]
["B.","COMMERCIAL"]
[]
[null,"3.0% and Under"]
[null,"3.1%  4.0% "]
[null,"4.1%  5.0% "]
[null,"5.1%  6.0% "]
[null,"6.1%  7.0%"]
[null,"7.1%  8.0%"]
[null,"8.1%  9.0%"]
[null,"9.1%  10.0%"]
[null,"10.1%  11.0%"]
[null,"11.1%  12.0%"]
[null,"12.1%  13.0%"]
[null,"13.1%  14.0%"]
[null,"14.1%  15.0%"]
[null,"15.1% and Over"]
[]
[null,"SUB TOTAL",{"$f":"SUM(C40:C53)","v":0},null,{"$f":"SUM(E40:E53)","v":0},null,{"$f":"SUM(G40:G53)","v":0},null,{"$f":"SUM(I40:I53)","v":0},null,null,{"$f":"SUM(L40:L53)","v":0},null,{"$f":"SUM(N40:N53)","v":0}]
[]
[]
[null,"T O T A L",{"$f":"C55+C36","v":0},null,{"$f":"E55+E36","v":0},null,{"$f":"G55+G36","v":0},null,{"$f":"I55+I36","v":0},null,null,{"$f":"L55+L36","v":0},null,{"$f":"N55+N36","v":0}]
[null,null,null,null,null,null,null,null,null,null,null,null,null,null,null,null,null," "," "," "," "]
[null,null,null,null,null,null,null,null,null,null,null,null,null,null,null,null,null," "," "," "," "]

{"sheet":"PAGE4 ","index":8,"n_rows":66,"n_cols":17,"rows_kept":66,"cut":false,"hidden":false,"merged":[[61,8,61,10],[63,8,63,10],[65,8,65,10]]}
[]
[null,null,null,null,null,null,null,null,null,null,null,null,null,null,null,null,"CB 30A/4"]
[]
["CENTRAL BANK OF TRINIDAD AND TOBAGO"]
[]
["REAL ESTATE MORTGAGES - QUARTERLY"]
[]
["B.  PURPOSE"]
[]
[]
[]
[null,null,"OUTSTANDING ",null,null,"APPROVED",null,null,null,null,"DISBURSED",null,null,null,"OUTSTANDING"]
["A.","PURPOSE","BALANCE AS AT",null,null,"DURING",null,null,null,null,"DURING",null,null,null,"BALANCE AS AT"]
[null,null,"END OF PRIOR QUARTER",null,null,"QUARTER",null,null,null,null,"QUARTER",null,null,null,"QUARTER END"]
[]
[null,null,"NO.",null,"VALUE","NO.",null,null,"VALUE",null,"NO.",null,"VALUE",null,"NO.",null,"VALUE"]
[null,null,null,null,"( $000 )",null,null,null,"( $000 )",null,null,null,"( $000 )",null,null,null,"( $000 )"]
[]
[1,"RENOVATION/"]
[null,"IMPROVEMENT"]
[]
[]
[2,"ACQUISITION OF NEWLY"]
[null,"CONSTRUCTED HOUSES"]
[]
[3,"PURCHASE OF EXISTING"]
[null,"HOUSES"]
[]
[4,"PURCHASE OF LAND"]
[]
[null,"MEMO :"]
[]
[null,"LOANS RESCHEDULED"]
[null,"( REFERS TO ITEMS 1 - 3,"]
[null,"ABOVE )"]
[]
[]
[]
[null,"T O T A L",{"$f":"SUM(C20:C29)","v":0},null,{"$f":"SUM(E20:E29)","v":0},null,{"$f":"SUM(G20:G29)","v":0},null,{"$f":"SUM(I20:I29)","v":0},null,{"$f":"SUM(K20:K29)","v":0},null,{"$f":"SUM(M20:M29)","v":0},null,{"$f":"SUM(O20:O29)","v":0},null,{"$f":"SUM(Q20:Q29)","v":0}]
[]
[]
["B.","NO. OF LOAN APPLICATIONS RECEIVED DURING THE QUARTER"]
[]
[]
["1 .","RESIDENTIAL"]
[]
["2 .","NON - RESIDENTIAL"]
[]
[]
["C.","AVERAGE LOAN-TO-VALUE RATIOS ON NEW MORTGAGES GRANTED (PER CENT NUMBER ONLY). E.G. ratio 10.25% is entered as 10.25"]
[]
[]
["1 .","RESIDENTIAL",null,null,"LAND ONLY",null,null,null,null,null,"LAND AND HOUSE"]
[]
["2 .","NON - RESIDENTIAL",null,null,"LAND ONLY",null,null,null,null,null,"LAND AND BUILDING"]
[]
[]
["D.","NUMBER OF DISCLOSURE STATEMENTS DISTRIBUTED"]
[]
[]
[null,null,null,null,null,null,null,null,"RESIDENTIAL MORTGAGES"]
[null,"FIXED RATE MORTGAGES"]
[]
[null,"VARIABLE RATE MORTGAGES"]
[]
[null,"ADJUSTABLE RATE MORTGAGES"]

{"sheet":"PAGE5","index":9,"n_rows":114,"n_cols":25,"rows_kept":114,"cut":false,"hidden":false,"merged":[]}
[]
[null,null,null,null,null,null,null,null,null,null,null,null,null,null,null,null,null,"CB 30A/5"]
[]
["CENTRAL BANK OF TRINIDAD AND TOBAGO"]
[]
["REAL ESTATE MORTGAGE LOANS GRANTED/DISBURSED QUARTERLY"]
[]
["C.  SECTOR AND TYPE"]
[]
[]
[null,null,null,null,null,null,null,null,null,null,null,null,null,null,null,"TOTAL GRANTED/DISBURSED"]
["A.","SECTOR AND TYPE",null,null,"FIXED RATE",null,null,null,"VARIABLE RATE ",null,null,null,"ADJUSTABLE RATE",null,null,"DURING"]
[null,null,null,null,null,null,null,null,null,null,null,null,null,null,null,"QUARTER"]
[]
[null,null,"NO.",null,"VALUE",null,"NO.",null,"VALUE",null,"NO.",null,"VALUE",null,null,"NO.",null,"VALUE"]
[null,null,null,null,"( $000 )",null,null,null,"( $000 )",null,null,null,"( $000 )",null,null,null,null,"( $000 )"]
[]
["1 .","PUBLIC SECTOR"]
[]
[null,"3.0% and Under",null,null,null,null,null,null,null,null,null,null,null,null,null,{"$f":"C20+G20+K20","v":0},null,{"$f":"E20+I20+M20","v":0}]
[null,"3.1%  4.0% ",null,null,null,null,null,null,null,null,null,null,null,null,null,0,null,0]
[null,"4.1%  5.0% ",null,null,null,null,null,null,null,null,null,null,null,null,null,0,null,0]
[null,"5.1%  6.0% ",null,null,null,null,null,null,null,null,null,null,null,null,null,0,null,0]
[null,"6.1%  7.0%",null,null,null,null,null,null,null,null,null,null,null,null,null,0,null,0]
[null,"7.1%  8.0%",null,null,null,null,null,null,null,null,null,null,null,null,null,0,null,0]
[null,"8.1%  9.0%",null,null,null,null,null,null,null,null,null,null,null,null,null,0,null,0]
[null,"9.1%  10.0%",null,null,null,null,null,null,null,null,null,null,null,null,null,0,null,0]
[null,"10.1%  11.0%",null,null,null,null,null,null,null,null,null,null,null,null,null,0,null,0]
[null,"11.1%  12.0%",null,null,null,null,null,null,null,null,null,null,null,null,null,0,null,0]
[null,"12.1%  13.0%",null,null,null,null,null,null,null,null,null,null,null,null,null,0,null,0]
[null,"13.1%  14.0%",null,null,null,null,null,null,null,null,null,null,null,null,null,0,null,0]
[null,"14.1%  15.0%",null,null,null,null,null,null,null,null,null,null,null,null,null,0,null,0]
[null,"15.1% and Over",null,null,null,null,null,null,null,null,null,null,null,null,null,0,null,0]
[]
[null,"SUB TOTAL",{"$f":"SUM(C20:C33)","v":0},null,{"$f":"SUM(E20:E33)","v":0},null,{"$f":"SUM(G20:G33)","v":0},null,{"$f":"SUM(I20:I33)","v":0},null,{"$f":"SUM(K20:K33)","v":0},null,{"$f":"SUM(M20:M33)","v":0},null,null,{"$f":"SUM(P20:P33)","v":0},null,{"$f":"SUM(R20:R33)","v":0}]
[]
["2 .","PRIVATE FINANCIAL"]
[null,"INSTITUTIONS"]
[null,"3.0% and Under",null,null,null,null,null,null,null,null,null,null,null,null,null,{"$f":"C39+G39+K39","v":0},null,{"$f":"E39+I39+M39","v":0}]
[null,"3.1%  4.0% ",null,null,null,null,null,null,null,null,null,null,null,null,null,0,null,0]
[null,"4.1%  5.0% ",null,null,null,null,null,null,null,null,null,null,null,null,null,0,null,0]
[null,"5.1%  6.0% ",null,null,null,null,null,null,null,null,null,null,null,null,null,0,null,0]
[null,"6.1%  7.0%",null,null,null,null,null,null,null,null,null,null,null,null,null,0,null,0]
[null,"7.1%  8.0%",null,null,null,null,null,null,null,null,null,null,null,null,null,0,null,0]
[null,"8.1%  9.0%",null,null,null,null,null,null,null,null,null,null,null,null,null,0,null,0]
[null,"9.1%  10.0%",null,null,null,null,null,null,null,null,null,null,null,null,null,0,null,0]
[null,"10.1%  11.0%",null,null,null,null,null,null,null,null,null,null,null,null,null,0,null,0]
[null,"11.1%  12.0%",null,null,null,null,null,null,null,null,null,null,null,null,null,0,null,0]
[null,"12.1%  13.0%",null,null,null,null,null,null,null,null,null,null,null,null,null,0,null,0]
[null,"13.1%  14.0%",null,null,null,null,null,null,null,null,null,null,null,null,null,0,null,0]
[null,"14.1%  15.0%",null,null,null,null,null,null,null,null,null,null,null,null,null,0,null,0]
[null,"15.1% and Over",null,null,null,null,null,null,null,null,null,null,null,null,null,0,null,0]
[]
[null,"SUB TOTAL",{"$f":"SUM(C39:C52)","v":0},null,{"$f":"SUM(E39:E52)","v":0},null,{"$f":"SUM(G39:G52)","v":0},null,{"$f":"SUM(I39:I52)","v":0},null,{"$f":"SUM(K39:K52)","v":0},null,{"$f":"SUM(M39:M52)","v":0},null,null,{"$f":"SUM(P39:P52)","v":0},null,{"$f":"SUM(R39:R52)","v":0}]
[]
["3 .","INCORPORATED "]
[null,"BUSINESSES"]
[null,"3.0% and Under",null,null,null,null,null,null,null,null,null,null,null,null,null,{"$f":"C58+G58+K58","v":0},null,{"$f":"E58+I58+M58","v":0}]
[null,"3.1%  4.0% ",null,null,null,null,null,null,null,null,null,null,null,null,null,0,null,0]
[null,"4.1%  5.0% ",null,null,null,null,null,null,null,null,null,null,null,null,null,0,null,0]
[null,"5.1%  6.0% ",null,null,null,null,null,null,null,null,null,null,null,null,null,0,null,0]
[null,"6.1%  7.0%",null,null,null,null,null,null,null,null,null,null,null,null,null,0,null,0]
[null,"7.1%  8.0%",null,null,null,null,null,null,null,null,null,null,null,null,null,0,null,0]
[null,"8.1%  9.0%",null,null,null,null,null,null,null,null,null,null,null,null,null,0,null,0]
[null,"9.1%  10.0%",null,null,null,null,null,null,null,null,null,null,null,null,null,0,null,0]
[null,"10.1%  11.0%",null,null,null,null,null,null,null,null,null,null,null,null,null,0,null,0]
[null,"11.1%  12.0%",null,null,null,null,null,null,null,null,null,null,null,null,null,0,null,0]
[null,"12.1%  13.0%",null,null,null,null,null,null,null,null,null,null,null,null,null,0,null,0]
[null,"13.1%  14.0%",null,null,null,null,null,null,null,null,null,null,null,null,null,0,null,0]
[null,"14.1%  15.0%",null,null,null,null,null,null,null,null,null,null,null,null,null,0,null,0]
[null,"15.1% and Over",null,null,null,null,null,null,null,null,null,null,null,null,null,0,null,0]
[]
[null,"SUB TOTAL",{"$f":"SUM(C58:C71)","v":0},null,{"$f":"SUM(E58:E71)","v":0},null,{"$f":"SUM(G58:G71)","v":0},null,{"$f":"SUM(I58:I71)","v":0},null,{"$f":"SUM(K58:K71)","v":0},null,{"$f":"SUM(M58:M71)","v":0},null,null,{"$f":"SUM(P58:P71)","v":0},null,{"$f":"SUM(R58:R71)","v":0}]
[]
["4 .","UNINCORPORATED "]
[null,"BUSINESSES"]
[null,"3.0% and Under",null,null,null,null,null,null,null,null,null,null,null,null,null,{"$f":"C77+G77+K77","v":0},null,{"$f":"E77+I77+M77","v":0}]
[null,"3.1%  4.0% ",null,null,null,null,null,null,null,null,null,null,null,null,null,0,null,0]
[null,"4.1%  5.0% ",null,null,null,null,null,null,null,null,null,null,null,null,null,0,null,0]
[null,"5.1%  6.0% ",null,null,null,null,null,null,null,null,null,null,null,null,null,0,null,0]
[null,"6.1%  7.0%",null,null,null,null,null,null,null,null,null,null,null,null,null,0,null,0]
[null,"7.1%  8.0%",null,null,null,null,null,null,null,null,null,null,null,null,null,0,null,0]
[null,"8.1%  9.0%",null,null,null,null,null,null,null,null,null,null,null,null,null,0,null,0]
[null,"9.1%  10.0%",null,null,null,null,null,null,null,null,null,null,null,null,null,0,null,0]
[null,"10.1%  11.0%",null,null,null,null,null,null,null,null,null,null,null,null,null,0,null,0]
[null,"11.1%  12.0%",null,null,null,null,null,null,null,null,null,null,null,null,null,0,null,0]
[null,"12.1%  13.0%",null,null,null,null,null,null,null,null,null,null,null,null,null,0,null,0]
[null,"13.1%  14.0%",null,null,null,null,null,null,null,null,null,null,null,null,null,0,null,0]
[null,"14.1%  15.0%",null,null,null,null,null,null,null,null,null,null,null,null,null,0,null,0]
[null,"15.1% and Over",null,null,null,null,null,null,null,null,null,null,null,null,null,0,null,0]
[]
[null,"SUB TOTAL",{"$f":"SUM(C77:C90)","v":0},null,{"$f":"SUM(E77:E90)","v":0},null,{"$f":"SUM(G77:G90)","v":0},null,{"$f":"SUM(I77:I90)","v":0},null,{"$f":"SUM(K77:K90)","v":0},null,{"$f":"SUM(M77:M90)","v":0},null,null,{"$f":"SUM(P77:P90)","v":0},null,{"$f":"SUM(R77:R90)","v":0}]
[]
["5 . ","CONSUMERS"]
[null,"3.0% and Under",null,null,null,null,null,null,null,null,null,null,null,null,null,{"$f":"C95+G95+K95","v":0},null,{"$f":"E95+I95+M95","v":0}]
[null,"3.1%  4.0% ",null,null,null,null,null,null,null,null,null,null,null,null,null,0,null,0]
[null,"4.1%  5.0% ",null,null,null,null,null,null,null,null,null,null,null,null,null,0,null,0]
[null,"5.1%  6.0% ",null,null,null,null,null,null,null,null,null,null,null,null,null,0,null,0]
[null,"6.1%  7.0%",null,null,null,null,null,null,null,null,null,null,null,null,null,0,null,0]
[null,"7.1%  8.0%",null,null,null,null,null,null,null,null,null,null,null,null,null,0,null,0]
[null,"8.1%  9.0%",null,null,null,null,null,null,null,null,null,null,null,null,null,0,null,0]
[null,"9.1%  10.0%",null,null,null,null,null,null,null,null,null,null,null,null,null,0,null,0]
[null,"10.1%  11.0%",null,null,null,null,null,null,null,null,null,null,null,null,null,0,null,0]
[null,"11.1%  12.0%",null,null,null,null,null,null,null,null,null,null,null,null,null,0,null,0]
[null,"12.1%  13.0%",null,null,null,null,null,null,null,null,null,null,null,null,null,0,null,0]
[null,"13.1%  14.0%",null,null,null,null,null,null,null,null,null,null,null,null,null,0,null,0]
[null,"14.1%  15.0%",null,null,null,null,null,null,null,null,null,null,null,null,null,0,null,0]
[null,"15.1% and Over",null,null,null,null,null,null,null,null,null,null,null,null,null,0,null,0]
[]
[null,"SUB TOTAL",{"$f":"SUM(C95:C108)","v":0},null,{"$f":"SUM(E95:E108)","v":0},null,{"$f":"SUM(G95:G108)","v":0},null,{"$f":"SUM(I95:I108)","v":0},null,{"$f":"SUM(K95:K108)","v":0},null,{"$f":"SUM(M95:M108)","v":0},null,null,{"$f":"SUM(P95:P108)","v":0},null,{"$f":"SUM(R95:R108)","v":0}]
[]
[null,"T O T A L",{"$f":"SUM(C35+C54+C73+C92+C110)","v":0},null,{"$f":"SUM(E35+E54+E73+E92+E110)","v":0},null,{"$f":"SUM(G35+G54+G73+G92+G110)","v":0},null,{"$f":"SUM(I35+I54+I73+I92+I110)","v":0},null,{"$f":"SUM(K35+K54+K73+K92+K110)","v":0},null,{"$f":"SUM(M35+M54+M73+M92+M110)","v":0},null,null,{"$f":"SUM(P35+P54+P73+P92+P110)","v":0},null,{"$f":"SUM(R35+R54+R73+R92+R110)","v":0}]
[null,null,null,null,null,null,null,null,null,null,null,null,null,null,null,null,null,null,null,null,null," "," "," "," "]
[null,null,null,null,null,null,null,null,null,null,null,null,null,null,null,null,null,null,null,null,null," "," "," "," "]

{"sheet":"PAGE6","index":10,"n_rows":113,"n_cols":25,"rows_kept":113,"cut":false,"hidden":false,"merged":[]}
[]
[null,null,null,null,null,null,null,null,null,null,null,null,null,null,null,null,null,"CB 30A/6"]
[]
["CENTRAL BANK OF TRINIDAD AND TOBAGO"]
[]
["OUTSTANDING REAL ESTATE MORTGAGES  QUARTERLY"]
[]
["C.  SECTOR AND TYPE"]
[]
[]
[null,null,null,null,null,null,null,null,null,null,null,null,null,null,null,"OUTSTANDING"]
["A.","SECTOR AND TYPE",null,null,"FIXED RATE",null,null,null,"VARIABLE RATE ",null,null,null,"ADJUSTABLE RATE",null,null,"BALANCE AS AT"]
[null,null,null,null,null,null,null,null,null,null,null,null,null,null,null,"QUARTER END"]
[]
[null,null,"NO.",null,"VALUE",null,"NO.",null,"VALUE",null,"NO.",null,"VALUE",null,null,"NO.",null,"VALUE"]
[null,null,null,null,"( $000 )",null,null,null,"( $000 )",null,null,null,"( $000 )",null,null,null,null,"( $000 )"]
[]
["1 .","PUBLIC SECTOR"]
[null,"3.0% and Under",null,null,null,null,null,null,null,null,null,null,null,null,null,{"$f":"C19+G19+K19","v":0},null,{"$f":"E19+I19+M19","v":0}]
[null,"3.1%  4.0% ",null,null,null,null,null,null,null,null,null,null,null,null,null,{"$f":"C20+G20+K20","v":0},null,{"$f":"E20+I20+M20","v":0}]
[null,"4.1%  5.0% ",null,null,null,null,null,null,null,null,null,null,null,null,null,0,null,0]
[null,"5.1%  6.0% ",null,null,null,null,null,null,null,null,null,null,null,null,null,0,null,0]
[null,"6.1%  7.0%",null,null,null,null,null,null,null,null,null,null,null,null,null,0,null,0]
[null,"7.1%  8.0%",null,null,null,null,null,null,null,null,null,null,null,null,null,0,null,0]
[null,"8.1%  9.0%",null,null,null,null,null,null,null,null,null,null,null,null,null,0,null,0]
[null,"9.1%  10.0%",null,null,null,null,null,null,null,null,null,null,null,null,null,0,null,0]
[null,"10.1%  11.0%",null,null,null,null,null,null,null,null,null,null,null,null,null,0,null,0]
[null,"11.1%  12.0%",null,null,null,null,null,null,null,null,null,null,null,null,null,0,null,0]
[null,"12.1%  13.0%",null,null,null,null,null,null,null,null,null,null,null,null,null,0,null,0]
[null,"13.1%  14.0%",null,null,null,null,null,null,null,null,null,null,null,null,null,0,null,0]
[null,"14.1%  15.0%",null,null,null,null,null,null,null,null,null,null,null,null,null,0,null,0]
[null,"15.1% and Over",null,null,null,null,null,null,null,null,null,null,null,null,null,0,null,0]
[]
[null,"SUB TOTAL",{"$f":"SUM(C19:C32)","v":0},null,{"$f":"SUM(E19:E32)","v":0},null,{"$f":"SUM(G19:G32)","v":0},null,{"$f":"SUM(I19:I32)","v":0},null,{"$f":"SUM(K19:K32)","v":0},null,{"$f":"SUM(M19:M32)","v":0},null,null,{"$f":"SUM(P19:P32)","v":0},null,{"$f":"SUM(R19:R32)","v":0}]
[]
["2 .","PRIVATE FINANCIAL"]
[null,"INSTITUTIONS"]
[null,"3.0% and Under",null,null,null,null,null,null,null,null,null,null,null,null,null,{"$f":"C38+G38+K38","v":0},null,{"$f":"E38+I38+M38","v":0}]
[null,"3.1%  4.0% ",null,null,null,null,null,null,null,null,null,null,null,null,null,{"$f":"C39+G39+K39","v":0},null,{"$f":"E39+I39+M39","v":0}]
[null,"4.1%  5.0% ",null,null,null,null,null,null,null,null,null,null,null,null,null,0,null,0]
[null,"5.1%  6% ",null,null,null,null,null,null,null,null,null,null,null,null,null,0,null,0]
[null,"6.1%  7.0%",null,null,null,null,null,null,null,null,null,null,null,null,null,0,null,0]
[null,"7.1%  8.0%",null,null,null,null,null,null,null,null,null,null,null,null,null,0,null,0]
[null,"8.1%  9.0%",null,null,null,null,null,null,null,null,null,null,null,null,null,0,null,0]
[null,"9.1%  10.0%",null,null,null,null,null,null,null,null,null,null,null,null,null,0,null,0]
[null,"10.1%  11.0%",null,null,null,null,null,null,null,null,null,null,null,null,null,0,null,0]
[null,"11.1%  12.0%",null,null,null,null,null,null,null,null,null,null,null,null,null,0,null,0]
[null,"12.1%  13.0%",null,null,null,null,null,null,null,null,null,null,null,null,null,0,null,0]
[null,"13.1%  14.0%",null,null,null,null,null,null,null,null,null,null,null,null,null,0,null,0]
[null,"14.1%  15.0%",null,null,null,null,null,null,null,null,null,null,null,null,null,0,null,0]
[null,"15.1% and Over",null,null,null,null,null,null,null,null,null,null,null,null,null,0,null,0]
[]
[null,"SUB TOTAL",{"$f":"SUM(C38:C51)","v":0},null,{"$f":"SUM(E38:E51)","v":0},null,{"$f":"SUM(G38:G51)","v":0},null,{"$f":"SUM(I38:I51)","v":0},null,{"$f":"SUM(K38:K51)","v":0},null,{"$f":"SUM(M38:M51)","v":0},null,null,{"$f":"SUM(P38:P51)","v":0},null,{"$f":"SUM(R38:R51)","v":0}]
[]
["3 .","INCORPORATED "]
[null,"BUSINESSES"]
[null,"3.0% and Under",null,null,null,null,null,null,null,null,null,null,null,null,null,{"$f":"C57+G57+K57","v":0},null,{"$f":"E57+I57+M57","v":0}]
[null,"3.1%  4.0% ",null,null,null,null,null,null,null,null,null,null,null,null,null,{"$f":"C58+G58+K58","v":0},null,{"$f":"E58+I58+M58","v":0}]
[null,"4.1%  5.0% ",null,null,null,null,null,null,null,null,null,null,null,null,null,0,null,0]
[null,"5.1%  6.0% ",null,null,null,null,null,null,null,null,null,null,null,null,null,0,null,0]
[null,"6.1%  7.0%",null,null,null,null,null,null,null,null,null,null,null,null,null,0,null,0]
[null,"7.1%  8.0%",null,null,null,null,null,null,null,null,null,null,null,null,null,0,null,0]
[null,"8.1%  9.0%",null,null,null,null,null,null,null,null,null,null,null,null,null,0,null,0]
[null,"9.1%  10.0%",null,null,null,null,null,null,null,null,null,null,null,null,null,0,null,0]
[null,"10.1%  11.0%",null,null,null,null,null,null,null,null,null,null,null,null,null,0,null,0]
[null,"11.1%  12.0%",null,null,null,null,null,null,null,null,null,null,null,null,null,0,null,0]
[null,"12.1%  13.0%",null,null,null,null,null,null,null,null,null,null,null,null,null,0,null,0]
[null,"13.1%  14.0%",null,null,null,null,null,null,null,null,null,null,null,null,null,0,null,0]
[null,"14.1%  15.0%",null,null,null,null,null,null,null,null,null,null,null,null,null,0,null,0]
[null,"15.1% and Over",null,null,null,null,null,null,null,null,null,null,null,null,null,0,null,0]
[]
[null,"SUB TOTAL",{"$f":"SUM(C57:C70)","v":0},null,{"$f":"SUM(E57:E70)","v":0},null,{"$f":"SUM(G57:G70)","v":0},null,{"$f":"SUM(I57:I70)","v":0},null,{"$f":"SUM(K57:K70)","v":0},null,{"$f":"SUM(M57:M70)","v":0},null,null,{"$f":"SUM(P57:P70)","v":0},null,{"$f":"SUM(R57:R70)","v":0}]
[]
["4 .","UNINCORPORATED "]
[null,"BUSINESSES"]
[null,"3.0% and Under",null,null,null,null,null,null,null,null,null,null,null,null,null,{"$f":"C76+G76+K76","v":0},null,{"$f":"E76+I76+M76","v":0}]
[null,"3.1%  4.0% ",null,null,null,null,null,null,null,null,null,null,null,null,null,{"$f":"C77+G77+K77","v":0},null,{"$f":"E77+I77+M77","v":0}]
[null,"4.1%  5.0% ",null,null,null,null,null,null,null,null,null,null,null,null,null,0,null,0]
[null,"5.1%  6.0% ",null,null,null,null,null,null,null,null,null,null,null,null,null,0,null,0]
[null,"6.1%  7.0%",null,null,null,null,null,null,null,null,null,null,null,null,null,0,null,0]
[null,"7.1%  8.0%",null,null,null,null,null,null,null,null,null,null,null,null,null,0,null,0]
[null,"8.1%  9.0%",null,null,null,null,null,null,null,null,null,null,null,null,null,0,null,0]
[null,"9.1%  10.0%",null,null,null,null,null,null,null,null,null,null,null,null,null,0,null,0]
[null,"10.1%  11.0%",null,null,null,null,null,null,null,null,null,null,null,null,null,0,null,0]
[null,"11.1%  12.0%",null,null,null,null,null,null,null,null,null,null,null,null,null,0,null,0]
[null,"12.1%  13.0%",null,null,null,null,null,null,null,null,null,null,null,null,null,0,null,0]
[null,"13.1%  14.0%",null,null,null,null,null,null,null,null,null,null,null,null,null,0,null,0]
[null,"14.1%  15.0%",null,null,null,null,null,null,null,null,null,null,null,null,null,0,null,0]
[null,"15.1% and Over",null,null,null,null,null,null,null,null,null,null,null,null,null,0,null,0]
[]
[null,"SUB TOTAL",{"$f":"SUM(C76:C89)","v":0},null,{"$f":"SUM(E76:E89)","v":0},null,{"$f":"SUM(G76:G89)","v":0},null,{"$f":"SUM(I76:I89)","v":0},null,{"$f":"SUM(K76:K89)","v":0},null,{"$f":"SUM(M76:M89)","v":0},null,null,{"$f":"SUM(P76:P89)","v":0},null,{"$f":"SUM(R76:R89)","v":0}]
[]
["5 . ","CONSUMERS"]
[null,"3.0% and Under",null,null,null,null,null,null,null,null,null,null,null,null,null,{"$f":"C94+G94+K94","v":0},null,{"$f":"E94+I94+M94","v":0}]
[null,"3.1%  4% ",null,null,null,null,null,null,null,null,null,null,null,null,null,{"$f":"C95+G95+K95","v":0},null,{"$f":"E95+I95+M95","v":0}]
[null,"4.1%  5% ",null,null,null,null,null,null,null,null,null,null,null,null,null,0,null,0]
[null,"5.1%  6% ",null,null,null,null,null,null,null,null,null,null,null,null,null,0,null,0]
[null,"6.1%  7.0%",null,null,null,null,null,null,null,null,null,null,null,null,null,0,null,0]
[null,"7.1%  8.0%",null,null,null,null,null,null,null,null,null,null,null,null,null,0,null,0]
[null,"8.1%  9.0%",null,null,null,null,null,null,null,null,null,null,null,null,null,0,null,0]
[null,"9.1%  10.0%",null,null,null,null,null,null,null,null,null,null,null,null,null,0,null,0]
[null,"10.1%  11.0%",null,null,null,null,null,null,null,null,null,null,null,null,null,0,null,0]
[null,"11.1%  12.0%",null,null,null,null,null,null,null,null,null,null,null,null,null,0,null,0]
[null,"12.1%  13.0%",null,null,null,null,null,null,null,null,null,null,null,null,null,0,null,0]
[null,"13.1%  14.0%",null,null,null,null,null,null,null,null,null,null,null,null,null,0,null,0]
[null,"14.1%  15.0%",null,null,null,null,null,null,null,null,null,null,null,null,null,0,null,0]
[null,"15.1% and Over",null,null,null,null,null,null,null,null,null,null,null,null,null,{"$f":"C107+G107+K107","v":0},null,0]
[]
[null,"SUB TOTAL",{"$f":"SUM(C94:C107)","v":0},null,{"$f":"SUM(E94:E107)","v":0},null,{"$f":"SUM(G94:G107)","v":0},null,{"$f":"SUM(I94:I107)","v":0},null,{"$f":"SUM(K94:K107)","v":0},null,{"$f":"SUM(M94:M107)","v":0},null,null,{"$f":"SUM(P94:P107)","v":0},null,{"$f":"SUM(R94:R107)","v":0}]
[]
[null,"T O T A L",{"$f":"SUM(C34+C53+C72+C91+C109)","v":0},null,{"$f":"SUM(E34+E53+E72+E91+E109)","v":0},null,{"$f":"SUM(G34+G53+G72+G91+G109)","v":0},null,{"$f":"SUM(I34+I53+I72+I91+I109)","v":0},null,{"$f":"SUM(K34+K53+K72+K91+K109)","v":0},null,{"$f":"SUM(M34+M53+M72+M91+M109)","v":0},null,null,{"$f":"SUM(P34+P53+P72+P91+P109)","v":0},null,{"$f":"SUM(R34+R53+R72+R91+R109)","v":0}]
[null,null,null,null,null,null,null,null,null,null,null,null,null,null,null,null,null,null,null,null,null," "," "," "," "]
[null,null,null,null,null,null,null,null,null,null,null,null,null,null,null,null,null,null,null,null,null," "," "," "," "]

{"sheet":"PAGE7","index":11,"n_rows":32,"n_cols":18,"rows_kept":32,"cut":false,"hidden":false,"merged":[[2,0,2,17],[3,0,3,17],[4,0,4,17]]}
[null,null,null,null,null,null,null,null,null,null,null,null,null,null,null,null,null,"CB 30A/7"]
[]
["CENTRAL BANK OF TRINIDAD AND TOBAGO"]
[" NEW REAL ESTATE MORTGAGES "]
["D. BY AGREED PERIOD OF REPAYMENT AND TYPE"]
[]
[]
[]
["AGREED PERIOD OF",null,"NO.",null,"VALUE OF",null,"NO.",null,"VALUE OF",null,"NO.",null," VALUE OF",null,null,"NO.",null,"TOTAL VALUE OF"]
["REPAYMENT",null,null,null,"FRMs",null,null,null,"VRMs",null,null,null,"ARMs",null,null,null,null,"NEW MORTGAGES"]
[null,null,"( # )",null,"( $000 )",null,"( # )",null,"( $000 )",null,"( # )",null,"( $000 )",null,null,"( # )",null,"( $000 )"]
[]
[]
["Up to 5 years",null,null,null,null,null,null,null,null,null,null,null,null,null,null,{"$f":"C14+G14+K14","v":0},null,{"$f":"E14+I14+M14","v":0}]
[]
["Over 5 years to 10 years",null,null,null,null,null,null,null,null,null,null,null,null,null,null,{"$f":"C16+G16+K16","v":0},null,{"$f":"E16+I16+M16","v":0}]
[]
["Over 10 years to 15 years",null,null,null,null,null,null,null,null,null,null,null,null,null,null,{"$f":"C18+G18+K18","v":0},null,{"$f":"E18+I18+M18","v":0}]
[]
["Over 15 years to 20 years",null,null,null,null,null,null,null,null,null,null,null,null,null,null,{"$f":"C20+G20+K20","v":0},null,{"$f":"E20+I20+M20","v":0}]
[]
["Over 20 years to 25 years",null,null,null,null,null,null,null,null,null,null,null,null,null,null,{"$f":"C22+G22+K22","v":0},null,{"$f":"E22+I22+M22","v":0}]
[]
["Over 25 year to 30 years",null,null,null,null,null,null,null,null,null,null,null,null,null,null,{"$f":"C24+G24+K24","v":0},null,{"$f":"E24+I24+M24","v":0}]
[]
["Over 30 years",null,null,null,null,null,null,null,null,null,null,null,null,null,null,{"$f":"C26+G26+K26","v":0},null,{"$f":"E26+I26+M26","v":0}]
[]
["Maximum Period(30Yrs)",null,null,null,null,null,null,null,null,null,null,null,null,null,null,{"$f":"C28+G28+K28","v":0},null,{"$f":"E28+I28+M28","v":0}]
[]
["Unspecified",null,null,null,null,null,null,null,null,null,null,null,null,null,null,{"$f":"C30+G30+K30","v":0},null,{"$f":"E30+I30+M30","v":0}]
[]
["T O T A L",null,{"$f":"C14+C16+C18+C20+C22+C24+C26","v":0},null,{"$f":"E14+E16+E18+E20+E22+E24+E26","v":0},null,{"$f":"G14+G16+G18+G20+G22+G24+G26","v":0},null,{"$f":"I14+I16+I18+I20+I22+I24+I26","v":0},null,{"$f":"K14+K16+K18+K20+K22+K24+K26","v":0},null,{"$f":"M14+M16+M18+M20+M22+M24+M26","v":0},null,null,{"$f":"P14+P16+P18+P20+P22+P24+P26","v":0},null,{"$f":"R14+R16+R18+R20+R22+R24+R26","v":0}]

{"sheet":"PAGE8","index":12,"n_rows":72,"n_cols":32,"rows_kept":72,"cut":false,"hidden":false,"merged":[]}
[]
[null,null,null,null,null,null,null,null,null,null,null,null,null,null,null,null,null,null,null,null,null,null,null,null,"CB 30A/8"]
[]
["CENTRAL BANK OF TRINIDAD AND TOBAGO"]
[]
["INTEREST RATE SCHEDULE  REAL ESTATE MORTGAGE LOANS  QUARTERLY"]
[]
["E.  ACTUAL LOAN RATES  SECTOR AND TYPE"]
[]
[]
[]
[null,null,"APPROVED",null,null,null,"INTEREST",null,null,null,"DISBURSED",null,null,null,"INTEREST",null,null,null,"OUTSTANDING",null,null,null,"INTEREST"]
["A.","FIXED RATE","DURING",null,null,null,"MARGIN",null,null,null,"DURING",null,null,null,"MARGIN",null,null,null,"BALANCE AS AT",null,null,null,"MARGIN"]
[null,null,"QUARTER",null,null,null,"APPLIED",null,null,null,"QUARTER ",null,null,null,"APPLIED",null,null,null,"QUARTER END",null,null,null,"APPLIED"]
[]
[null,null,"LOWEST",null,"HIGHEST",null,"LOWEST",null,"HIGHEST",null,"LOWEST",null,"HIGHEST",null,"LOWEST",null,"HIGHEST",null,"LOWEST",null,"HIGHEST",null,"LOWEST",null,"HIGHEST"]
[]
[]
["1 .","PUBLIC SECTOR"]
[]
["2 .","PRIVATE FINANCIAL"]
[null,"INSTITUTIONS"]
[]
["3 .","INCORPORATED "]
[null,"BUSINESSES"]
[]
["4 .","UNINCORPORATED "]
[null,"BUSINESSES"]
[]
["5 . ","CONSUMERS"]
[]
[null,null,null,null,null,null,null,null,null,null,null,null,null,null,null,null,null,null,null,null,null,null,null,null,null,null,null,null," "," "," "," "]
[null,null,"APPROVED",null,null,null,"INTEREST",null,null,null,"DISBURSED",null,null,null,"INTEREST",null,null,null,"OUTSTANDING",null,null,null,"INTEREST",null,null,null,null,null," "," "," "," "]
["B.","VARIABLE RATE","DURING",null,null,null,"MARGIN",null,null,null,"DURING",null,null,null,"MARGIN",null,null,null,"BALANCE AS AT",null,null,null,"MARGIN"]
[null,null,"QUARTER",null,null,null,"APPLIED",null,null,null,"QUARTER ",null,null,null,"APPLIED",null,null,null,"QUARTER END",null,null,null,"APPLIED"]
[]
[null,null,"LOWEST",null,"HIGHEST",null,"LOWEST",null,"HIGHEST",null,"LOWEST",null,"HIGHEST",null,"LOWEST",null,"HIGHEST",null,"LOWEST",null,"HIGHEST",null,"LOWEST",null,"HIGHEST"]
[]
[]
[null,"PUBLIC SECTOR"]
[]
[null,"PRIVATE FINANCIAL"]
[null,"INSTITUTIONS"]
[]
[null,"INCORPORATED "]
[null,"BUSINESSES"]
[]
[null,"UNINCORPORATED "]
[null,"BUSINESSES"]
[]
[null,"CONSUMERS"]
[]
[]
[null,null,"APPROVED",null,null,null,"INTEREST",null,null,null,"DISBURSED",null,null,null,"INTEREST",null,null,null,"OUTSTANDING",null,null,null,"INTEREST"]
["A.","ADJUSTABLE RATE","DURING",null,null,null,"MARGIN",null,null,null,"DURING",null,null,null,"MARGIN",null,null,null,"BALANCE AS AT",null,null,null,"MARGIN"]
[null,null,"QUARTER",null,null,null,"APPLIED",null,null,null,"QUARTER ",null,null,null,"APPLIED",null,null,null,"QUARTER END",null,null,null,"APPLIED"]
[]
[null,null,"LOWEST",null,"HIGHEST",null,"LOWEST",null,"HIGHEST",null,"LOWEST",null,"HIGHEST",null,"LOWEST",null,"HIGHEST",null,"LOWEST",null,"HIGHEST",null,"LOWEST",null,"HIGHEST"]
[]
[]
[null,"PUBLIC SECTOR"]
[]
[null,"PRIVATE FINANCIAL"]
[null,"INSTITUTIONS"]
[]
[null,"INCORPORATED "]
[null,"BUSINESSES"]
[]
[null,"UNINCORPORATED "]
[null,"BUSINESSES"]
[]
[null,"CONSUMERS"]

{"sheet":"PAGE9","index":13,"n_rows":22,"n_cols":9,"rows_kept":22,"cut":false,"hidden":false,"merged":[]}
[]
[null,null,null,null,null,null,null,null,"CB 30A/9"]
[]
["CENTRAL BANK OF TRINIDAD AND TOBAGO"]
["TRUSTEE FUNDS - INVESTMENT PORTFOLIO FOR REAL ESTATE MORTGAGES"]
[]
[]
[]
[]
["TOTAL FUNDS UNDER ADMINISTRATION",null,null,null,null,null,null,null,"( $ 000 )"]
[]
[]
["REAL ESTATE MORTGAGE LOANS ",null,null,"- TOTAL",null,null,null,null,{"$f":"I15+I17","v":0}]
[]
[null,null,null,"- RESIDENTIAL"]
[]
[null,null,null,"- NON - RESIDENTIAL"]
[]
[]
[]
[]
["TOTAL INVESTMENT IN REAL ESTATE MORTGAGES"]

{"sheet":"PAGE10","index":14,"n_rows":33,"n_cols":4,"rows_kept":33,"cut":false,"hidden":false,"merged":[]}
[null,null,null,"C.B. 30A/10"]
[]
[]
[]
[]
[null,"Name of Person Completing Form ",null,"Signature of Person Completing Form "]
[null,"(Block Letters)"]
[]
[]
[]
[]
[null,"Name of Authorised Official ",null,"Signature of Authorised Official "]
[null,"(Block Letters)"]
[]
[]
[]
[]
[null,"Position/Office Held ",null,"Date"]
[null,"(Place Company Stamp)"]
[]
[]
[]
[]
[null,"I hereby certify that data submitted in the e-copy submission are the identical values in the hard-copy return for this period."]
[]
[]
[null,"Name of Authorised Official "]
[]
[]
[null,"Position/Office Held "]
[]
[]
[null,"Date"]

{"sheet":"Controls","index":15,"n_rows":147,"n_cols":11,"rows_kept":147,"cut":false,"hidden":true,"merged":[]}
[]
[]
[null,"SELECT INSTITUTION","CODES",null,null,null,null,"DATE"]
[null,"ANSA Bank Limited ","BBDA",null,null,null,null,"2015-03-31",3,"March",15]
[null,"ANSA Merchant Bank Limited ","AMAL",null,null,null,null,"2015-06-30",6,"June",15]
[null,"Caribbean Finance Company Limited","CFC",null,null,null,null,"2015-09-30",9,"September",15]
[null,"CIBC Caribbean Bank Limited (Trinidad and Tobago)","FCIB",null,null,null,null,"2015-12-31",12,"December",15]
[null,"Citibank (Trinidad & Tobago) Limited","CITI",null,null,null,null,"2016-03-31",3,"March",16]
[null,"Citicorp Merchant Bank Limited","CMBL",null,null,null,null,"2016-06-30",6,"June",16]
[null,"Development Finance Limited ","DFL",null,null,null,null,"2016-09-30",9,"September",16]
[null,"Fidelity Finance and Leasing Company Limited ","FFL",null,null,null,null,"2016-12-31",12,"December",16]
[null,"First Citizens Bank Limited","FCB",null,null,null,null,"2017-03-31",3,"March",17]
[null,"First Citizens Depository Services Limited","FCMT",null,null,null,null,"2017-06-30",6,"June",17]
[null,"First Citizens Trustee Services Limited","FCTS",null,null,null,null,"2017-09-30",9,"September",17]
[null,"Guardian Group Trust Limited ","GAM",null,null,null,null,"2017-12-31",12,"December",17]
[null,"Island Finance Trinidad and Tobago Limited","ISFL",null,null,null,null,"2018-03-31",3,"March",18]
[null,"JMMB Bank (T&T) Limited ","ICBL",null,null,null,null,"2018-06-30",6,"June",18]
[null,"JMMB Express Finance (T&T) Limited","ITBM",null,null,null,null,"2018-09-30",9,"September",18]
[null,"Massy Finance GFC Limited ","GFC",null,null,null,null,"2018-12-31",12,"December",18]
[null,"NCB Merchant Bank (Trinidad and Tobago) Limited","TFL",null,null,null,null,"2019-03-31",3,"March",19]
[null,"RBC Investment Management (Caribbean) Limited","RBAM",null,null,null,null,"2019-06-30",6,"June",19]
[null,"RBC Merchant Bank (Caribbean) Limited","RMBF",null,null,null,null,"2019-09-30",9,"September",19]
[null,"RBC Royal Bank (Trinidad and Tobago) Limited","RBTT",null,null,null,null,"2019-12-31",12,"December",19]
[null,"RBC Trust (Trinidad and Tobago) Limited","RBT",null,null,null,null,"2020-03-31",3,"March",20]
[null,"Republic Bank Limited ","RBL",null,null,null,null,"2020-06-30",6,"June",20]
[null,"Scotia Investments Trinidad and Tobago Limited","SITT",null,null,null,null,"2020-09-30",9,"September",20]
[null,"Scotiabank Trinidad and Tobago Limited ","BNS",null,null,null,null,"2020-12-31",12,"December",20]
[null,null,null,null,null,null,null,"2021-03-31",3,"March",21]
[null,null,null,null,null,null,null,"2021-06-30",6,"June",21]
[null,null,null,null,null,null,null,"2021-09-30",9,"September",21]
[null,null,null,null,null,null,null,"2021-12-31",12,"December",21]
[null,null,null,null,null,null,null,"2022-03-31",3,"March",22]
[null,null,null,null,null,null,null,"2022-06-30",6,"June",22]
[null,null,null,null,null,null,null,"2022-09-30",9,"September",22]
[null,null,null,null,null,null,null,"2022-12-31",12,"December",22]
[null,null,null,null,null,null,null,"2023-03-31",3,"March",23]
[null,null,null,null,null,null,null,"2023-06-30",6,"June",23]
[null,null,null,null,null,null,null,"2023-09-30",9,"September",23]
[null,null,null,null,null,null,null,"2023-12-31",12,"December",23]
[null,null,null,null,null,null,null,"2024-03-31",3,"March",24]
[null,null,null,null,null,null,null,"2024-06-30",6,"June",24]
[null,null,null,null,null,null,null,"2024-09-30",9,"September",24]
[null,null,null,null,null,null,null,"2024-12-31",12,"December",24]
[null,null,null,null,null,null,null,"2025-03-31",3,"March",25]
[null,null,null,null,null,null,null,"2025-06-30",6,"June",25]
[null,null,null,null,null,null,null,"2025-09-30",9,"September",25]
[null,null,null,null,null,null,null,"2025-12-31",12,"December",25]
[null,null,null,null,null,null,null,"2026-03-31",3,"March",26]
[null,null,null,null,null,null,null,"2026-06-30",6,"June",26]
[null,null,null,null,null,null,null,"2026-09-30",9,"September",26]
[null,null,null,null,null,null,null,"2026-12-31",12,"December",26]
[null,null,null,null,null,null,null,"2027-03-31",3,"March",27]
[null,null,null,null,null,null,null,"2027-06-30",6,"June",27]
[null,null,null,null,null,null,null,"2027-09-30",9,"September",27]
[null,null,null,null,null,null,null,"2027-12-31",12,"December",27]
[null,null,null,null,null,null,null,"2028-03-31",3,"March",28]
[null,null,null,null,null,null,null,"2028-06-30",6,"June",28]
[null,null,null,null,null,null,null,"2028-09-30",9,"September",28]
[null,null,null,null,null,null,null,"2028-12-31",12,"December",28]
[null,null,null,null,null,null,null,"2029-03-31",3,"March",29]
[null,null,null,null,null,null,null,"2029-06-30",6,"June",29]
[null,null,null,null,null,null,null,"2029-09-30",9,"September",29]
[null,null,null,null,null,null,null,"2029-12-31",12,"December",29]
[null,null,null,null,null,null,null,"2030-03-31",3,"March",30]
[null,null,null,null,null,null,null,"2030-06-30",6,"June",30]
[null,null,null,null,null,null,null,"2030-09-30",9,"September",30]
[null,null,null,null,null,null,null,"2030-12-31",12,"December",30]
[null,null,null,null,null,null,null,"2031-03-31",3,"March",31]
[null,null,null,null,null,null,null,"2031-06-30",6,"June",31]
[null,null,null,null,null,null,null,"2031-09-30",9,"September",31]
[null,null,null,null,null,null,null,"2031-12-31",12,"December",31]
[null,null,null,null,null,null,null,"2032-03-31",3,"March",32]
[null,null,null,null,null,null,null,"2032-06-30",6,"June",32]
[null,null,null,null,null,null,null,"2032-09-30",9,"September",32]
[null,null,null,null,null,null,null,"2032-12-31",12,"December",32]
[null,null,null,null,null,null,null,"2033-03-31",3,"March",33]
[null,null,null,null,null,null,null,"2033-06-30",6,"June",33]
[null,null,null,null,null,null,null,"2033-09-30",9,"September",33]
[null,null,null,null,null,null,null,"2033-12-31",12,"December",33]
[null,null,null,null,null,null,null,"2034-03-31",3,"March",34]
[null,null,null,null,null,null,null,"2034-06-30",6,"June",34]
[null,null,null,null,null,null,null,"2034-09-30",9,"September",34]
[null,null,null,null,null,null,null,"2034-12-31",12,"December",34]
[null,null,null,null,null,null,null,"2035-03-31",3,"March",35]
[null,null,null,null,null,null,null,"2035-06-30",6,"June",35]
[null,null,null,null,null,null,null,"2035-09-30",9,"September",35]
[null,null,null,null,null,null,null,"2035-12-31",12,"December",35]
[null,null,null,null,null,null,null,"2036-03-31",3,"March",36]
[null,null,null,null,null,null,null,"2036-06-30",6,"June",36]
[null,null,null,null,null,null,null,"2036-09-30",9,"September",36]
[null,null,null,null,null,null,null,"2036-12-31",12,"December",36]
[null,null,null,null,null,null,null,"2037-03-31",3,"March",37]
[null,null,null,null,null,null,null,"2037-06-30",6,"June",37]
[null,null,null,null,null,null,null,"2037-09-30",9,"September",37]
[null,null,null,null,null,null,null,"2037-12-31",12,"December",37]
[null,null,null,null,null,null,null,"2038-03-31",3,"March",38]
[null,null,null,null,null,null,null,"2038-06-30",6,"June",38]
[null,null,null,null,null,null,null,"2038-09-30",9,"September",38]
[null,null,null,null,null,null,null,"2038-12-31",12,"December",38]
[null,null,null,null,null,null,null,"2039-03-31",3,"March",39]
[null,null,null,null,null,null,null,"2039-06-30",6,"June",39]
[null,null,null,null,null,null,null,"2039-09-30",9,"September",39]
[null,null,null,null,null,null,null,"2039-12-31",12,"December",39]
[null,null,null,null,null,null,null,"2040-03-31",3,"March",40]
[null,null,null,null,null,null,null,"2040-06-30",6,"June",40]
[null,null,null,null,null,null,null,"2040-09-30",9,"September",40]
[null,null,null,null,null,null,null,"2040-12-31",12,"December",40]
[null,null,null,null,null,null,null,"2041-03-31",3,"March",41]
[null,null,null,null,null,null,null,"2041-06-30",6,"June",41]
[null,null,null,null,null,null,null,"2041-09-30",9,"September",41]
[null,null,null,null,null,null,null,"2041-12-31",12,"December",41]
[null,null,null,null,null,null,null,"2042-03-31",3,"March",42]
[null,null,null,null,null,null,null,"2042-06-30",6,"June",42]
[null,null,null,null,null,null,null,"2042-09-30",9,"September",42]
[null,null,null,null,null,null,null,"2042-12-31",12,"December",42]
[null,null,null,null,null,null,null,"2043-03-31",3,"March",43]
[null,null,null,null,null,null,null,"2043-06-30",6,"June",43]
[null,null,null,null,null,null,null,"2043-09-30",9,"September",43]
[null,null,null,null,null,null,null,"2043-12-31",12,"December",43]
[null,null,null,null,null,null,null,"2044-03-31",3,"March",44]
[null,null,null,null,null,null,null,"2044-06-30",6,"June",44]
[null,null,null,null,null,null,null,"2044-09-30",9,"September",44]
[null,null,null,null,null,null,null,"2044-12-31",12,"December",44]
[null,null,null,null,null,null,null,"2045-03-31",3,"March",45]
[null,null,null,null,null,null,null,"2045-06-30",6,"June",45]
[null,null,null,null,null,null,null,"2045-09-30",9,"September",45]
[null,null,null,null,null,null,null,"2045-12-31",12,"December",45]
[null,null,null,null,null,null,null,"2046-03-31",3,"March",46]
[null,null,null,null,null,null,null,"2046-06-30",6,"June",46]
[null,null,null,null,null,null,null,"2046-09-30",9,"September",46]
[null,null,null,null,null,null,null,"2046-12-31",12,"December",46]
[null,null,null,null,null,null,null,"2047-03-31",3,"March",47]
[null,null,null,null,null,null,null,"2047-06-30",6,"June",47]
[null,null,null,null,null,null,null,"2047-09-30",9,"September",47]
[null,null,null,null,null,null,null,"2047-12-31",12,"December",47]
[null,null,null,null,null,null,null,"2048-03-31",3,"March",48]
[null,null,null,null,null,null,null,"2048-06-30",6,"June",48]
[null,null,null,null,null,null,null,"2048-09-30",9,"September",48]
[null,null,null,null,null,null,null,"2048-12-31",12,"December",48]
[null,null,null,null,null,null,null,"2049-03-31",3,"March",49]
[null,null,null,null,null,null,null,"2049-06-30",6,"June",49]
[null,null,null,null,null,null,null,"2049-09-30",9,"September",49]
[null,null,null,null,null,null,null,"2049-12-31",12,"December",49]
[null,null,null,null,null,null,null,"2050-03-31",3,"March",50]
[null,null,null,null,null,null,null,"2050-06-30",6,"June",50]
[null,null,null,null,null,null,null,"2050-09-30",9,"September",50]
[null,null,null,null,null,null,null,"2050-12-31",12,"December",50]