{"text_format":"1","workbook":"xlsx","n_sheets":16,"sheets":["COVER PAGE","General Instructions","CBTT Validations","ASCII","ASCII2","PAGE1","PAGE2","PAGE3","PAGE4 ","PAGE5","PAGE6","PAGE7","PAGE8","PAGE9","PAGE10","Controls"],"not_rendered":{"charts":0,"images":1,"macros":1,"external_links":3,"defined_names":317,"comments":0,"pivot_tables":0},"unopened":[],"bounds":{"document_bytes":16777216,"sheet_cells":100000,"rows_first":2000,"rows_last":500,"rows_between":2000,"halvings":0,"cell_chars":16384,"cell_head_chars":4096},"cells_cut":0,"cells_raw":0,"read":"whole","date_system":"1900"}

{"sheet":"COVER PAGE","index":0,"n_rows":13,"n_cols":24,"rows_kept":13,"cut":false,"hidden":false,"merged":[[1,2,1,9],[2,2,2,9],[3,2,3,9],[4,2,4,9],[5,2,5,9],[10,2,10,9],[11,4,11,7],[12,5,12,6],[6,2,6,9],[7,2,7,9],[9,2,9,4],[9,5,9,6],[9,7,9,9],[8,5,8,6]]}
[null,null,null,null," "," "," "," "]
[null,null,"CENTRAL BANK OF TRINIDAD AND TOBAGO ",null,null,null,null,null,null,null,null,null,null,null,null,null,null,null,null,null," "," "," "," "]
[null,null,"V1.2"]
[null,null,"CB30A RETURN"]
[]
[null,null,"FOR "]
[null,null,"SELECT INSTITUTION"]
[null,null,"For the Quarter Ended:"]
[null,null,null,null,"Date","2024-09-30"]
[]
[null,null,"Date Submitted:"]
[null,null,null,null,"2024-10-28"]
[null,null,null,null,null,"Type mm/dd/yyyy"]

{"sheet":"General Instructions","index":1,"n_rows":27,"n_cols":2,"rows_kept":27,"cut":false,"hidden":false,"merged":[]}
[null,"CB30A RETURN"]
[null,"Please use the CB30A instructions to complete the return using the link below. "]
[null,"CB30A INSTRUCTIONS"]
[]
[null,"GENERAL INSTRUCTIONS"]
[1,"Do not amend the structure/format."]
[2,"Do not remove the password protection."]
[3,"Do not manipulate the formulas."]
[4,"Complete Cover Page before submission. \nInstitution, reporting quarter and date submitted must be populated. "]
[5,"No blank cells.  All cells must be populated with zero where there is no data."]
[6,"N/A, N/D, NA/ND, NA and ND cannot be used in the return."]
[7,"Do not use text."]
[8,"Do not use symbols in cells (<, >, commas, full stops, apostrophe, tilde etc.) with the exception of full stops to express decimal places in the interest rates."]
[9,"Ensure when links are broken the files are checked for text references which have to be deleted/amended (#Ref, FALSE! etc.) prior to submission. Refer to section “CONVERTING TO .XLSX AND SAVING FOR SUBMISSION”  for further details."]
[10,"Ensure all values are zero in the validation tab.\nIf values are not zeros, check formulas to determine where errors may have occurred."]
{"$rows_left_out":13}
{"sheet":"CBTT Validations","index":2,"n_rows":292,"n_cols":6,"rows_kept":292,"cut":false,"hidden":false,"merged":[[1,1,2,1],[1,2,2,2]]}
["DATE CHECK",{"$f":"(TEXT(MID(RIGHT(MID(CELL(\"filename\",'COVER PAGE'!A1),FIND(\"[\",CELL(\"filename\",'COVER PAGE'!A1))+1,FIND(\"]\", CELL(\"filename\",'COVER PAGE'!A1))-FIND(\"[\",CELL(\"filename\",'COVER PAGE'!A1))-1),LEN(MID(CELL(\"filename\",'COVER PAGE'!A1),FIND(\"[\",CELL(\"filename\",'COVER PAGE'!A1))+1,FIND(\"]\", CELL(\"filename\",'COVER PAGE'!A1))-FIND(\"[\",CELL(\"filename\",'COVER PAGE'!A1))-1))-FIND(\"~\",SUBSTITUTE(MID(CELL(\"filename\",'COVER PAGE'!A1),FIND(\"[\",CELL(\"filename\",'COVER PAGE'!A1))+1,FIND(\"]\", CELL(\"filename\",'COVER PAGE'!A1))-FIND(\"[\",CELL(\"filename\",'COVER PAGE'!A1))-1),\"_\",\"~\",3))),1,7),\"yyyy-MM-dd\"))=(TEXT(TEXT(DATE(YEAR('COVER PAGE'!F9),MONTH('COVER PAGE'!F9),DAY('COVER PAGE'!F9)),\"MMM-YYYY\"),\"yyyy-MM-dd\"))","v":{"$error":"#VALUE!"}},{"$f":"IF(B1=TRUE,0,1)","v":{"$error":"#VALUE!"}}]
["INSTITUTION","ZERO-SUM CHECK","TOTAL FAILED VALIDATIONS"]
[{"$f":"VLOOKUP('COVER PAGE'!C7,Controls!B4:C28,1,FALSE)","v":{"$error":"#N/A"}}]
[null,null,{"$f":"SUM(COUNTIF(B7:B293,{\">0.00001\",\"<-0.00001\",\"Error\"}))+C1","v":{"$error":"#VALUE!"}}]
["Page 1"]
[]
["Public Sector Approvals During Quarter: Total Number = Under $450,00 + $450,001 to $750,000 + $750,001 to $1,000,000 + $1,000,001 to $1,250,000 + $1,250,001 to $1,500,000 + $1,500,001 to $1,750,000 + $1,750,001 to $2,000,000 + $2,000,001 to $2,250,000 + $2,250,001 to $2,500,000 + $2,500,001 to $2,750,000 + $2,750,001 to $3,000,000 + Over $3,000,001",{"$f":"ROUND(ASCII2!B41-ASCII2!B5-ASCII2!B8-ASCII2!B11-ASCII2!B14-ASCII2!B17-ASCII2!B20-ASCII2!B23-ASCII2!B26-ASCII2!B29-ASCII2!B32-ASCII2!B35-ASCII2!B38,5)","v":0}]
["Public Sector Approvals During Quarter: Total Value = Under $450,00 + $450,001 to $750,000 + $750,001 to $1,000,000 + $1,000,001 to $1,250,000 + $1,250,001 to $1,500,000 + $1,500,001 to $1,750,000 + $1,750,001 to $2,000,000 + $2,000,001 to $2,250,000 + $2,250,001 to $2,500,000 + $2,500,001 to $2,750,000 + $2,750,001 to $3,000,000 + Over $3,000,001",{"$f":"ROUND(ASCII2!C41-ASCII2!C5-ASCII2!C8-ASCII2!C11-ASCII2!C14-ASCII2!C17-ASCII2!C20-ASCII2!C23-ASCII2!C26-ASCII2!C29-ASCII2!C32-ASCII2!C35-ASCII2!C38,5)","v":0},null,null,null,"$450,001  $750,000"]
["Public Sector Disbursements During Quarter: Total Number = Under $450,00 + $450,001 to $750,000 + $750,001 to $1,000,000 + $1,000,001 to $1,250,000 + $1,250,001 to $1,500,000 + $1,500,001 to $1,750,000 + $1,750,001 to $2,000,000 + $2,000,001 to $2,250,000 + $2,250,001 to $2,500,000 + $2,500,001 to $2,750,000 + $2,750,001 to $3,000,000 + Over $3,000,001",{"$f":"ROUND(ASCII2!B42-ASCII2!B6-ASCII2!B9-ASCII2!B12-ASCII2!B15-ASCII2!B18-ASCII2!B21-ASCII2!B24-ASCII2!B27-ASCII2!B30-ASCII2!B33-ASCII2!B36-ASCII2!B39,5)","v":0},null,null,null,"$750,001  $1,000,000"]
["Public Sector Disbursements During Quarter: Total Value = Under $450,00 + $450,001 to $750,000 + $750,001 to $1,000,000 + $1,000,001 to $1,250,000 + $1,250,001 to $1,500,000 + $1,500,001 to $1,750,000 + $1,750,001 to $2,000,000 + $2,000,001 to $2,250,000 + $2,250,001 to $2,500,000 + $2,500,001 to $2,750,000 + $2,750,001 to $3,000,000 + Over $3,000,001",{"$f":"ROUND(ASCII2!C42-ASCII2!C6-ASCII2!C9-ASCII2!C12-ASCII2!C15-ASCII2!C18-ASCII2!C21-ASCII2!C24-ASCII2!C27-ASCII2!C30-ASCII2!C33-ASCII2!C36-ASCII2!C39,5)","v":0},null,null,null,"$1,000,001  $1,250,000"]
["Public Sector Outstanding Balance as at Quarter End: Total Number = Under $450,00 + $450,001 to $750,000 + $750,001 to $1,000,000 + $1,000,001 to $1,250,000 + $1,250,001 to $1,500,000 + $1,500,001 to $1,750,000 + $1,750,001 to $2,000,000 + $2,000,001 to $2,250,000 + $2,250,001 to $2,500,000 + $2,500,001 to $2,750,000 + $2,750,001 to $3,000,000 + Over $3,000,001",{"$f":"ROUND(ASCII2!B43-ASCII2!B7-ASCII2!B10-ASCII2!B13-ASCII2!B16-ASCII2!B19-ASCII2!B22-ASCII2!B25-ASCII2!B28-ASCII2!B31-ASCII2!B34-ASCII2!B37-ASCII2!B40,5)","v":0},null,null,null,"$1,250,001  $1,500,000"]
["Public Sector Outstanding Balance as at Quarter End: Total Value = Under $450,00 + $450,001 to $750,000 + $750,001 to $1,000,000 + $1,000,001 to $1,250,000 + $1,250,001 to $1,500,000 + $1,500,001 to $1,750,000 + $1,750,001 to $2,000,000 + $2,000,001 to $2,250,000 + $2,250,001 to $2,500,000 + $2,500,001 to $2,750,000 + $2,750,001 to $3,000,000 + Over $3,000,001",{"$f":"ROUND(ASCII2!C43-ASCII2!C7-ASCII2!C10-ASCII2!C13-ASCII2!C16-ASCII2!C19-ASCII2!C22-ASCII2!C25-ASCII2!C28-ASCII2!C31-ASCII2!C34-ASCII2!C37-ASCII2!C40,5)","v":0},null,null,null,"$1,500,001  $1,750,000"]
[null,null,null,null,null,"$1,750,001  $2,000,000"]
["Private Financial Institutions Approvals During Quarter: Total Number = Under $450,00 + $450,001 to $750,000 + $750,001 to $1,000,000 + $1,000,001 to $1,250,000 + $1,250,001 to $1,500,000 + $1,500,001 to $1,750,000 + $1,750,001 to $2,000,000 + $2,000,001 to $2,250,000 + $2,250,001 to $2,500,000 + $2,500,001 to $2,750,000 + $2,750,001 to $3,000,000 + Over $3,000,001",{"$f":"ROUND(ASCII2!B80-ASCII2!B44-ASCII2!B47-ASCII2!B50-ASCII2!B53-ASCII2!B56-ASCII2!B59-ASCII2!B62-ASCII2!B65-ASCII2!B68-ASCII2!B71-ASCII2!B74-ASCII2!B77,5)","v":0},null,null,null,"$2,000,001  $2,250,000"]
["Private Financial Institutions Approvals During Quarter: Total Value = Under $450,00 + $450,001 to $750,000 + $750,001 to $1,000,000 + $1,000,001 to $1,250,000 + $1,250,001 to $1,500,000 + $1,500,001 to $1,750,000 + $1,750,001 to $2,000,000 + $2,000,001 to $2,250,000 + $2,250,001 to $2,500,000 + $2,500,001 to $2,750,000 + $2,750,001 to $3,000,000 + Over $3,000,001",{"$f":"ROUND(ASCII2!C80-ASCII2!C44-ASCII2!C47-ASCII2!C50-ASCII2!C53-ASCII2!C56-ASCII2!C59-ASCII2!C62-ASCII2!C65-ASCII2!C68-ASCII2!C71-ASCII2!C74-ASCII2!C77,5)","v":0},null,null,null,"$2,250,001  $2,500,000"]
{"$rows_left_out":278}
{"sheet":"ASCII","index":3,"n_rows":1230,"n_cols":4,"rows_kept":1230,"cut":false,"hidden":true,"merged":[]}
["hdr","cb30A",{"$f":"VLOOKUP('COVER PAGE'!C7,Controls!$B$4:$C$28,2,FALSE)","v":{"$error":"#N/A"}},"3an"]
[{"$f":"VLOOKUP('COVER PAGE'!F9,Controls!$H$4:$I$147,2,FALSE)","v":9}]
[{"$f":"PAGE1!$C$16","v":24}]
["sect1","NUM","VAL"]
[{"$f":"$C$1&\".E30A.REM.PBSEC.APPR.LT450..\"","v":{"$error":"#N/A"}},{"$f":"ROUND(PAGE1!$G$26,5)","v":0},{"$f":"ROUND(PAGE1!$I$26,5)","v":0}]
[{"$f":"$C$1&\".E30A.REM.PBSEC.DISB.LT450..\"","v":{"$error":"#N/A"}},{"$f":"ROUND(PAGE1!$K$26,5)","v":0},{"$f":"ROUND(PAGE1!$M$26,5)","v":0}]
[{"$f":"$C$1&\".E30A.REM.PBSEC.OS.LT450..\"","v":{"$error":"#N/A"}},{"$f":"ROUND(PAGE1!$O$26,5)","v":0},{"$f":"ROUND(PAGE1!$Q$26,5)","v":0}]
[{"$f":"$C$1&\".E30A.REM.PBSEC.APPR.450TO750..\"","v":{"$error":"#N/A"}},{"$f":"ROUND(PAGE1!$G$27,5)","v":0},{"$f":"ROUND(PAGE1!$I$27,5)","v":0}]
[{"$f":"$C$1&\".E30A.REM.PBSEC.DISB.450TO750..\"","v":{"$error":"#N/A"}},{"$f":"ROUND(PAGE1!$K$27,5)","v":0},{"$f":"ROUND(PAGE1!$M$27,5)","v":0}]
[{"$f":"$C$1&\".E30A.REM.PBSEC.OS.450TO750..\"","v":{"$error":"#N/A"}},{"$f":"ROUND(PAGE1!$O$27,5)","v":0},{"$f":"ROUND(PAGE1!$Q$27,5)","v":0}]
[{"$f":"$C$1&\".E30A.REM.PBSEC.APPR.750TO1000..\"","v":{"$error":"#N/A"}},{"$f":"ROUND(PAGE1!$G$28,5)","v":0},{"$f":"ROUND(PAGE1!$I$28,5)","v":0}]
[{"$f":"$C$1&\".E30A.REM.PBSEC.DISB.750TO1000..\"","v":{"$error":"#N/A"}},{"$f":"ROUND(PAGE1!$K$28,5)","v":0},{"$f":"ROUND(PAGE1!$M$28,5)","v":0}]
[{"$f":"$C$1&\".E30A.REM.PBSEC.OS.750TO1000..\"","v":{"$error":"#N/A"}},{"$f":"ROUND(PAGE1!$O$28,5)","v":0},{"$f":"ROUND(PAGE1!$Q$28,5)","v":0}]
[{"$f":"$C$1&\".E30A.REM.PBSEC.APPR.1000TO1250..\"","v":{"$error":"#N/A"}},{"$f":"ROUND(PAGE1!$G$29,5)","v":0},{"$f":"ROUND(PAGE1!$I$29,5)","v":0}]
[{"$f":"$C$1&\".E30A.REM.PBSEC.DISB.1000TO1250..\"","v":{"$error":"#N/A"}},{"$f":"ROUND(PAGE1!$K$29,5)","v":0},{"$f":"ROUND(PAGE1!$M$29,5)","v":0}]
{"$rows_left_out":1216}
{"sheet":"ASCII2","index":4,"n_rows":1253,"n_cols":4,"rows_kept":1253,"cut":false,"hidden":true,"merged":[]}
["hdr","cb30A",{"$f":"VLOOKUP('COVER PAGE'!C7,Controls!$B$4:$C$28,2,FALSE)","v":{"$error":"#N/A"}},"3an"]
[{"$f":"VLOOKUP('COVER PAGE'!F9,Controls!$H$4:$I$147,2,FALSE)","v":9}]
[{"$f":"PAGE1!$C$16","v":24}]
["sect1","NUM","VAL"]
[{"$f":"$C$1&\".E30A.REM.PBSEC.APPR.LT450..\"","v":{"$error":"#N/A"}},{"$f":"ROUND(PAGE1!$G$26,5)","v":0},{"$f":"ROUND(PAGE1!$I$26,5)","v":0}]
[{"$f":"$C$1&\".E30A.REM.PBSEC.DISB.LT450..\"","v":{"$error":"#N/A"}},{"$f":"ROUND(PAGE1!$K$26,5)","v":0},{"$f":"ROUND(PAGE1!$M$26,5)","v":0}]
[{"$f":"$C$1&\".E30A.REM.PBSEC.OS.LT450..\"","v":{"$error":"#N/A"}},{"$f":"ROUND(PAGE1!$O$26,5)","v":0},{"$f":"ROUND(PAGE1!$Q$26,5)","v":0}]
[{"$f":"$C$1&\".E30A.REM.PBSEC.APPR.450TO750..\"","v":{"$error":"#N/A"}},{"$f":"ROUND(PAGE1!$G$27,5)","v":0},{"$f":"ROUND(PAGE1!$I$27,5)","v":0}]
[{"$f":"$C$1&\".E30A.REM.PBSEC.DISB.450TO750..\"","v":{"$error":"#N/A"}},{"$f":"ROUND(PAGE1!$K$27,5)","v":0},{"$f":"ROUND(PAGE1!$M$27,5)","v":0}]
[{"$f":"$C$1&\".E30A.REM.PBSEC.OS.450TO750..\"","v":{"$error":"#N/A"}},{"$f":"ROUND(PAGE1!$O$27,5)","v":0},{"$f":"ROUND(PAGE1!$Q$27,5)","v":0}]
[{"$f":"$C$1&\".E30A.REM.PBSEC.APPR.750TO1000..\"","v":{"$error":"#N/A"}},{"$f":"ROUND(PAGE1!$G$28,5)","v":0},{"$f":"ROUND(PAGE1!$I$28,5)","v":0}]
[{"$f":"$C$1&\".E30A.REM.PBSEC.DISB.750TO1000..\"","v":{"$error":"#N/A"}},{"$f":"ROUND(PAGE1!$K$28,5)","v":0},{"$f":"ROUND(PAGE1!$M$28,5)","v":0}]
[{"$f":"$C$1&\".E30A.REM.PBSEC.OS.750TO1000..\"","v":{"$error":"#N/A"}},{"$f":"ROUND(PAGE1!$O$28,5)","v":0},{"$f":"ROUND(PAGE1!$Q$28,5)","v":0}]
[{"$f":"$C$1&\".E30A.REM.PBSEC.APPR.1000TO1250..\"","v":{"$error":"#N/A"}},{"$f":"ROUND(PAGE1!$G$29,5)","v":0},{"$f":"ROUND(PAGE1!$I$29,5)","v":0}]
[{"$f":"$C$1&\".E30A.REM.PBSEC.DISB.1000TO1250..\"","v":{"$error":"#N/A"}},{"$f":"ROUND(PAGE1!$K$29,5)","v":0},{"$f":"ROUND(PAGE1!$M$29,5)","v":0}]
{"$rows_left_out":1239}
{"sheet":"PAGE1","index":5,"n_rows":100,"n_cols":24,"rows_kept":100,"cut":false,"hidden":false,"merged":[[10,2,10,8],[3,0,3,16],[5,0,5,16],[7,0,7,16]]}
[]
[null,null,null,null,null,null,null,null,null,null,null,null,null,null,null,null,"CB 30A/1"]
[]
["CENTRAL BANK OF TRINIDAD AND TOBAGO"]
[]
["REAL ESTATE MORTGAGE LOANS  QUARTERLY"]
[]
[" A. CHANGES  SECTOR AND SIZE"]
[]
[]
[null,"INSTITUTION:",{"$f":"'COVER PAGE'!C7:J7","v":"SELECT INSTITUTION"}]
[]
[]
[null,"MONTH:",{"$f":"VLOOKUP('COVER PAGE'!F9,Controls!$H$4:$K$147,3,FALSE)","v":"September"}]
[]
{"$rows_left_out":86}
{"sheet":"PAGE2","index":6,"n_rows":109,"n_cols":21,"rows_kept":109,"cut":false,"hidden":false,"merged":[]}
[]
[null,null,null,null,null,null,null,null,null,null,null,null,null,"CB 30A/2"]
[]
["CENTRAL BANK OF TRINIDAD AND TOBAGO"]
[]
["REAL ESTATE MORTGAGE LOANS  QUARTERLY"]
[]
["  A. CHANGES  SECTOR AND ACCORDING TO INTEREST RATE "]
[]
[]
[]
[null,null,"OUTSTANDING ",null,null,null,"APPROVED",null,null,null,null,"OUTSTANDING"]
["A.","SECTOR AND SIZE","BALANCE AS AT",null,null,null,"DURING",null,null,null,null,"BALANCE AS AT"]
[null,null,"END OF PRIOR QUARTER",null,null,null,"QUARTER",null,null,null,null,"QUARTER END"]
[]
{"$rows_left_out":95}
{"sheet":"PAGE3","index":7,"n_rows":60,"n_cols":21,"rows_kept":60,"cut":false,"hidden":false,"merged":[]}
[]
[null,null,null,null,null,null,null,null,null,null,null,null,null,"CB 30A/3"]
[]
["CENTRAL BANK OF TRINIDAD AND TOBAGO"]
[]
["REAL ESTATE MORTGAGE LOANS  QUARTERLY"]
[]
["  A. CHANGES  PROPERTY TYPE AND ACCORDING TO INTEREST RATE "]
[]
[]
[]
[null,null,"OUTSTANDING ",null,null,null,"DISBURSED/GRANTED",null,null,null,null,"OUTSTANDING"]
[null,null,"BALANCE AS AT",null,null,null,"DURING",null,null,null,null,"BALANCE AS AT"]
[null,null,"END OF PRIOR QUARTER",null,null,null,"QUARTER",null,null,null,null,"QUARTER END"]
[]
{"$rows_left_out":46}
{"sheet":"PAGE4 ","index":8,"n_rows":66,"n_cols":17,"rows_kept":66,"cut":false,"hidden":false,"merged":[[61,8,61,10],[63,8,63,10],[65,8,65,10]]}
[]
[null,null,null,null,null,null,null,null,null,null,null,null,null,null,null,null,"CB 30A/4"]
[]
["CENTRAL BANK OF TRINIDAD AND TOBAGO"]
[]
["REAL ESTATE MORTGAGES - QUARTERLY"]
[]
["B.  PURPOSE"]
[]
[]
[]
[null,null,"OUTSTANDING ",null,null,"APPROVED",null,null,null,null,"DISBURSED",null,null,null,"OUTSTANDING"]
["A.","PURPOSE","BALANCE AS AT",null,null,"DURING",null,null,null,null,"DURING",null,null,null,"BALANCE AS AT"]
[null,null,"END OF PRIOR QUARTER",null,null,"QUARTER",null,null,null,null,"QUARTER",null,null,null,"QUARTER END"]
[]
{"$rows_left_out":52}
{"sheet":"PAGE5","index":9,"n_rows":114,"n_cols":25,"rows_kept":114,"cut":false,"hidden":false,"merged":[]}
[]
[null,null,null,null,null,null,null,null,null,null,null,null,null,null,null,null,null,"CB 30A/5"]
[]
["CENTRAL BANK OF TRINIDAD AND TOBAGO"]
[]
["REAL ESTATE MORTGAGE LOANS GRANTED/DISBURSED QUARTERLY"]
[]
["C.  SECTOR AND TYPE"]
[]
[]
[null,null,null,null,null,null,null,null,null,null,null,null,null,null,null,"TOTAL GRANTED/DISBURSED"]
["A.","SECTOR AND TYPE",null,null,"FIXED RATE",null,null,null,"VARIABLE RATE ",null,null,null,"ADJUSTABLE RATE",null,null,"DURING"]
[null,null,null,null,null,null,null,null,null,null,null,null,null,null,null,"QUARTER"]
[]
[null,null,"NO.",null,"VALUE",null,"NO.",null,"VALUE",null,"NO.",null,"VALUE",null,null,"NO.",null,"VALUE"]
{"$rows_left_out":100}
{"sheet":"PAGE6","index":10,"n_rows":113,"n_cols":25,"rows_kept":113,"cut":false,"hidden":false,"merged":[]}
[]
[null,null,null,null,null,null,null,null,null,null,null,null,null,null,null,null,null,"CB 30A/6"]
[]
["CENTRAL BANK OF TRINIDAD AND TOBAGO"]
[]
["OUTSTANDING REAL ESTATE MORTGAGES  QUARTERLY"]
[]
["C.  SECTOR AND TYPE"]
[]
[]
[null,null,null,null,null,null,null,null,null,null,null,null,null,null,null,"OUTSTANDING"]
["A.","SECTOR AND TYPE",null,null,"FIXED RATE",null,null,null,"VARIABLE RATE ",null,null,null,"ADJUSTABLE RATE",null,null,"BALANCE AS AT"]
[null,null,null,null,null,null,null,null,null,null,null,null,null,null,null,"QUARTER END"]
[]
[null,null,"NO.",null,"VALUE",null,"NO.",null,"VALUE",null,"NO.",null,"VALUE",null,null,"NO.",null,"VALUE"]
{"$rows_left_out":99}
{"sheet":"PAGE7","index":11,"n_rows":32,"n_cols":18,"rows_kept":32,"cut":false,"hidden":false,"merged":[[2,0,2,17],[3,0,3,17],[4,0,4,17]]}
[null,null,null,null,null,null,null,null,null,null,null,null,null,null,null,null,null,"CB 30A/7"]
[]
["CENTRAL BANK OF TRINIDAD AND TOBAGO"]
[" NEW REAL ESTATE MORTGAGES "]
["D. BY AGREED PERIOD OF REPAYMENT AND TYPE"]
[]
[]
[]
["AGREED PERIOD OF",null,"NO.",null,"VALUE OF",null,"NO.",null,"VALUE OF",null,"NO.",null," VALUE OF",null,null,"NO.",null,"TOTAL VALUE OF"]
["REPAYMENT",null,null,null,"FRMs",null,null,null,"VRMs",null,null,null,"ARMs",null,null,null,null,"NEW MORTGAGES"]
[null,null,"( # )",null,"( $000 )",null,"( # )",null,"( $000 )",null,"( # )",null,"( $000 )",null,null,"( # )",null,"( $000 )"]
[]
[]
["Up to 5 years",null,null,null,null,null,null,null,null,null,null,null,null,null,null,{"$f":"C14+G14+K14","v":0},null,{"$f":"E14+I14+M14","v":0}]
[]
{"$rows_left_out":18}
{"sheet":"PAGE8","index":12,"n_rows":72,"n_cols":32,"rows_kept":72,"cut":false,"hidden":false,"merged":[]}
[]
[null,null,null,null,null,null,null,null,null,null,null,null,null,null,null,null,null,null,null,null,null,null,null,null,"CB 30A/8"]
[]
["CENTRAL BANK OF TRINIDAD AND TOBAGO"]
[]
["INTEREST RATE SCHEDULE  REAL ESTATE MORTGAGE LOANS  QUARTERLY"]
[]
["E.  ACTUAL LOAN RATES  SECTOR AND TYPE"]
[]
[]
[]
[null,null,"APPROVED",null,null,null,"INTEREST",null,null,null,"DISBURSED",null,null,null,"INTEREST",null,null,null,"OUTSTANDING",null,null,null,"INTEREST"]
["A.","FIXED RATE","DURING",null,null,null,"MARGIN",null,null,null,"DURING",null,null,null,"MARGIN",null,null,null,"BALANCE AS AT",null,null,null,"MARGIN"]
[null,null,"QUARTER",null,null,null,"APPLIED",null,null,null,"QUARTER ",null,null,null,"APPLIED",null,null,null,"QUARTER END",null,null,null,"APPLIED"]
[]
{"$rows_left_out":58}
{"sheet":"PAGE9","index":13,"n_rows":22,"n_cols":9,"rows_kept":22,"cut":false,"hidden":false,"merged":[]}
[]
[null,null,null,null,null,null,null,null,"CB 30A/9"]
[]
["CENTRAL BANK OF TRINIDAD AND TOBAGO"]
["TRUSTEE FUNDS - INVESTMENT PORTFOLIO FOR REAL ESTATE MORTGAGES"]
[]
[]
[]
[]
["TOTAL FUNDS UNDER ADMINISTRATION",null,null,null,null,null,null,null,"( $ 000 )"]
[]
[]
["REAL ESTATE MORTGAGE LOANS ",null,null,"- TOTAL",null,null,null,null,{"$f":"I15+I17","v":0}]
[]
[null,null,null,"- RESIDENTIAL"]
{"$rows_left_out":8}
{"sheet":"PAGE10","index":14,"n_rows":33,"n_cols":4,"rows_kept":33,"cut":false,"hidden":false,"merged":[]}
[null,null,null,"C.B. 30A/10"]
[]
[]
[]
[]
[null,"Name of Person Completing Form ",null,"Signature of Person Completing Form "]
[null,"(Block Letters)"]
[]
[]
[]
[]
[null,"Name of Authorised Official ",null,"Signature of Authorised Official "]
[null,"(Block Letters)"]
[]
[]
{"$rows_left_out":19}
{"sheet":"Controls","index":15,"n_rows":147,"n_cols":11,"rows_kept":147,"cut":false,"hidden":true,"merged":[]}
[]
[]
[null,"SELECT INSTITUTION","CODES",null,null,null,null,"DATE"]
[null,"ANSA Bank Limited ","BBDA",null,null,null,null,"2015-03-31",3,"March",15]
[null,"ANSA Merchant Bank Limited ","AMAL",null,null,null,null,"2015-06-30",6,"June",15]
[null,"Caribbean Finance Company Limited","CFC",null,null,null,null,"2015-09-30",9,"September",15]
[null,"CIBC Caribbean Bank Limited (Trinidad and Tobago)","FCIB",null,null,null,null,"2015-12-31",12,"December",15]
[null,"Citibank (Trinidad & Tobago) Limited","CITI",null,null,null,null,"2016-03-31",3,"March",16]
[null,"Citicorp Merchant Bank Limited","CMBL",null,null,null,null,"2016-06-30",6,"June",16]
[null,"Development Finance Limited ","DFL",null,null,null,null,"2016-09-30",9,"September",16]
[null,"Fidelity Finance and Leasing Company Limited ","FFL",null,null,null,null,"2016-12-31",12,"December",16]
[null,"First Citizens Bank Limited","FCB",null,null,null,null,"2017-03-31",3,"March",17]
[null,"First Citizens Depository Services Limited","FCMT",null,null,null,null,"2017-06-30",6,"June",17]
[null,"First Citizens Trustee Services Limited","FCTS",null,null,null,null,"2017-09-30",9,"September",17]
[null,"Guardian Group Trust Limited ","GAM",null,null,null,null,"2017-12-31",12,"December",17]
{"$rows_left_out":132}