{"text_format":"1","workbook":"xlsx","n_sheets":29,"sheets":["COVER PAGE","General Instructions","CBTT VALIDATION","Institution_Codes","CB20ASCL","CB20ASCL_VALI","PG_01_02","PG_03","PG_04_05","PG_06_09","PG_10","PG_11","PG_12_16","PG_17","PG_18","PG_19","PG_20","PG_21","PG_22","PG_23","PG_24","PG_25","PG_26","PG_27","PG_28","PG_29","PG_30","PG_31","PG_32"],"not_rendered":{"charts":0,"images":1,"macros":1,"external_links":5,"defined_names":1105,"comments":14,"pivot_tables":0},"unopened":[],"bounds":{"document_bytes":16777216,"sheet_cells":100000,"rows_first":2000,"rows_last":500,"rows_between":2000,"halvings":0,"cell_chars":16384,"cell_head_chars":4096},"cells_cut":0,"cells_raw":0,"read":"whole","date_system":"1900"}

{"sheet":"COVER PAGE","index":0,"n_rows":13,"n_cols":6,"rows_kept":13,"cut":false,"hidden":false,"merged":[[11,4,11,7],[12,5,12,6],[7,2,7,9],[8,2,8,4],[8,5,8,6],[8,7,8,9],[9,5,9,6],[10,2,10,9],[6,2,6,9],[1,2,1,9],[2,2,2,9],[3,2,3,9],[4,2,4,9],[5,2,5,9]]}
[]
[null,null,"CENTRAL BANK OF TRINIDAD AND TOBAGO "]
[null,null,"V1.2"]
[null,null,"CB20 RETURN"]
[]
[null,null,"FOR "]
[null,null,"Select Institution"]
[null,null,"For the Month Ended:"]
[null,null,"Month ",null,null,"July"]
[null,null,null,null,"Year",2024]
{"$rows_left_out":4}
{"sheet":"General Instructions","index":1,"n_rows":39,"n_cols":2,"rows_kept":39,"cut":false,"hidden":false,"merged":[]}
[null,"CB20 RETURN"]
[null,"Please use the CB20 instructions to complete the return using the link below. "]
[null,"CB20 INSTRUCTIONS"]
[]
[null,"GENERAL INSTRUCTIONS"]
[1,"Do not amend the structure/format."]
[2,"Do not remove the password protection."]
[3,"Do not manipulate the formulas."]
[4,"Complete Cover Page before submission. \nInstitution, reporting month, reporting year and date submitted must be populated. "]
[5,"No blank cells.  All cells must be populated with zero where there is no data."]
{"$rows_left_out":30}
{"sheet":"CBTT VALIDATION","index":2,"n_rows":407,"n_cols":7,"rows_kept":407,"cut":false,"hidden":false,"merged":[[2,6,4,6],[266,1,266,5],[2,1,4,5],[3,0,4,0],[5,1,5,5],[13,1,13,5],[19,1,19,5],[34,1,34,5],[45,1,45,5],[73,1,73,5],[137,1,137,5],[156,1,156,5],[177,1,177,5],[280,1,280,5],[288,1,288,5],[312,1,312,5],[335,1,335,5],[357,1,357,5]]}
[]
[null,null,null,null,"DATE CHECK",{"$f":"(TEXT(MID(RIGHT(MID(CELL(\"filename\",'COVER PAGE'!A1),FIND(\"[\",CELL(\"filename\",'COVER PAGE'!A1))+1,FIND(\"]\", CELL(\"filename\",'COVER PAGE'!A1))-FIND(\"[\",CELL(\"filename\",'COVER PAGE'!A1))-1),LEN(MID(CELL(\"filename\",'COVER PAGE'!A1),FIND(\"[\",CELL(\"filename\",'COVER PAGE'!A1))+1,FIND(\"]\", CELL(\"filename\",'COVER PAGE'!A1))-FIND(\"[\",CELL(\"filename\",'COVER PAGE'!A1))-1))-FIND(\"~\",SUBSTITUTE(MID(CELL(\"filename\",'COVER PAGE'!A1),FIND(\"[\",CELL(\"filename\",'COVER PAGE'!A1))+1,FIND(\"]\", CELL(\"filename\",'COVER PAGE'!A1))-FIND(\"[\",CELL(\"filename\",'COVER PAGE'!A1))-1),\"_\",\"~\",3))),1,7),\"yyyy-MM-dd\"))=(TEXT(TEXT(DATE('COVER PAGE'!F10,MONTH(DATEVALUE('COVER PAGE'!F9 & 1)),\"1\"),\"MMM-YYYY\"),\"yyyy-MM-dd\"))","v":{"$error":"#VALUE!"}},{"$f":"IF(F2=TRUE,0,1)","v":{"$error":"#VALUE!"}}]
["INSTITUTION","ZERO-SUM VERIFICATION CHECK",null,null,null,null,"TOTAL FAILED VALIDATIONS"]
[{"$f":"PG_01_02!C5","v":"Select Institution"}]
[]
[null,"BALANCE SHEET ",null,null,null,null,{"$f":"SUM(F7,F15,F21,F36,F47,F75,F139,F158,F179,F268,F282,F290,F314,F337,F359,F382,G2)","v":{"$error":"#VALUE!"}}]
["ASSETS = LIABILITIES + CAPITAL ACCOUNTS",{"$f":"ROUND(CB20ASCL!$B$14-CB20ASCL!$B$25-CB20ASCL!$B$51,5)","v":0},null,null,null,{"$f":"SUM(COUNTIF(B11:E11,{\">0.00001\",\"<-0.00001\"}))","v":0}]
[]
[null,"ALL",null,"NR. TT","NR. FOR"]
[]
{"$rows_left_out":398}
{"sheet":"Institution_Codes","index":3,"n_rows":37,"n_cols":9,"rows_kept":37,"cut":false,"hidden":true,"merged":[]}
["Select Institution","-",null,"Month",null,null,null,"Year"]
["ANSA Bank Limited ","BBDA",null,"January",1,null,null,2015,15]
["ANSA Merchant Bank Limited ","AMAL",null,"February",2,null,null,2016,16]
["Caribbean Finance Company Limited","CFC",null,"March",3,null,null,2017,17]
["CIBC Caribbean Bank Limited (Trinidad and Tobago)","FCIB",null,"April",4,null,null,2018,18]
["Citibank (Trinidad & Tobago) Limited","CITI",null,"May",5,null,null,2019,19]
["Citicorp Merchant Bank Limited","CMBL",null,"June",6,null,null,2020,20]
["Development Finance Limited ","DFL",null,"July",7,null,null,2021,21]
["Fidelity Finance and Leasing Company Limited ","FFL",null,"August",8,null,null,2022,22]
["First Citizens Bank Limited","FCB",null,"September",9,null,null,2023,23]
{"$rows_left_out":28}
{"sheet":"CB20ASCL","index":4,"n_rows":2091,"n_cols":7,"rows_kept":2091,"cut":false,"hidden":true,"merged":[]}
["hdr",null,{"$f":"VLOOKUP('COVER PAGE'!C7,Institution_Codes!A1:B27,2,)","v":"-"},"2n"]
[{"$f":"VLOOKUP('COVER PAGE'!F9,Institution_Codes!D2:E14,2,FALSE)","v":7}]
[{"$f":"VLOOKUP('COVER PAGE'!F10,Institution_Codes!H2:I53,2,)","v":24}]
["sect1","all","nr.tt","nr.for"]
[{"$f":"$C$1&\".e20.11\"","v":"-.e20.11"},{"$f":"ROUND(PG_01_02!$E$12,5)","v":0},{"$f":"ROUND(PG_01_02!G12,5)","v":0},{"$f":"ROUND(PG_01_02!I12,5)","v":0}]
[{"$f":"$C$1&\".e20.12\"","v":"-.e20.12"},{"$f":"ROUND(PG_01_02!$E$13,5)","v":0},{"$f":"PG_01_02!G13","v":"xxxxxxxxxxxxxxxx  "},{"$f":"ROUND(PG_01_02!I13,5)","v":0}]
[{"$f":"$C$1&\".e20.13\"","v":"-.e20.13"},{"$f":"ROUND(PG_01_02!$E$14,5)","v":0},{"$f":"ROUND(PG_01_02!G14,5)","v":0},{"$f":"ROUND(PG_01_02!I14,5)","v":0}]
[{"$f":"$C$1&\".e20.14\"","v":"-.e20.14"},{"$f":"ROUND(PG_01_02!$E$15,5)","v":0},{"$f":"ROUND(PG_01_02!G15,5)","v":0},{"$f":"ROUND(PG_01_02!I15,5)","v":0}]
[{"$f":"$C$1&\".e20.15\"","v":"-.e20.15"},{"$f":"ROUND(PG_01_02!E16,5)","v":0},{"$f":"ROUND(PG_01_02!G16,5)","v":0},{"$f":"ROUND(PG_01_02!I16,5)","v":0}]
[{"$f":"$C$1&\".e20.16\"","v":"-.e20.16"},{"$f":"ROUND(PG_01_02!E17,5)","v":0},{"$f":"ROUND(PG_01_02!G17,5)","v":0},{"$f":"ROUND(PG_01_02!I17,5)","v":0}]
{"$rows_left_out":2082}
{"sheet":"CB20ASCL_VALI","index":5,"n_rows":467,"n_cols":5,"rows_kept":467,"cut":false,"hidden":true,"merged":[]}
["CB20.CHK.CLA.00001.ALL.M",0,{"$f":"UPPER($E$1)&\".\"&A1","v":"BBDA.CB20.CHK.CLA.00001.ALL.M"},null,{"$f":"[5]CB20ASCL!C1","v":"bbda"}]
["CB20.CHK.1.00002.ALL.M",0,{"$f":"UPPER($E$1)&\".\"&A2","v":"BBDA.CB20.CHK.1.00002.ALL.M"}]
["CB20.CHK.2.00003.ALL.M",0,"BBDA.CB20.CHK.2.00003.ALL.M"]
["CB20.CHK.21_PAGE1.00004.ALL.M",0,"BBDA.CB20.CHK.21_PAGE1.00004.ALL.M"]
["CB20.CHK.3.00005.ALL.M",0,"BBDA.CB20.CHK.3.00005.ALL.M"]
["CB20.CHK.31.00006.ALL.M",0,"BBDA.CB20.CHK.31.00006.ALL.M"]
["CB20.CHK.3102.00007.ALL.M",0,"BBDA.CB20.CHK.3102.00007.ALL.M"]
["CB20.CHK.32.00008.ALL.M",0,"BBDA.CB20.CHK.32.00008.ALL.M"]
["CB20.CHK.3202.00009.ALL.M",0,"BBDA.CB20.CHK.3202.00009.ALL.M"]
["CB20.CHK.33.00010.ALL.M",0,"BBDA.CB20.CHK.33.00010.ALL.M"]
{"$rows_left_out":458}
{"sheet":"PG_01_02","index":6,"n_rows":68,"n_cols":9,"rows_kept":68,"cut":false,"hidden":false,"merged":[[4,0,5,1],[4,2,5,3],[0,1,0,2]]}
[null,{"$f":"\"CB20_\"&'COVER PAGE'!$C$3","v":"CB20_V1.2"}]
[null," CENTRAL BANK OF TRINIDAD AND TOBAGO"]
[null," MONTHLY STATEMENT OF CONDITION"]
[null,"(In Thousands of TT Dollars)"]
["INSTITUTION NAME:",null,{"$f":"'COVER PAGE'!C7:J7","v":"Select Institution"}]
[null,null,null,null,"FORM NO.","2n"]
[null,"MONTH",{"$f":"VLOOKUP('COVER PAGE'!F9,Institution_Codes!D2:E14,2,FALSE)","v":7},null,"YEAR",{"$f":"VLOOKUP('COVER PAGE'!F10,Institution_Codes!H2:I53,2,)","v":24}]
[null,null,"."]
[null,null,null,null,"TOTAL RESIDENT AND NON RESIDENT",null,"TT$             Denominated",null,"Foreign Currency                       (TT$ Equivalent)"]
[]
{"$rows_left_out":59}
{"sheet":"PG_03","index":7,"n_rows":22,"n_cols":11,"rows_kept":22,"cut":false,"hidden":false,"merged":[]}
[null,null,null,null,null,null,null,null,null,null,"-3-"]
[null,null,null,null,"RESIDENT",null,null,null,"NON-RESIDENT"]
[null,"11.  LIQUID FUNDS ",null,null,"TT $           Denominated",null,"Foreign Currency                     (TT$ Equivalent)",null,"TT $           Denominated",null,"Foreign Currency                     (TT$ Equivalent)"]
[null,null," SCHEDULE"]
[null,"1101 CASH",null,null,null,null,"xxxxxxxxxxxxxx",null,"xxxxxxxxxxxxxx"]
[null,"1102 DEPOSITS AT CENTRAL "]
[null,"          BANK",null,null,{"$f":"E8+E9","v":0},null,{"$f":"G8+G9","v":0},null,"xxxxxxxxxxxxxx",null,"xxxxxxxxxxxxxx"]
[null,null,"110201","Primary Deposits",null,null,null,null,"xxxxxxxxxxxxxx",null,"xxxxxxxxxxxxxx"]
[null,null,"110202","Special Deposits",null,null,null,null,"xxxxxxxxxxxxxx",null,"xxxxxxxxxxxxxx"]
[null,"1103 DUE FROM BANKS"]
{"$rows_left_out":13}
{"sheet":"PG_04_05","index":8,"n_rows":76,"n_cols":12,"rows_kept":76,"cut":false,"hidden":false,"merged":[[62,5,63,5],[62,7,63,7],[62,9,63,9],[62,11,63,11],[71,5,72,5],[71,7,72,7],[71,9,72,9],[71,11,72,11],[68,5,69,5],[68,7,69,7],[68,9,69,9],[68,11,69,11]]}
[null,null,null,null,null,null,null,null,null,null,null,"-4-"]
[null,null,null,null,null,"RESIDENT",null,null,null,"NON-RESIDENT"]
[null,"13.  INVESTMENTS",null,null,null,"TT $           Denominated",null,"Foreign Currency                     (TT$ Equivalent)",null,"TT $           Denominated",null,"Foreign Currency                     (TT$ Equivalent)"]
[null," 1301 TREASURY BILLS "]
[null,null,"     (BOOK VALUE)"]
[null," 1302 CENTRAL GOV'T SECURITIES",null,null,null,{"$f":"SUM(F7:F8)","v":0},null,{"$f":"SUM(H7:H8)","v":0},null,{"$f":"SUM(J7:J8)","v":0},null,{"$f":"SUM(L7:L8)","v":0}]
[null,null,"130201","  Marketable"]
[null,null,"130202","   Non Marketable"]
[null," 1303 LOCAL GOV'T SECURITIES",null,null,null,{"$f":"SUM(F10:F11)","v":0},null,{"$f":"SUM(H10:H11)","v":0},null,{"$f":"SUM(J10:J11)","v":0},null,{"$f":"SUM(L10:L11)","v":0}]
[null,null,"130301","  Marketable"]
{"$rows_left_out":67}
{"sheet":"PG_06_09","index":9,"n_rows":200,"n_cols":7,"rows_kept":200,"cut":false,"hidden":false,"merged":[]}
[null,"   ",null,null,null,null,"-6-"]
[]
[null," 14.",null," LOANS","TOTAL (RESIDENT AND NON-RESIDENT)     "]
[null," 1401 LOANS, ADVANCES, DISCOUNTS"]
[null,null," AND CREDIT CARDS",null," ",null,{"$f":"SUM(E6,E21,E36,E54,E69,E84)","v":0}]
[null,null,"   140101 OVERDRAFT",null,{"$f":"SUM(E7+E8+E9+E10+E14+E15+E16+E19)","v":0}]
[null,null,null," 14010101 Central Government"]
[null,null,null," 14010102 Local Government"]
[null,null,null," 14010103 State-Owned Fin. Institutions"]
[null,null,null," 14010104 Other Government Bodies",{"$f":"SUM(E11:E13)","v":0}]
{"$rows_left_out":191}
{"sheet":"PG_10","index":10,"n_rows":50,"n_cols":12,"rows_kept":50,"cut":false,"hidden":false,"merged":[]}
["  ",null,null,null,null,null,null,null,null,null,null,"-10-"]
[null,null,null,null,null,"RESIDENT",null,null,null,"NON-RESIDENT"]
[null," 15/25. CUSTOMERS' LIABILITIES ON ",null,null,null,"TT $           Denominated",null,"Foreign Currency                     (TT$ Equivalent)",null,"TT $           Denominated",null,"Foreign Currency                     (TT$ Equivalent)"]
[null,null,"       ACCEPTANCES/"]
[null,null,"        ACCEPTANCES EXECUTED"]
[null,null,1501,"BILLS OF COLLECTION"]
[null,null,1502,"LETTERS OF CREDIT",null,{"$f":"SUM(F8:F14)","v":0},null,{"$f":"SUM(H8:H14)","v":0},null,{"$f":"SUM(J8:J14)","v":0},null,{"$f":"SUM(L8:L14)","v":0}]
[null,null,"150201","Commercial Letters of Credit"]
[null,null,"150202","Performance Standby Letters "]
[null,null,null,"    of Credit"]
{"$rows_left_out":41}
{"sheet":"PG_11","index":11,"n_rows":61,"n_cols":11,"rows_kept":61,"cut":false,"hidden":false,"merged":[]}
[null," ",null,null,null,null,null,null,null,null,"-11-"]
[null,null,null,null,"RESIDENT",null,null,null,"NON-RESIDENT"]
[null,null,null,null,"TT $           Denominated",null,"Foreign Currency                     (TT$ Equivalent)",null,"TT $           Denominated",null,"Foreign Currency                     (TT$ Equivalent)"]
[null," 17.  ACCOUNTS RECEIVABLES"]
[null,null,"   (NET)"]
[null," ","1701  INTEREST",null,{"$f":"SUM(E7+E8+E9+E10)","v":0},null,{"$f":"SUM(G7+G8+G9+G10)","v":0},null,{"$f":"SUM(I7+I8+I9+I10)","v":0},null,{"$f":"SUM(K7+K8+K9+K10)","v":0}]
[null,null,"   170101 Inter-Bank Funds"]
[null,null,"   170102 Deposits"]
[null,null,"   170103  Investments"]
[null,null,"   170104 Loans",null,{"$f":"SUM(E11:E13)","v":0},null,{"$f":"SUM(G11:G13)","v":0},null,{"$f":"SUM(I11:I13)","v":0},null,{"$f":"SUM(K11:K13)","v":0}]
{"$rows_left_out":52}
{"sheet":"PG_12_16","index":12,"n_rows":246,"n_cols":9,"rows_kept":246,"cut":false,"hidden":false,"merged":[]}
[null,"  ",null,null,null,null,null,null,"-12-"]
["2. LIABILITIES"]
[null,"21.  DEPOSITS",null,null,null,null,"TOTAL (RESIDENT AND NON-RESIDENT)"]
[null," 2101 DEMAND",null,null,null,null,null,null,{"$f":"SUM(G5,G22)","v":0}]
[null,"   210101 NON- INTEREST BEARING",null,null,null,null,{"$f":"SUM(G6+G7+G8+G9+G13+G14+G17+G20)","v":0}]
[null,null,null," 21010101 Central Government"]
[null,null,null," 21010102 Local Government"]
[null,null,null," 21010103 State-Owned Fin.  Institutions"]
[null,null,null," 21010104 Other Government Bodies",null,null,{"$f":"SUM(G10:G12)","v":0}]
[null,null,null,"   2101010401 State-Owned Non-Fin.  Institutions"]
{"$rows_left_out":237}
{"sheet":"PG_17","index":13,"n_rows":51,"n_cols":10,"rows_kept":51,"cut":false,"hidden":false,"merged":[[44,3,45,3],[44,5,45,5],[44,7,45,7],[44,9,45,9]]}
["  ",null,null,null,null,null,null,null,null,"-17-"]
[null,null,null,"RESIDENT",null,null,null,"NON-RESIDENT"]
[null,null,null,"TT $           Denominated",null,"Foreign Currency                     (TT$ Equivalent)",null,"TT $           Denominated",null,"Foreign Currency                     (TT$ Equivalent)"]
["   24. BORROWINGS (UP TO 1 YEAR)"]
[null," 2401   CENTRAL BANK"]
[null," 2402   COMMERCIAL BANKS",null,{"$f":"SUM(D7:D8)","v":0},null,{"$f":"SUM(F7:F8)","v":0},null,{"$f":"SUM(H7:H8)","v":0},null,{"$f":"SUM(J7:J8)","v":0}]
[null,"                    240201 Operational Balances"]
[null,"                    240202 Short Term Loans"]
[null,"  2403 OTHER FINANCIAL INSTITUTIONS",null,{"$f":"SUM(D10:D11)","v":0},null,{"$f":"SUM(F10:F11)","v":0},null,{"$f":"SUM(H10:H11)","v":0},null,{"$f":"SUM(J10:J11)","v":0}]
[null,"             240301 State-Owned "]
{"$rows_left_out":42}
{"sheet":"PG_18","index":14,"n_rows":59,"n_cols":11,"rows_kept":59,"cut":false,"hidden":false,"merged":[]}
[null,null,null,null,null,null,null,null,null,null,"-18-"]
[null,null,null,null,"RESIDENT",null,null,null,"NON-RESIDENT"]
[null,null,null,null,"TT $  Denominated",null,"Foreign Currency                     (TT$ Equivalent)",null,"TT $  Denominated",null,"Foreign Currency                     (TT$ Equivalent)"]
["     72. CONTINGENT ACCOUNTS"]
[null,7201,"Unused Portion of Overdraft"]
[null,null,"  Facilities",null,{"$f":"E7-E8","v":0},null,{"$f":"G7-G8","v":0},null,0,null,0]
[null,720101,"Aggregate Value Sanctioned"]
[null,720102,"  Balance Outstanding"]
[null,7202,"Unused Portion of Credit"]
[null,null,"  Card Facilities",null,{"$f":"E11-E12","v":0},null,{"$f":"G11-G12","v":0},null,{"$f":"I11-I12","v":0},null,{"$f":"K11-K12","v":0}]
{"$rows_left_out":50}
{"sheet":"PG_19","index":15,"n_rows":45,"n_cols":11,"rows_kept":45,"cut":false,"hidden":false,"merged":[]}
[null,null,null,null,null,null,null,null,null,"-19-"]
[]
[null,null,null,"RESIDENT",null,null,null,"NON-RESIDENT"]
[null,null,null,"TT $ Denominated",null,"Foreign Currency                     (TT$ Equivalent)",null,"TT $ Denominated",null,"Foreign Currency                     (TT$ Equivalent)"]
[null,"MEMORANDA  ACCOUNTS"]
[null,"    - ASSETS  (Cont'd)"]
[null,"8108  RESCHEDULED LOANS",null,{"$f":"SUM(D8:D9)","v":0},null,{"$f":"SUM(F8:F9)","v":0},null,{"$f":"SUM(H8:H9)","v":0},null,{"$f":"SUM(J8:J9)","v":0}]
[null,"  810801  FIRST TIME RESCHEDULED"]
[null,"  810802  PREVIOUSLY RESCHEDULED "]
[]
{"$rows_left_out":36}
{"sheet":"PG_20","index":16,"n_rows":52,"n_cols":9,"rows_kept":52,"cut":false,"hidden":false,"merged":[]}
[null,null,null,null,null,null,null,null,"-20-"]
[null,"8110  PAST DUE LOANS Cont'd","TOTAL 1-6 MONTHS",null,"TOTAL OVER 6 MONTHS",null,"TOTAL  PAST DUE BY LOAN TYPE"]
[null,"811001  OVERDRAFT",null,null,null,null,{"$f":"SUM(C3:E3)","v":0}]
[null,"811002  DEMAND",null,null,null,null,0]
[null,"811003  TIME",null,null,null,null,0]
[null,"811004  INSTALMENT",null,null,null,null,0]
[null,"811005  DISCOUNTS",null,null,null,null,0]
[null,"811006  FACTORING",null,null,null,null,0]
[null,"811007  TRADE CONFIRMING",null,null,null,null,0]
[null,"811008  BLOCK DISCOUNTING",null,null,null,null,0]
{"$rows_left_out":43}
{"sheet":"PG_21","index":17,"n_rows":41,"n_cols":10,"rows_kept":41,"cut":false,"hidden":false,"merged":[]}
[null,null,null,null,null,null,null,null,null,"-21-"]
[null," "]
[null,null,null,"RESIDENT",null,null,null,"NON-RESIDENT"]
[null," ","84. MEMORANDA ACCOUNTS - DEPOSITS","TT $           Denominated",null,"Foreign Currency                     (TT$ Equivalent)",null,"TT $           Denominated",null,"Foreign Currency                     (TT$ Equivalent)"]
[null," "," 8401  DEMAND DEPOSITS",{"$f":"SUM(D6:D10,D15,D16,D19,D22)","v":0},null,{"$f":"SUM(F6:F10,F15,F16,F19,F22)","v":0},null,{"$f":"SUM(H6:H10,H15,H16,H19,H22)","v":0},null,{"$f":"SUM(J6:J10,J15,J16,J19,J22)","v":0}]
[null,null,"    840101 Central Government"]
[null,null,"    840102 Local Government"]
[null,null,"    840103 State-Owned "]
[null,null,"                     Other Fin. Inst."]
[null,null,"    840104 Other Government Bodies",{"$f":"SUM(D12:D14)","v":0},null,{"$f":"SUM(F12:F14)","v":0},null,{"$f":"SUM(H12:H14)","v":0},null,{"$f":"SUM(J12:J14)","v":0}]
{"$rows_left_out":32}
{"sheet":"PG_22","index":18,"n_rows":54,"n_cols":10,"rows_kept":54,"cut":false,"hidden":false,"merged":[]}
[null,null,null,null,null,null,null,null,null,"-22-"]
[null,null," "]
[null,null,null,"RESIDENT",null,null,null,"NON-RESIDENT"]
[null," ","84. MEMORANDA ACCOUNTS - DEPOSITS CONT'D","TT $           Denominated",null,"Foreign Currency                     (TT$ Equivalent)",null,"TT $           Denominated",null,"Foreign Currency                     (TT$ Equivalent)"]
[]
[null,"8403  TIME DEPOSITS",null,{"$f":"SUM(D7+D8+D9+D10+D15+D16+D19+D22)","v":0},null,{"$f":"SUM(F7+F8+F9+F10+F15+F16+F19+F22)","v":0},null,{"$f":"SUM(H7+H8+H9+H10+H15+H16+H19+H22)","v":0},null,{"$f":"SUM(J7+J8+J9+J10+J15+J16+J19+J22)","v":0}]
[null,null,"    840301 Central Government"]
[null,null,"    840302 Local Government"]
[null,null,"    840303 State-Owned Other Fin.  Insts."]
[null,null,"    840304 Other Government Bodies",{"$f":"SUM(D11:D14)","v":0},null,{"$f":"SUM(F11:F14)","v":0},null,{"$f":"SUM(H11:H14)","v":0},null,{"$f":"SUM(J11:J14)","v":0}]
{"$rows_left_out":45}
{"sheet":"PG_23","index":19,"n_rows":10,"n_cols":9,"rows_kept":10,"cut":false,"hidden":false,"merged":[]}
[null,"86. MEMORANDA ACCOUNTS - EMOLUMENT BONDS",null,null,null,null,null,null,"-23-"]
[null,null,null,null,"RESIDENT"]
[null,null,null,null,"TT$",null,"Foreign currency"]
[null,null,null,null,"Denominated",null,"(TT$ Equivalent)"]
[]
[null,1401030801,null,"Emolument Bonds"]
[null,null,null,"Time Loans (Consumers)"]
[]
[null,13020201,null,"Emolument Bonds "]
[null,null,null,"Discounted"]
{"$rows_left_out":1}
{"sheet":"PG_24","index":20,"n_rows":71,"n_cols":7,"rows_kept":71,"cut":false,"hidden":false,"merged":[]}
[]
[null,"CENTRAL BANK OF TRINIDAD AND TOBAGO"]
[null,"MONTHLY INTEREST RATE SCHEDULE"]
[null,null,null,null,null,null,"C.B.20/2"]
[null,"1A. INTEREST RATES ON TT DOLLAR"]
[null,"DEPOSITS AND INTER-BANK FUNDS BOUGHT"]
[]
[null,"DEMAND DEPOSITS",null,null,"SAVINGS DEPOSITS"]
[null,null,null,null," ORDINARY"]
[null,"ANNOUNCED RATES (S)",null,"INTEREST EXPENSED ($000)","ANNOUNCED RATES (S)",null,"INTEREST EXPENSED ($000)"]
{"$rows_left_out":62}
{"sheet":"PG_25","index":21,"n_rows":74,"n_cols":7,"rows_kept":74,"cut":false,"hidden":false,"merged":[]}
[]
[null,"1A. INTEREST RATES ON TT DOLLAR DEPOSITS"]
[null," "]
[null,null,null,null,null,null,"C.B.20/2"]
[null,"TIME DEPOSITS",null,null,"TIME DEPOSITS"]
[null,"OVER 6 MONTHS - 12 MONTHS",null,null,"OVER 1 YEAR - 2 YEARS"]
[null,"ANNOUNCED RATES (S)",null,"INTEREST EXPENSED ($000)","ANNOUNCED RATES (S)",null,"INTEREST EXPENSED ($000)"]
[null,"HIGHEST","LOWEST",null,"HIGHEST","LOWEST"]
[]
[null,"ACTUAL RATES ",null,null,"ACTUAL RATES "]
{"$rows_left_out":65}
{"sheet":"PG_26","index":22,"n_rows":68,"n_cols":7,"rows_kept":68,"cut":false,"hidden":false,"merged":[]}
[]
[null,"1B. INTEREST RATES ON FOREIGN CURRENCY"]
[null,"DEPOSITS AND INTER-BANK FUNDS BOUGHT"]
[]
[null,"DEMAND DEPOSITS",null,null,"SAVINGS DEPOSITS"]
[null,null,null,null," ORDINARY"]
[null,"ANNOUNCED RATES (S)",null,"INTEREST EXPENSED ($000)","ANNOUNCED RATES (S)",null,"INTEREST EXPENSED ($000)"]
[null,"HIGHEST","LOWEST",null,"HIGHEST","LOWEST"]
[]
[null,"ACTUAL RATES ",null,null,"ACTUAL RATES "]
{"$rows_left_out":59}
{"sheet":"PG_27","index":23,"n_rows":62,"n_cols":7,"rows_kept":62,"cut":false,"hidden":false,"merged":[]}
[]
[null,"1B. INTEREST RATES ON FOREIGN CURRENCY DEPOSITS"]
[null,"AND INTER-BANK FUNDS BOUGHT   (CONT'D)"]
[]
[null,"TIME DEPOSITS",null,null,"TIME DEPOSITS "]
[null,"OVER 6 MONTHS - 12 MONTHS",null,null,"OVER 1 YEAR"]
[null,"ANNOUNCED RATES (S)",null,"INTEREST EXPENSED ($000)","ANNOUNCED RATES (S)",null,"INTEREST EXPENSED ($000)"]
[null,"HIGHEST","LOWEST",null,"HIGHEST","LOWEST"]
[]
[null,"ACTUAL RATES ",null,null,"ACTUAL RATES "]
{"$rows_left_out":53}
{"sheet":"PG_28","index":24,"n_rows":72,"n_cols":7,"rows_kept":72,"cut":false,"hidden":false,"merged":[]}
[]
[null,"2A. INTEREST RATES ON TT DOLLAR LOANS"]
[null,"AND INTER-BANK FUNDS SOLD"]
[]
[null,"OVERDRAFT LOANS",null,null,"DEMAND LOANS"]
[]
[null,"PRIME RATE",null,"INTEREST EARNED ($000)","PRIME RATE",null,"INTEREST EARNED ($000)"]
[]
[null,null,"ACTUAL LOAN RATES",null,null,"ACTUAL LOAN RATES"]
[null,"HIGHEST",null,"LOWEST","HIGHEST",null,"LOWEST"]
{"$rows_left_out":63}
{"sheet":"PG_29","index":25,"n_rows":66,"n_cols":7,"rows_kept":66,"cut":false,"hidden":false,"merged":[[57,3,57,5]]}
[]
[null,"2A. INTEREST RATES ON TT DOLLAR LOANS"]
[null,"AND INTER-BANK FUNDS SOLD   (CONT'D)"]
[]
[null,"BRIDGING FINANCE LOANS",null,null,"CREDIT CARD LOANS"]
[]
[null,"PRIME RATE",null,"INTEREST EARNED ($000)","PRIME RATE",null,"INTEREST EARNED ($000)"]
[]
[null,null,"ACTUAL LOAN RATES",null,null,"ACTUAL LOAN RATES"]
[null,"HIGHEST",null,"LOWEST","HIGHEST",null,"LOWEST"]
{"$rows_left_out":57}
{"sheet":"PG_30","index":26,"n_rows":72,"n_cols":7,"rows_kept":72,"cut":false,"hidden":false,"merged":[]}
[]
[null,"2B. INTEREST RATES ON FOREIGN CURRENCY"]
[null,"LOANS AND INTER-BANK FUNDS SOLD"]
[]
[null,"OVERDRAFT LOANS",null,null,"DEMAND LOANS"]
[]
[null,"PRIME RATE",null,"INTEREST EARNED ($000)","PRIME RATE",null,"INTEREST EARNED ($000)"]
[]
[null,null,"ACTUAL LOAN RATES",null,null,"ACTUAL LOAN RATES"]
[null,"HIGHEST",null,"LOWEST","HIGHEST",null,"LOWEST"]
{"$rows_left_out":63}
{"sheet":"PG_31","index":27,"n_rows":62,"n_cols":7,"rows_kept":62,"cut":false,"hidden":false,"merged":[]}
[]
[null,"2B. INTEREST RATES ON FOREIGN CURRENCY"]
[null,"LOANS AND INTER-BANK FUNDS SOLD   (CONT'D)"]
[]
[null,"BRIDGING FINANCE LOANS",null,null,"CREDIT CARD LOANS"]
[]
[null,"PRIME RATE",null,"INTEREST EARNED ($000)","PRIME RATE",null,"INTEREST EARNED ($000)"]
[]
[null,null,"ACTUAL LOAN RATES",null,null,"ACTUAL LOAN RATES"]
[null,"HIGHEST",null,"LOWEST","HIGHEST",null,"LOWEST"]
{"$rows_left_out":53}
{"sheet":"PG_32","index":28,"n_rows":31,"n_cols":4,"rows_kept":31,"cut":false,"hidden":false,"merged":[]}
[]
[]
[]
[]
[]
[null,"Name of Person Completing Form ",null,"Signature of Person Completing Form "]
[null,"(Block Letters)"]
[]
[]
[]
{"$rows_left_out":21}